{"text_format":"1","workbook":"xlsx","n_sheets":38,"sheets":["Ranking Sheet","Rank Wkst","Final Placement","Announcers Form","Point Summary","Team1","Team2","Team3","Team4","Team5","Team6","Team7","Team8","Team9","Team10","Team11","Team12","Team13","Team14","Team15","Team16","Team17","Team18","Team19","Team20","Team21","Team22","Team23","Team24","Tie-Breaker Sheet","Superior Judge Recap","Score Summary","Teams in Rank Order","State Prelims Announce","State Finals Announce","First and Lake State Finals","State Tie Announce","Judges Names"],"not_rendered":{"charts":0,"images":0,"macros":1,"external_links":0,"defined_names":61,"comments":1,"pivot_tables":0},"unopened":[],"bounds":{"document_bytes":16777216,"sheet_cells":100000,"rows_first":2000,"rows_last":500,"rows_between":2000,"halvings":0,"cell_chars":16384,"cell_head_chars":4096},"cells_cut":0,"cells_raw":0,"read":"whole","date_system":"1900"}

{"sheet":"Ranking Sheet","index":0,"n_rows":37,"n_cols":30,"rows_kept":37,"cut":false,"hidden":false,"merged":[[7,9,8,10],[12,1,12,2],[21,1,21,2],[22,1,22,2],[18,1,18,2],[9,7,9,8],[14,1,14,2],[15,1,15,2],[16,1,16,2],[17,1,17,2],[19,1,19,2],[9,9,9,10],[6,7,6,8],[6,3,6,4],[7,3,8,4],[25,1,25,2],[23,1,23,2],[11,1,11,2],[6,9,6,10],[9,5,9,6],[6,15,10,15],[7,13,8,14],[6,0,8,2],[1,0,1,1],[8,16,10,16],[7,5,8,6],[6,13,6,14],[9,13,9,14],[6,5,6,6],[6,11,6,12],[7,11,8,12],[7,7,8,8],[9,0,9,2],[9,3,9,4],[1,3,1,4],[3,0,3,20],[8,18,10,18],[1,5,1,14],[10,0,10,2],[8,17,10,17],[9,11,9,12],[1,18,1,20],[1,16,1,17],[6,16,6,19],[7,16,7,17],[6,20,7,20],[8,19,10,19],[8,20,10,20],[7,18,7,19],[4,0,4,20],[36,15,36,20],[13,1,13,2],[27,1,27,2],[28,1,28,2],[29,1,29,2],[31,1,31,2],[26,1,26,2],[32,1,32,2],[33,1,33,2],[34,1,34,2],[36,3,36,10],[30,1,30,2],[36,11,36,14],[20,1,20,2],[24,1,24,2],[36,0,36,2]]}
[]
["MEET DATE",null,null,"MEET SITE",null,null,null,null,null,null,null,null,null,null,null,"CLASS",null,null,"High Kick Category"]
[]
["Minnesota State High School League Dance Team Competition"]
["Judges Ranking Sheet - \"B\" RANK SYSTEM (5 or 6 judges)"]
[]
["Judges →",null,null,"Judge 1",null,"Judge 2",null,"Judge 3",null,"Judge 4",null,"Judge 5",null,"Judge 6",null,"Add Together the Ranks MINUS\n \n1 Worst Rank & 1 Best Rank","TIE BREAKERS",null,null,null,"Final\nPlace"]
[null,null,null,null,null,null,null,null,null,null,null,null,null,null,null,null,"1st Tie Break",null,"2nd Tie Break"]
[null,null,null,null,null,null,null,null,null,null,null,null,null,null,null,null,"Add in Worst & Best Ranks","New Total Rank","Add Points Minus High & Low Points","New Total Rank"]
["Judges Initials →"]
["School",null,null,"Points","Rank","Points","Rank","Points","Rank","Points","Rank","Points","Rank","Points","Rank",null,null,null,null,null,null,null,"Best Rank","Worst Rank",null,null,null,null,"Best Rank","Worst Rank"]
[1,null,null,{"$f":"'Rank Wkst'!C8","v":""},{"$f":"'Rank Wkst'!G8","v":""},{"$f":"'Rank Wkst'!H8","v":""},{"$f":"'Rank Wkst'!L8","v":""},{"$f":"'Rank Wkst'!M8","v":""},{"$f":"'Rank Wkst'!Q8","v":""},{"$f":"'Rank Wkst'!R8","v":""},{"$f":"'Rank Wkst'!V8","v":""},{"$f":"'Rank Wkst'!W8","v":""},{"$f":"'Rank Wkst'!AA8","v":""},{"$f":"'Rank Wkst'!AB8","v":""},{"$f":"'Rank Wkst'!AF8","v":""},{"$f":"'Rank Wkst'!AL8","v":""},{"$f":"IF(AND('Rank Wkst'!AP8>1, D12<>\"DQ\"), 'Rank Wkst'!AT8, \"\")","v":""},{"$f":"IF(AND('Rank Wkst'!AP8>1, D12<>\"DQ\"), 'Rank Wkst'!AY8, \"\")","v":""},{"$f":"IF(AND('Rank Wkst'!AW8>1, D12<>\"DQ\"), 'Rank Wkst'!BC8, \"\")","v":""},{"$f":"IF(AND('Rank Wkst'!AW8>1, D12<>\"DQ\"), 'Rank Wkst'!BH8, \"\")","v":""},{"$f":"IF('Rank Wkst'!AG8<>0, 'Rank Wkst'!BK8, \"\")","v":""},null,{"$f":"IF('Rank Wkst'!C8=\"DQ\", \"\", 'Rank Wkst'!AH8)","v":0},{"$f":"IF('Rank Wkst'!C8=\"DQ\", \"\", 'Rank Wkst'!AI8)","v":0},null,null,null,null,{"$f":"'Rank Wkst'!AH8","v":0},{"$f":"'Rank Wkst'!AI8","v":0}]
[2,null,null,{"$f":"'Rank Wkst'!C9","v":""},{"$f":"'Rank Wkst'!G9","v":""},{"$f":"'Rank Wkst'!H9","v":""},{"$f":"'Rank Wkst'!L9","v":""},{"$f":"'Rank Wkst'!M9","v":""},{"$f":"'Rank Wkst'!Q9","v":""},{"$f":"'Rank Wkst'!R9","v":""},{"$f":"'Rank Wkst'!V9","v":""},{"$f":"'Rank Wkst'!W9","v":""},{"$f":"'Rank Wkst'!AA9","v":""},{"$f":"'Rank Wkst'!AB9","v":""},{"$f":"'Rank Wkst'!AF9","v":""},{"$f":"'Rank Wkst'!AL9","v":""},{"$f":"IF(AND('Rank Wkst'!AP9>1, D13<>\"DQ\"), 'Rank Wkst'!AT9, \"\")","v":""},{"$f":"IF(AND('Rank Wkst'!AP9>1, D13<>\"DQ\"), 'Rank Wkst'!AY9, \"\")","v":""},{"$f":"IF(AND('Rank Wkst'!AW9>1, D13<>\"DQ\"), 'Rank Wkst'!BC9, \"\")","v":""},{"$f":"IF(AND('Rank Wkst'!AW9>1, D13<>\"DQ\"), 'Rank Wkst'!BH9, \"\")","v":""},{"$f":"IF('Rank Wkst'!AG9<>0, 'Rank Wkst'!BK9, \"\")","v":""},null,{"$f":"IF('Rank Wkst'!C9=\"DQ\", \"\", 'Rank Wkst'!AH9)","v":0},{"$f":"IF('Rank Wkst'!C9=\"DQ\", \"\", 'Rank Wkst'!AI9)","v":0},null,null,null,null,{"$f":"'Rank Wkst'!AH9","v":0},{"$f":"'Rank Wkst'!AI9","v":0}]
[3,null,null,{"$f":"'Rank Wkst'!C10","v":""},{"$f":"'Rank Wkst'!G10","v":""},{"$f":"'Rank Wkst'!H10","v":""},{"$f":"'Rank Wkst'!L10","v":""},{"$f":"'Rank Wkst'!M10","v":""},{"$f":"'Rank Wkst'!Q10","v":""},{"$f":"'Rank Wkst'!R10","v":""},{"$f":"'Rank Wkst'!V10","v":""},{"$f":"'Rank Wkst'!W10","v":""},{"$f":"'Rank Wkst'!AA10","v":""},{"$f":"'Rank Wkst'!AB10","v":""},{"$f":"'Rank Wkst'!AF10","v":""},{"$f":"'Rank Wkst'!AL10","v":""},{"$f":"IF(AND('Rank Wkst'!AP10>1, D14<>\"DQ\"), 'Rank Wkst'!AT10, \"\")","v":""},{"$f":"IF(AND('Rank Wkst'!AP10>1, D14<>\"DQ\"), 'Rank Wkst'!AY10, \"\")","v":""},{"$f":"IF(AND('Rank Wkst'!AW10>1, D14<>\"DQ\"), 'Rank Wkst'!BC10, \"\")","v":""},{"$f":"IF(AND('Rank Wkst'!AW10>1, D14<>\"DQ\"), 'Rank Wkst'!BH10, \"\")","v":""},{"$f":"IF('Rank Wkst'!AG10<>0, 'Rank Wkst'!BK10, \"\")","v":""},null,{"$f":"IF('Rank Wkst'!C10=\"DQ\", \"\", 'Rank Wkst'!AH10)","v":0},{"$f":"IF('Rank Wkst'!C10=\"DQ\", \"\", 'Rank Wkst'!AI10)","v":0},null,null,null,null,{"$f":"'Rank Wkst'!AH10","v":0},{"$f":"'Rank Wkst'!AI10","v":0}]
[4,null,null,{"$f":"'Rank Wkst'!C11","v":""},{"$f":"'Rank Wkst'!G11","v":""},{"$f":"'Rank Wkst'!H11","v":""},{"$f":"'Rank Wkst'!L11","v":""},{"$f":"'Rank Wkst'!M11","v":""},{"$f":"'Rank Wkst'!Q11","v":""},{"$f":"'Rank Wkst'!R11","v":""},{"$f":"'Rank Wkst'!V11","v":""},{"$f":"'Rank Wkst'!W11","v":""},{"$f":"'Rank Wkst'!AA11","v":""},{"$f":"'Rank Wkst'!AB11","v":""},{"$f":"'Rank Wkst'!AF11","v":""},{"$f":"'Rank Wkst'!AL11","v":""},{"$f":"IF(AND('Rank Wkst'!AP11>1, D15<>\"DQ\"), 'Rank Wkst'!AT11, \"\")","v":""},{"$f":"IF(AND('Rank Wkst'!AP11>1, D15<>\"DQ\"), 'Rank Wkst'!AY11, \"\")","v":""},{"$f":"IF(AND('Rank Wkst'!AW11>1, D15<>\"DQ\"), 'Rank Wkst'!BC11, \"\")","v":""},{"$f":"IF(AND('Rank Wkst'!AW11>1, D15<>\"DQ\"), 'Rank Wkst'!BH11, \"\")","v":""},{"$f":"IF('Rank Wkst'!AG11<>0, 'Rank Wkst'!BK11, \"\")","v":""},null,{"$f":"IF('Rank Wkst'!C11=\"DQ\", \"\", 'Rank Wkst'!AH11)","v":0},{"$f":"IF('Rank Wkst'!C11=\"DQ\", \"\", 'Rank Wkst'!AI11)","v":0},null,null,null,null,{"$f":"'Rank Wkst'!AH11","v":0},{"$f":"'Rank Wkst'!AI11","v":0}]
[5,null,null,{"$f":"'Rank Wkst'!C12","v":""},{"$f":"'Rank Wkst'!G12","v":""},{"$f":"'Rank Wkst'!H12","v":""},{"$f":"'Rank Wkst'!L12","v":""},{"$f":"'Rank Wkst'!M12","v":""},{"$f":"'Rank Wkst'!Q12","v":""},{"$f":"'Rank Wkst'!R12","v":""},{"$f":"'Rank Wkst'!V12","v":""},{"$f":"'Rank Wkst'!W12","v":""},{"$f":"'Rank Wkst'!AA12","v":""},{"$f":"'Rank Wkst'!AB12","v":""},{"$f":"'Rank Wkst'!AF12","v":""},{"$f":"'Rank Wkst'!AL12","v":""},{"$f":"IF(AND('Rank Wkst'!AP12>1, D16<>\"DQ\"), 'Rank Wkst'!AT12, \"\")","v":""},{"$f":"IF(AND('Rank Wkst'!AP12>1, D16<>\"DQ\"), 'Rank Wkst'!AY12, \"\")","v":""},{"$f":"IF(AND('Rank Wkst'!AW12>1, D16<>\"DQ\"), 'Rank Wkst'!BC12, \"\")","v":""},{"$f":"IF(AND('Rank Wkst'!AW12>1, D16<>\"DQ\"), 'Rank Wkst'!BH12, \"\")","v":""},{"$f":"IF('Rank Wkst'!AG12<>0, 'Rank Wkst'!BK12, \"\")","v":""},null,{"$f":"IF('Rank Wkst'!C12=\"DQ\", \"\", 'Rank Wkst'!AH12)","v":0},{"$f":"IF('Rank Wkst'!C12=\"DQ\", \"\", 'Rank Wkst'!AI12)","v":0},null,null,null,null,{"$f":"'Rank Wkst'!AH12","v":0},{"$f":"'Rank Wkst'!AI12","v":0}]
[6,null,null,{"$f":"'Rank Wkst'!C13","v":""},{"$f":"'Rank Wkst'!G13","v":""},{"$f":"'Rank Wkst'!H13","v":""},{"$f":"'Rank Wkst'!L13","v":""},{"$f":"'Rank Wkst'!M13","v":""},{"$f":"'Rank Wkst'!Q13","v":""},{"$f":"'Rank Wkst'!R13","v":""},{"$f":"'Rank Wkst'!V13","v":""},{"$f":"'Rank Wkst'!W13","v":""},{"$f":"'Rank Wkst'!AA13","v":""},{"$f":"'Rank Wkst'!AB13","v":""},{"$f":"'Rank Wkst'!AF13","v":""},{"$f":"'Rank Wkst'!AL13","v":""},{"$f":"IF(AND('Rank Wkst'!AP13>1, D17<>\"DQ\"), 'Rank Wkst'!AT13, \"\")","v":""},{"$f":"IF(AND('Rank Wkst'!AP13>1, D17<>\"DQ\"), 'Rank Wkst'!AY13, \"\")","v":""},{"$f":"IF(AND('Rank Wkst'!AW13>1, D17<>\"DQ\"), 'Rank Wkst'!BC13, \"\")","v":""},{"$f":"IF(AND('Rank Wkst'!AW13>1, D17<>\"DQ\"), 'Rank Wkst'!BH13, \"\")","v":""},{"$f":"IF('Rank Wkst'!AG13<>0, 'Rank Wkst'!BK13, \"\")","v":""},null,{"$f":"IF('Rank Wkst'!C13=\"DQ\", \"\", 'Rank Wkst'!AH13)","v":0},{"$f":"IF('Rank Wkst'!C13=\"DQ\", \"\", 'Rank Wkst'!AI13)","v":0},null,null,null,null,{"$f":"'Rank Wkst'!AH13","v":0},{"$f":"'Rank Wkst'!AI13","v":0}]
[7,null,null,{"$f":"'Rank Wkst'!C14","v":""},{"$f":"'Rank Wkst'!G14","v":""},{"$f":"'Rank Wkst'!H14","v":""},{"$f":"'Rank Wkst'!L14","v":""},{"$f":"'Rank Wkst'!M14","v":""},{"$f":"'Rank Wkst'!Q14","v":""},{"$f":"'Rank Wkst'!R14","v":""},{"$f":"'Rank Wkst'!V14","v":""},{"$f":"'Rank Wkst'!W14","v":""},{"$f":"'Rank Wkst'!AA14","v":""},{"$f":"'Rank Wkst'!AB14","v":""},{"$f":"'Rank Wkst'!AF14","v":""},{"$f":"'Rank Wkst'!AL14","v":""},{"$f":"IF(AND('Rank Wkst'!AP14>1, D18<>\"DQ\"), 'Rank Wkst'!AT14, \"\")","v":""},{"$f":"IF(AND('Rank Wkst'!AP14>1, D18<>\"DQ\"), 'Rank Wkst'!AY14, \"\")","v":""},{"$f":"IF(AND('Rank Wkst'!AW14>1, D18<>\"DQ\"), 'Rank Wkst'!BC14, \"\")","v":""},{"$f":"IF(AND('Rank Wkst'!AW14>1, D18<>\"DQ\"), 'Rank Wkst'!BH14, \"\")","v":""},{"$f":"IF('Rank Wkst'!AG14<>0, 'Rank Wkst'!BK14, \"\")","v":""},null,{"$f":"IF('Rank Wkst'!C14=\"DQ\", \"\", 'Rank Wkst'!AH14)","v":0},{"$f":"IF('Rank Wkst'!C14=\"DQ\", \"\", 'Rank Wkst'!AI14)","v":0},null,null,null,null,{"$f":"'Rank Wkst'!AH14","v":0},{"$f":"'Rank Wkst'!AI14","v":0}]
[8,null,null,{"$f":"'Rank Wkst'!C15","v":""},{"$f":"'Rank Wkst'!G15","v":""},{"$f":"'Rank Wkst'!H15","v":""},{"$f":"'Rank Wkst'!L15","v":""},{"$f":"'Rank Wkst'!M15","v":""},{"$f":"'Rank Wkst'!Q15","v":""},{"$f":"'Rank Wkst'!R15","v":""},{"$f":"'Rank Wkst'!V15","v":""},{"$f":"'Rank Wkst'!W15","v":""},{"$f":"'Rank Wkst'!AA15","v":""},{"$f":"'Rank Wkst'!AB15","v":""},{"$f":"'Rank Wkst'!AF15","v":""},{"$f":"'Rank Wkst'!AL15","v":""},{"$f":"IF(AND('Rank Wkst'!AP15>1, D19<>\"DQ\"), 'Rank Wkst'!AT15, \"\")","v":""},{"$f":"IF(AND('Rank Wkst'!AP15>1, D19<>\"DQ\"), 'Rank Wkst'!AY15, \"\")","v":""},{"$f":"IF(AND('Rank Wkst'!AW15>1, D19<>\"DQ\"), 'Rank Wkst'!BC15, \"\")","v":""},{"$f":"IF(AND('Rank Wkst'!AW15>1, D19<>\"DQ\"), 'Rank Wkst'!BH15, \"\")","v":""},{"$f":"IF('Rank Wkst'!AG15<>0, 'Rank Wkst'!BK15, \"\")","v":""},null,{"$f":"IF('Rank Wkst'!C15=\"DQ\", \"\", 'Rank Wkst'!AH15)","v":0},{"$f":"IF('Rank Wkst'!C15=\"DQ\", \"\", 'Rank Wkst'!AI15)","v":0},null,null,null,null,{"$f":"'Rank Wkst'!AH15","v":0},{"$f":"'Rank Wkst'!AI15","v":0}]
[9,null,null,{"$f":"'Rank Wkst'!C16","v":""},{"$f":"'Rank Wkst'!G16","v":""},{"$f":"'Rank Wkst'!H16","v":""},{"$f":"'Rank Wkst'!L16","v":""},{"$f":"'Rank Wkst'!M16","v":""},{"$f":"'Rank Wkst'!Q16","v":""},{"$f":"'Rank Wkst'!R16","v":""},{"$f":"'Rank Wkst'!V16","v":""},{"$f":"'Rank Wkst'!W16","v":""},{"$f":"'Rank Wkst'!AA16","v":""},{"$f":"'Rank Wkst'!AB16","v":""},{"$f":"'Rank Wkst'!AF16","v":""},{"$f":"'Rank Wkst'!AL16","v":""},{"$f":"IF(AND('Rank Wkst'!AP16>1, D20<>\"DQ\"), 'Rank Wkst'!AT16, \"\")","v":""},{"$f":"IF(AND('Rank Wkst'!AP16>1, D20<>\"DQ\"), 'Rank Wkst'!AY16, \"\")","v":""},{"$f":"IF(AND('Rank Wkst'!AW16>1, D20<>\"DQ\"), 'Rank Wkst'!BC16, \"\")","v":""},{"$f":"IF(AND('Rank Wkst'!AW16>1, D20<>\"DQ\"), 'Rank Wkst'!BH16, \"\")","v":""},{"$f":"IF('Rank Wkst'!AG16<>0, 'Rank Wkst'!BK16, \"\")","v":""},null,{"$f":"IF('Rank Wkst'!C16=\"DQ\", \"\", 'Rank Wkst'!AH16)","v":0},{"$f":"IF('Rank Wkst'!C16=\"DQ\", \"\", 'Rank Wkst'!AI16)","v":0},null,null,null,null,{"$f":"'Rank Wkst'!AH16","v":0},{"$f":"'Rank Wkst'!AI16","v":0}]
[10,null,null,{"$f":"'Rank Wkst'!C17","v":""},{"$f":"'Rank Wkst'!G17","v":""},{"$f":"'Rank Wkst'!H17","v":""},{"$f":"'Rank Wkst'!L17","v":""},{"$f":"'Rank Wkst'!M17","v":""},{"$f":"'Rank Wkst'!Q17","v":""},{"$f":"'Rank Wkst'!R17","v":""},{"$f":"'Rank Wkst'!V17","v":""},{"$f":"'Rank Wkst'!W17","v":""},{"$f":"'Rank Wkst'!AA17","v":""},{"$f":"'Rank Wkst'!AB17","v":""},{"$f":"'Rank Wkst'!AF17","v":""},{"$f":"'Rank Wkst'!AL17","v":""},{"$f":"IF(AND('Rank Wkst'!AP17>1, D21<>\"DQ\"), 'Rank Wkst'!AT17, \"\")","v":""},{"$f":"IF(AND('Rank Wkst'!AP17>1, D21<>\"DQ\"), 'Rank Wkst'!AY17, \"\")","v":""},{"$f":"IF(AND('Rank Wkst'!AW17>1, D21<>\"DQ\"), 'Rank Wkst'!BC17, \"\")","v":""},{"$f":"IF(AND('Rank Wkst'!AW17>1, D21<>\"DQ\"), 'Rank Wkst'!BH17, \"\")","v":""},{"$f":"IF('Rank Wkst'!AG17<>0, 'Rank Wkst'!BK17, \"\")","v":""},null,{"$f":"IF('Rank Wkst'!C17=\"DQ\", \"\", 'Rank Wkst'!AH17)","v":0},{"$f":"IF('Rank Wkst'!C17=\"DQ\", \"\", 'Rank Wkst'!AI17)","v":0},null,null,null,null,{"$f":"'Rank Wkst'!AH17","v":0},{"$f":"'Rank Wkst'!AI17","v":0}]
[11,null,null,{"$f":"'Rank Wkst'!C18","v":""},{"$f":"'Rank Wkst'!G18","v":""},{"$f":"'Rank Wkst'!H18","v":""},{"$f":"'Rank Wkst'!L18","v":""},{"$f":"'Rank Wkst'!M18","v":""},{"$f":"'Rank Wkst'!Q18","v":""},{"$f":"'Rank Wkst'!R18","v":""},{"$f":"'Rank Wkst'!V18","v":""},{"$f":"'Rank Wkst'!W18","v":""},{"$f":"'Rank Wkst'!AA18","v":""},{"$f":"'Rank Wkst'!AB18","v":""},{"$f":"'Rank Wkst'!AF18","v":""},{"$f":"'Rank Wkst'!AL18","v":""},{"$f":"IF(AND('Rank Wkst'!AP18>1, D22<>\"DQ\"), 'Rank Wkst'!AT18, \"\")","v":""},{"$f":"IF(AND('Rank Wkst'!AP18>1, D22<>\"DQ\"), 'Rank Wkst'!AY18, \"\")","v":""},{"$f":"IF(AND('Rank Wkst'!AW18>1, D22<>\"DQ\"), 'Rank Wkst'!BC18, \"\")","v":""},{"$f":"IF(AND('Rank Wkst'!AW18>1, D22<>\"DQ\"), 'Rank Wkst'!BH18, \"\")","v":""},{"$f":"IF('Rank Wkst'!AG18<>0, 'Rank Wkst'!BK18, \"\")","v":""},null,{"$f":"IF('Rank Wkst'!C18=\"DQ\", \"\", 'Rank Wkst'!AH18)","v":0},{"$f":"IF('Rank Wkst'!C18=\"DQ\", \"\", 'Rank Wkst'!AI18)","v":0},null,null,null,null,{"$f":"'Rank Wkst'!AH18","v":0},{"$f":"'Rank Wkst'!AI18","v":0}]
[12,null,null,{"$f":"'Rank Wkst'!C19","v":""},{"$f":"'Rank Wkst'!G19","v":""},{"$f":"'Rank Wkst'!H19","v":""},{"$f":"'Rank Wkst'!L19","v":""},{"$f":"'Rank Wkst'!M19","v":""},{"$f":"'Rank Wkst'!Q19","v":""},{"$f":"'Rank Wkst'!R19","v":""},{"$f":"'Rank Wkst'!V19","v":""},{"$f":"'Rank Wkst'!W19","v":""},{"$f":"'Rank Wkst'!AA19","v":""},{"$f":"'Rank Wkst'!AB19","v":""},{"$f":"'Rank Wkst'!AF19","v":""},{"$f":"'Rank Wkst'!AL19","v":""},{"$f":"IF(AND('Rank Wkst'!AP19>1, D23<>\"DQ\"), 'Rank Wkst'!AT19, \"\")","v":""},{"$f":"IF(AND('Rank Wkst'!AP19>1, D23<>\"DQ\"), 'Rank Wkst'!AY19, \"\")","v":""},{"$f":"IF(AND('Rank Wkst'!AW19>1, D23<>\"DQ\"), 'Rank Wkst'!BC19, \"\")","v":""},{"$f":"IF(AND('Rank Wkst'!AW19>1, D23<>\"DQ\"), 'Rank Wkst'!BH19, \"\")","v":""},{"$f":"IF('Rank Wkst'!AG19<>0, 'Rank Wkst'!BK19, \"\")","v":""},null,{"$f":"IF('Rank Wkst'!C19=\"DQ\", \"\", 'Rank Wkst'!AH19)","v":0},{"$f":"IF('Rank Wkst'!C19=\"DQ\", \"\", 'Rank Wkst'!AI19)","v":0},null,null,null,null,{"$f":"'Rank Wkst'!AH19","v":0},{"$f":"'Rank Wkst'!AI19","v":0}]
[13,null,null,{"$f":"'Rank Wkst'!C20","v":""},{"$f":"'Rank Wkst'!G20","v":""},{"$f":"'Rank Wkst'!H20","v":""},{"$f":"'Rank Wkst'!L20","v":""},{"$f":"'Rank Wkst'!M20","v":""},{"$f":"'Rank Wkst'!Q20","v":""},{"$f":"'Rank Wkst'!R20","v":""},{"$f":"'Rank Wkst'!V20","v":""},{"$f":"'Rank Wkst'!W20","v":""},{"$f":"'Rank Wkst'!AA20","v":""},{"$f":"'Rank Wkst'!AB20","v":""},{"$f":"'Rank Wkst'!AF20","v":""},{"$f":"'Rank Wkst'!AL20","v":""},{"$f":"IF(AND('Rank Wkst'!AP20>1, D24<>\"DQ\"), 'Rank Wkst'!AT20, \"\")","v":""},{"$f":"IF(AND('Rank Wkst'!AP20>1, D24<>\"DQ\"), 'Rank Wkst'!AY20, \"\")","v":""},{"$f":"IF(AND('Rank Wkst'!AW20>1, D24<>\"DQ\"), 'Rank Wkst'!BC20, \"\")","v":""},{"$f":"IF(AND('Rank Wkst'!AW20>1, D24<>\"DQ\"), 'Rank Wkst'!BH20, \"\")","v":""},{"$f":"IF('Rank Wkst'!AG20<>0, 'Rank Wkst'!BK20, \"\")","v":""},null,{"$f":"IF('Rank Wkst'!C20=\"DQ\", \"\", 'Rank Wkst'!AH20)","v":0},{"$f":"IF('Rank Wkst'!C20=\"DQ\", \"\", 'Rank Wkst'!AI20)","v":0},null,null,null,null,{"$f":"'Rank Wkst'!AH20","v":0},{"$f":"'Rank Wkst'!AI20","v":0}]
[14,null,null,{"$f":"'Rank Wkst'!C21","v":""},{"$f":"'Rank Wkst'!G21","v":""},{"$f":"'Rank Wkst'!H21","v":""},{"$f":"'Rank Wkst'!L21","v":""},{"$f":"'Rank Wkst'!M21","v":""},{"$f":"'Rank Wkst'!Q21","v":""},{"$f":"'Rank Wkst'!R21","v":""},{"$f":"'Rank Wkst'!V21","v":""},{"$f":"'Rank Wkst'!W21","v":""},{"$f":"'Rank Wkst'!AA21","v":""},{"$f":"'Rank Wkst'!AB21","v":""},{"$f":"'Rank Wkst'!AF21","v":""},{"$f":"'Rank Wkst'!AL21","v":""},{"$f":"IF(AND('Rank Wkst'!AP21>1, D25<>\"DQ\"), 'Rank Wkst'!AT21, \"\")","v":""},{"$f":"IF(AND('Rank Wkst'!AP21>1, D25<>\"DQ\"), 'Rank Wkst'!AY21, \"\")","v":""},{"$f":"IF(AND('Rank Wkst'!AW21>1, D25<>\"DQ\"), 'Rank Wkst'!BC21, \"\")","v":""},{"$f":"IF(AND('Rank Wkst'!AW21>1, D25<>\"DQ\"), 'Rank Wkst'!BH21, \"\")","v":""},{"$f":"IF('Rank Wkst'!AG21<>0, 'Rank Wkst'!BK21, \"\")","v":""},null,{"$f":"IF('Rank Wkst'!C21=\"DQ\", \"\", 'Rank Wkst'!AH21)","v":0},{"$f":"IF('Rank Wkst'!C21=\"DQ\", \"\", 'Rank Wkst'!AI21)","v":0},null,null,null,null,{"$f":"'Rank Wkst'!AH21","v":0},{"$f":"'Rank Wkst'!AI21","v":0}]
[15,null,null,{"$f":"'Rank Wkst'!C22","v":""},{"$f":"'Rank Wkst'!G22","v":""},{"$f":"'Rank Wkst'!H22","v":""},{"$f":"'Rank Wkst'!L22","v":""},{"$f":"'Rank Wkst'!M22","v":""},{"$f":"'Rank Wkst'!Q22","v":""},{"$f":"'Rank Wkst'!R22","v":""},{"$f":"'Rank Wkst'!V22","v":""},{"$f":"'Rank Wkst'!W22","v":""},{"$f":"'Rank Wkst'!AA22","v":""},{"$f":"'Rank Wkst'!AB22","v":""},{"$f":"'Rank Wkst'!AF22","v":""},{"$f":"'Rank Wkst'!AL22","v":""},{"$f":"IF(AND('Rank Wkst'!AP22>1, D26<>\"DQ\"), 'Rank Wkst'!AT22, \"\")","v":""},{"$f":"IF(AND('Rank Wkst'!AP22>1, D26<>\"DQ\"), 'Rank Wkst'!AY22, \"\")","v":""},{"$f":"IF(AND('Rank Wkst'!AW22>1, D26<>\"DQ\"), 'Rank Wkst'!BC22, \"\")","v":""},{"$f":"IF(AND('Rank Wkst'!AW22>1, D26<>\"DQ\"), 'Rank Wkst'!BH22, \"\")","v":""},{"$f":"IF('Rank Wkst'!AG22<>0, 'Rank Wkst'!BK22, \"\")","v":""},null,{"$f":"IF('Rank Wkst'!C22=\"DQ\", \"\", 'Rank Wkst'!AH22)","v":0},{"$f":"IF('Rank Wkst'!C22=\"DQ\", \"\", 'Rank Wkst'!AI22)","v":0},null,null,null,null,{"$f":"'Rank Wkst'!AH22","v":0},{"$f":"'Rank Wkst'!AI22","v":0}]
[16,null,null,{"$f":"'Rank Wkst'!C23","v":""},{"$f":"'Rank Wkst'!G23","v":""},{"$f":"'Rank Wkst'!H23","v":""},{"$f":"'Rank Wkst'!L23","v":""},{"$f":"'Rank Wkst'!M23","v":""},{"$f":"'Rank Wkst'!Q23","v":""},{"$f":"'Rank Wkst'!R23","v":""},{"$f":"'Rank Wkst'!V23","v":""},{"$f":"'Rank Wkst'!W23","v":""},{"$f":"'Rank Wkst'!AA23","v":""},{"$f":"'Rank Wkst'!AB23","v":""},{"$f":"'Rank Wkst'!AF23","v":""},{"$f":"'Rank Wkst'!AL23","v":""},{"$f":"IF(AND('Rank Wkst'!AP23>1, D27<>\"DQ\"), 'Rank Wkst'!AT23, \"\")","v":""},{"$f":"IF(AND('Rank Wkst'!AP23>1, D27<>\"DQ\"), 'Rank Wkst'!AY23, \"\")","v":""},{"$f":"IF(AND('Rank Wkst'!AW23>1, D27<>\"DQ\"), 'Rank Wkst'!BC23, \"\")","v":""},{"$f":"IF(AND('Rank Wkst'!AW23>1, D27<>\"DQ\"), 'Rank Wkst'!BH23, \"\")","v":""},{"$f":"IF('Rank Wkst'!AG23<>0, 'Rank Wkst'!BK23, \"\")","v":""},null,{"$f":"IF('Rank Wkst'!C23=\"DQ\", \"\", 'Rank Wkst'!AH23)","v":0},{"$f":"IF('Rank Wkst'!C23=\"DQ\", \"\", 'Rank Wkst'!AI23)","v":0},null,null,null,null,{"$f":"'Rank Wkst'!AH23","v":0},{"$f":"'Rank Wkst'!AI23","v":0}]
[17,null,null,{"$f":"'Rank Wkst'!C24","v":""},{"$f":"'Rank Wkst'!G24","v":""},{"$f":"'Rank Wkst'!H24","v":""},{"$f":"'Rank Wkst'!L24","v":""},{"$f":"'Rank Wkst'!M24","v":""},{"$f":"'Rank Wkst'!Q24","v":""},{"$f":"'Rank Wkst'!R24","v":""},{"$f":"'Rank Wkst'!V24","v":""},{"$f":"'Rank Wkst'!W24","v":""},{"$f":"'Rank Wkst'!AA24","v":""},{"$f":"'Rank Wkst'!AB24","v":""},{"$f":"'Rank Wkst'!AF24","v":""},{"$f":"'Rank Wkst'!AL24","v":""},{"$f":"IF(AND('Rank Wkst'!AP24>1, D28<>\"DQ\"), 'Rank Wkst'!AT24, \"\")","v":""},{"$f":"IF(AND('Rank Wkst'!AP24>1, D28<>\"DQ\"), 'Rank Wkst'!AY24, \"\")","v":""},{"$f":"IF(AND('Rank Wkst'!AW24>1, D28<>\"DQ\"), 'Rank Wkst'!BC24, \"\")","v":""},{"$f":"IF(AND('Rank Wkst'!AW24>1, D28<>\"DQ\"), 'Rank Wkst'!BH24, \"\")","v":""},{"$f":"IF('Rank Wkst'!AG24<>0, 'Rank Wkst'!BK24, \"\")","v":""},null,{"$f":"IF('Rank Wkst'!C24=\"DQ\", \"\", 'Rank Wkst'!AH24)","v":0},{"$f":"IF('Rank Wkst'!C24=\"DQ\", \"\", 'Rank Wkst'!AI24)","v":0},null,null,null,null,{"$f":"'Rank Wkst'!AH24","v":0},{"$f":"'Rank Wkst'!AI24","v":0}]
[18,null,null,{"$f":"'Rank Wkst'!C25","v":""},{"$f":"'Rank Wkst'!G25","v":""},{"$f":"'Rank Wkst'!H25","v":""},{"$f":"'Rank Wkst'!L25","v":""},{"$f":"'Rank Wkst'!M25","v":""},{"$f":"'Rank Wkst'!Q25","v":""},{"$f":"'Rank Wkst'!R25","v":""},{"$f":"'Rank Wkst'!V25","v":""},{"$f":"'Rank Wkst'!W25","v":""},{"$f":"'Rank Wkst'!AA25","v":""},{"$f":"'Rank Wkst'!AB25","v":""},{"$f":"'Rank Wkst'!AF25","v":""},{"$f":"'Rank Wkst'!AL25","v":""},{"$f":"IF(AND('Rank Wkst'!AP25>1, D29<>\"DQ\"), 'Rank Wkst'!AT25, \"\")","v":""},{"$f":"IF(AND('Rank Wkst'!AP25>1, D29<>\"DQ\"), 'Rank Wkst'!AY25, \"\")","v":""},{"$f":"IF(AND('Rank Wkst'!AW25>1, D29<>\"DQ\"), 'Rank Wkst'!BC25, \"\")","v":""},{"$f":"IF(AND('Rank Wkst'!AW25>1, D29<>\"DQ\"), 'Rank Wkst'!BH25, \"\")","v":""},{"$f":"IF('Rank Wkst'!AG25<>0, 'Rank Wkst'!BK25, \"\")","v":""},null,{"$f":"IF('Rank Wkst'!C25=\"DQ\", \"\", 'Rank Wkst'!AH25)","v":0},{"$f":"IF('Rank Wkst'!C25=\"DQ\", \"\", 'Rank Wkst'!AI25)","v":0},null,null,null,null,{"$f":"'Rank Wkst'!AH25","v":0},{"$f":"'Rank Wkst'!AI25","v":0}]
[19,null,null,{"$f":"'Rank Wkst'!C26","v":""},{"$f":"'Rank Wkst'!G26","v":""},{"$f":"'Rank Wkst'!H26","v":""},{"$f":"'Rank Wkst'!L26","v":""},{"$f":"'Rank Wkst'!M26","v":""},{"$f":"'Rank Wkst'!Q26","v":""},{"$f":"'Rank Wkst'!R26","v":""},{"$f":"'Rank Wkst'!V26","v":""},{"$f":"'Rank Wkst'!W26","v":""},{"$f":"'Rank Wkst'!AA26","v":""},{"$f":"'Rank Wkst'!AB26","v":""},{"$f":"'Rank Wkst'!AF26","v":""},{"$f":"'Rank Wkst'!AL26","v":""},{"$f":"IF(AND('Rank Wkst'!AP26>1, D30<>\"DQ\"), 'Rank Wkst'!AT26, \"\")","v":""},{"$f":"IF(AND('Rank Wkst'!AP26>1, D30<>\"DQ\"), 'Rank Wkst'!AY26, \"\")","v":""},{"$f":"IF(AND('Rank Wkst'!AW26>1, D30<>\"DQ\"), 'Rank Wkst'!BC26, \"\")","v":""},{"$f":"IF(AND('Rank Wkst'!AW26>1, D30<>\"DQ\"), 'Rank Wkst'!BH26, \"\")","v":""},{"$f":"IF('Rank Wkst'!AG26<>0, 'Rank Wkst'!BK26, \"\")","v":""},null,{"$f":"IF('Rank Wkst'!C26=\"DQ\", \"\", 'Rank Wkst'!AH26)","v":0},{"$f":"IF('Rank Wkst'!C26=\"DQ\", \"\", 'Rank Wkst'!AI26)","v":0},null,null,null,null,{"$f":"'Rank Wkst'!AH26","v":0},{"$f":"'Rank Wkst'!AI26","v":0}]
[20,null,null,{"$f":"'Rank Wkst'!C27","v":""},{"$f":"'Rank Wkst'!G27","v":""},{"$f":"'Rank Wkst'!H27","v":""},{"$f":"'Rank Wkst'!L27","v":""},{"$f":"'Rank Wkst'!M27","v":""},{"$f":"'Rank Wkst'!Q27","v":""},{"$f":"'Rank Wkst'!R27","v":""},{"$f":"'Rank Wkst'!V27","v":""},{"$f":"'Rank Wkst'!W27","v":""},{"$f":"'Rank Wkst'!AA27","v":""},{"$f":"'Rank Wkst'!AB27","v":""},{"$f":"'Rank Wkst'!AF27","v":""},{"$f":"'Rank Wkst'!AL27","v":""},{"$f":"IF(AND('Rank Wkst'!AP27>1, D31<>\"DQ\"), 'Rank Wkst'!AT27, \"\")","v":""},{"$f":"IF(AND('Rank Wkst'!AP27>1, D31<>\"DQ\"), 'Rank Wkst'!AY27, \"\")","v":""},{"$f":"IF(AND('Rank Wkst'!AW27>1, D31<>\"DQ\"), 'Rank Wkst'!BC27, \"\")","v":""},{"$f":"IF(AND('Rank Wkst'!AW27>1, D31<>\"DQ\"), 'Rank Wkst'!BH27, \"\")","v":""},{"$f":"IF('Rank Wkst'!AG27<>0, 'Rank Wkst'!BK27, \"\")","v":""},null,{"$f":"IF('Rank Wkst'!C27=\"DQ\", \"\", 'Rank Wkst'!AH27)","v":0},{"$f":"IF('Rank Wkst'!C27=\"DQ\", \"\", 'Rank Wkst'!AI27)","v":0},null,null,null,null,{"$f":"'Rank Wkst'!AH27","v":0},{"$f":"'Rank Wkst'!AI27","v":0}]
[21,null,null,{"$f":"'Rank Wkst'!C28","v":""},{"$f":"'Rank Wkst'!G28","v":""},{"$f":"'Rank Wkst'!H28","v":""},{"$f":"'Rank Wkst'!L28","v":""},{"$f":"'Rank Wkst'!M28","v":""},{"$f":"'Rank Wkst'!Q28","v":""},{"$f":"'Rank Wkst'!R28","v":""},{"$f":"'Rank Wkst'!V28","v":""},{"$f":"'Rank Wkst'!W28","v":""},{"$f":"'Rank Wkst'!AA28","v":""},{"$f":"'Rank Wkst'!AB28","v":""},{"$f":"'Rank Wkst'!AF28","v":""},{"$f":"'Rank Wkst'!AL28","v":""},{"$f":"IF(AND('Rank Wkst'!AP28>1, D32<>\"DQ\"), 'Rank Wkst'!AT28, \"\")","v":""},{"$f":"IF(AND('Rank Wkst'!AP28>1, D32<>\"DQ\"), 'Rank Wkst'!AY28, \"\")","v":""},{"$f":"IF(AND('Rank Wkst'!AW28>1, D32<>\"DQ\"), 'Rank Wkst'!BC28, \"\")","v":""},{"$f":"IF(AND('Rank Wkst'!AW28>1, D32<>\"DQ\"), 'Rank Wkst'!BH28, \"\")","v":""},{"$f":"IF('Rank Wkst'!AG28<>0, 'Rank Wkst'!BK28, \"\")","v":""},null,{"$f":"IF('Rank Wkst'!C28=\"DQ\", \"\", 'Rank Wkst'!AH28)","v":0},{"$f":"IF('Rank Wkst'!C28=\"DQ\", \"\", 'Rank Wkst'!AI28)","v":0},null,null,null,null,{"$f":"'Rank Wkst'!AH28","v":0},{"$f":"'Rank Wkst'!AI28","v":0}]
[22,null,null,{"$f":"'Rank Wkst'!C29","v":""},{"$f":"'Rank Wkst'!G29","v":""},{"$f":"'Rank Wkst'!H29","v":""},{"$f":"'Rank Wkst'!L29","v":""},{"$f":"'Rank Wkst'!M29","v":""},{"$f":"'Rank Wkst'!Q29","v":""},{"$f":"'Rank Wkst'!R29","v":""},{"$f":"'Rank Wkst'!V29","v":""},{"$f":"'Rank Wkst'!W29","v":""},{"$f":"'Rank Wkst'!AA29","v":""},{"$f":"'Rank Wkst'!AB29","v":""},{"$f":"'Rank Wkst'!AF29","v":""},{"$f":"'Rank Wkst'!AL29","v":""},{"$f":"IF(AND('Rank Wkst'!AP29>1, D33<>\"DQ\"), 'Rank Wkst'!AT29, \"\")","v":""},{"$f":"IF(AND('Rank Wkst'!AP29>1, D33<>\"DQ\"), 'Rank Wkst'!AY29, \"\")","v":""},{"$f":"IF(AND('Rank Wkst'!AW29>1, D33<>\"DQ\"), 'Rank Wkst'!BC29, \"\")","v":""},{"$f":"IF(AND('Rank Wkst'!AW29>1, D33<>\"DQ\"), 'Rank Wkst'!BH29, \"\")","v":""},{"$f":"IF('Rank Wkst'!AG29<>0, 'Rank Wkst'!BK29, \"\")","v":""},null,{"$f":"IF('Rank Wkst'!C29=\"DQ\", \"\", 'Rank Wkst'!AH29)","v":0},{"$f":"IF('Rank Wkst'!C29=\"DQ\", \"\", 'Rank Wkst'!AI29)","v":0},null,null,null,null,{"$f":"'Rank Wkst'!AH29","v":0},{"$f":"'Rank Wkst'!AI29","v":0}]
[23,null,null,{"$f":"'Rank Wkst'!C30","v":""},{"$f":"'Rank Wkst'!G30","v":""},{"$f":"'Rank Wkst'!H30","v":""},{"$f":"'Rank Wkst'!L30","v":""},{"$f":"'Rank Wkst'!M30","v":""},{"$f":"'Rank Wkst'!Q30","v":""},{"$f":"'Rank Wkst'!R30","v":""},{"$f":"'Rank Wkst'!V30","v":""},{"$f":"'Rank Wkst'!W30","v":""},{"$f":"'Rank Wkst'!AA30","v":""},{"$f":"'Rank Wkst'!AB30","v":""},{"$f":"'Rank Wkst'!AF30","v":""},{"$f":"'Rank Wkst'!AL30","v":""},{"$f":"IF(AND('Rank Wkst'!AP30>1, D34<>\"DQ\"), 'Rank Wkst'!AT30, \"\")","v":""},{"$f":"IF(AND('Rank Wkst'!AP30>1, D34<>\"DQ\"), 'Rank Wkst'!AY30, \"\")","v":""},{"$f":"IF(AND('Rank Wkst'!AW30>1, D34<>\"DQ\"), 'Rank Wkst'!BC30, \"\")","v":""},{"$f":"IF(AND('Rank Wkst'!AW30>1, D34<>\"DQ\"), 'Rank Wkst'!BH30, \"\")","v":""},{"$f":"IF('Rank Wkst'!AG30<>0, 'Rank Wkst'!BK30, \"\")","v":""},null,{"$f":"IF('Rank Wkst'!C30=\"DQ\", \"\", 'Rank Wkst'!AH30)","v":0},{"$f":"IF('Rank Wkst'!C30=\"DQ\", \"\", 'Rank Wkst'!AI30)","v":0},null,null,null,null,{"$f":"'Rank Wkst'!AH30","v":0},{"$f":"'Rank Wkst'!AI30","v":0}]
[24,null,null,{"$f":"'Rank Wkst'!C31","v":""},{"$f":"'Rank Wkst'!G31","v":""},{"$f":"'Rank Wkst'!H31","v":""},{"$f":"'Rank Wkst'!L31","v":""},{"$f":"'Rank Wkst'!M31","v":""},{"$f":"'Rank Wkst'!Q31","v":""},{"$f":"'Rank Wkst'!R31","v":""},{"$f":"'Rank Wkst'!V31","v":""},{"$f":"'Rank Wkst'!W31","v":""},{"$f":"'Rank Wkst'!AA31","v":""},{"$f":"'Rank Wkst'!AB31","v":""},{"$f":"'Rank Wkst'!AF31","v":""},{"$f":"'Rank Wkst'!AL31","v":""},{"$f":"IF(AND('Rank Wkst'!AP31>1, D35<>\"DQ\"), 'Rank Wkst'!AT31, \"\")","v":""},{"$f":"IF(AND('Rank Wkst'!AP31>1, D35<>\"DQ\"), 'Rank Wkst'!AY31, \"\")","v":""},{"$f":"IF(AND('Rank Wkst'!AW31>1, D35<>\"DQ\"), 'Rank Wkst'!BC31, \"\")","v":""},{"$f":"IF(AND('Rank Wkst'!AW31>1, D35<>\"DQ\"), 'Rank Wkst'!BH31, \"\")","v":""},{"$f":"IF('Rank Wkst'!AG31<>0, 'Rank Wkst'!BK31, \"\")","v":""},null,{"$f":"IF('Rank Wkst'!C31=\"DQ\", \"\", 'Rank Wkst'!AH31)","v":0},{"$f":"IF('Rank Wkst'!C31=\"DQ\", \"\", 'Rank Wkst'!AI31)","v":0},null,null,null,null,{"$f":"'Rank Wkst'!AH31","v":0},{"$f":"'Rank Wkst'!AI31","v":0}]
[]
["Superior Judge Signature:",null,null,null,null,null,null,null,null,null,null,"Tabulation Signature:"]

{"sheet":"Rank Wkst","index":1,"n_rows":52,"n_cols":230,"rows_kept":52,"cut":false,"hidden":true,"merged":[[5,116,5,125],[41,134,41,135],[42,134,42,135],[43,134,43,135],[44,134,44,135],[35,134,35,135],[36,134,36,135],[37,134,37,135],[38,134,38,135],[39,134,39,135],[40,134,40,135],[4,2,4,6],[4,7,4,11],[4,12,4,16],[4,17,4,21],[5,44,5,50],[4,27,4,31],[5,27,5,31],[5,39,5,42],[4,80,4,83],[5,1,6,1],[5,2,5,6],[5,7,5,11],[5,12,5,16],[5,17,5,21],[5,60,6,60],[5,51,5,59],[5,80,5,85],[5,86,5,91],[5,92,5,98],[4,22,4,26],[5,22,5,26],[3,152,3,167],[4,118,4,125],[5,115,6,115],[5,153,5,162],[5,99,6,99],[4,172,4,179],[5,169,6,169],[5,170,5,175],[5,176,5,181],[5,132,5,149],[5,152,6,152]]}
[]
[]
[null,null,null,null,null,null,null,null,null,null,null,null,null,null,null,null,null,null,null,null,null,null,null,null,null,null,null,null,null,null,null,null,null,null,null,null,null,null,null,null,null,null,null,null,null,null,null,null,null,null,null,null,null,null,null,null,null,null,null,null,null,null,null,null,null,null,null,null,null,null,null,null,{"$f":"IF(AND('Rank Wkst'!AP8>1, D12<>\"DQ\"), 'Rank Wkst'!AT8, \"\")","v":""}]
[null,null,null,null,null,null,null,null,null,null,null,null,null,null,null,null,null,null,null,null,null,null,null,null,null,null,null,null,null,null,null,null,null,null,null,null,null,null,null,null,null,null,null,null,null,null,null,null,null,null,null,null,null,null,null,null,null,null,null,null,null,null,null,null,null,null,null,null,null,null,null,null,null,null,null,null,null,null,null,null,null,null,null,null,null,null,null,null,null,null,null,null,null,null,null,null,null,null,null,null,null,null,null,null,null,null,null,null,null,null,null,null,null,null,null,"Point Summary Sheet",null,null,null,null,null,null,null,null,null,null,null,null,null,null,null,null,null,null,"Changed location to DF",null,null,null,null,null,null,null,null,null,null,null,null,null,null,null,null,null,"Point Summary Sheet with Tie-Breaker sheet",null,null,null,null,null,null,null,null,null,null,null,null,null,null,null,null,"Team Score Summary Sheet",null,null,null,null,null,null,null,null,null,null,null,null,null,null,null,null,null,"Superior Judge Sheet",null,null,null,null,null,null,null,null,null,null,null,null,null,null,null,null,null,null,null,null,null,null,null,null,null,null,null,null,null,null,"Tie Announcers Sheet"]
[null,null,"Judge 1",null,null,null,null,"Judge 2",null,null,null,null,"Judge 3",null,null,null,null,"Judge 4",null,null,null,null,"Judge 5",null,null,null,null,"Judge 6",null,null,null,null,null,null,null,null,null,null,null,null,null,null,null,null,null,null,null,null,null,null,null,null,null,null,null,null,null,null,null,null,null,null,null,null,null,null,null,null,null,null,null,null,null,null,null,null,null,null,null,null,"Tie-breaker Sheet",null,null,null,null,null,null,null,null,null,null,null,null,null,null,null,null,null,null,null,null,null,null,null,null,null,null,null,null,null,null,null,null,null,null,null,null,null,null,null,null,null,null,null,null,null,null,null,null,null,null,null,null,null,null,null,null,null,null,null,null,null,null,null,null,null,null,null,null,null,null,null,null,null,null,null,null,null,null,null,null,null,null,null,null,null,null,null,null,null,null,null,null,null,null,null,null,null,null,null,null,null,null,null,null,null,null,"Ranks",null,null,null,null,null,null,null,null,null,null,null,null,"Scores"]
[null,"School",{"$f":"'Ranking Sheet'!D8","v":0},null,null,null,null,{"$f":"'Ranking Sheet'!F8","v":0},null,null,null,null,{"$f":"'Ranking Sheet'!H8","v":0},null,null,null,null,{"$f":"'Ranking Sheet'!J8","v":0},null,null,null,null,{"$f":"'Ranking Sheet'!L8","v":0},null,null,null,null,{"$f":"IF('Ranking Sheet'!N8=0, \"\", 'Ranking Sheet'!N8)","v":""},null,null,null,null,null,null,null,null,null,null,null,"Sub-total Placement",null,null,null,null,"“B” Rank 1st Tie break",null,null,null,null,null,null,"“B” Rank 2nd Tie Break",null,null,null,null,null,null,null,null,"Final\nFinal Place",null,null,null,null,null,null,null,null,null,null,null,null,null,null,null,null,null,null,null,"3rd Tie Break",null,null,null,null,null,"4th Tie Break",null,null,null,null,null,"5th Tie Break",null,null,null,null,null,null,"Final\nFinal Place",null,null,null,null,null,null,null,null,null,null,null,null,null,null,null,"School","Points",null,null,null,null,null,null,null,null,null,null,null,null,null,null,null,"In Final Order",null,null,null,null,null,null,null,null,null,null,null,null,null,null,null,null,null,null,null,"School in tiebreaker order","Points in tie-breaker order",null,null,null,null,null,null,null,null,null,null,null,null,null,null,null,"School","Judges Scores",null,null,null,null,null,"Judges Scores (Low to High)",null,null,null,null,null,null,null,null,null,null,null,null,null,null,null,null,null,null,null,null,null,null,null,null,null,null,null,null,null,null,null,null,null,null,null,null,null,"Website"]
["Team",null,"Points","Initial Rank","Ties","Rank","Rank DQ show dash","Points","Initial Rank","Ties","Rank","Rank DQ show dash","Points","Initial Rank","Ties","Rank","Rank DQ show dash","Points","Initial Rank","Ties","Rank","Rank DQ show dash","Points","Initial Rank","Ties","Rank","Rank DQ show dash","Points","Initial Rank","Ties","Rank","Rank DQ show dash","Total Rank","Low","High","“B” Rank\nDrop Hi/Lo","If = to zero make null?","Total Rank  If > 150 (rank 25 x 6), put dash","First Rank","Working Final Place","Final final","Ties","Final Rank","Remove error","Add hi/low ranks","if=0 make null","New Tie Formula rank","Eliminate extra ranks","Ties","Ties with 0.5 ","1st tie break Remove extra non-values","Low Points","High Points","Total Points\nDrop Hi/Lo","if=0 make null","New Formula Points","Eliminate extra ranks","Ties","Ties with 0.5 ","2nd tie break Remove extra non-values",null,"If greater than 25 rank than =null","if DQ put DQ instead of rank","Placements in order 1st - 20th","Final Placement with a DQ","Schools in order 1st - 20th but error on any ties","Assigning the ties a specific number","removing error","ranking with #NUM shown","Ranking schools from top to bottom -- for Final placements & announcers form","Calling out Tie but need to get rid of \"99\"","Getting rid of a possible TIE on DQs","Putting TIE on final place & Announc","Final Ranking score in order","Final Ranking score for announcers form","Announcers form - if tie breaker is used performance order","Annou form correct final order","Annou form correct order no error","Annou form eliminating showing when no scores",null,"Total Points\n","if=0 make null"," 3rd Tie Break","Ties","Tie/ties break ","3rd tie break Remove extra non-values","Superior Judge Rank","Superior judge rank with extra ranks removed"," 4th Tie Break","Ties","Tie/ties break ","4th tie break Remove extra non-values","All judges rank minus Superior Judge Rank","All judges rank minus Superior Judge Rank w/o errors","Removing the zeros","5th Tie Break","Ties","Tie/ties break ","5th tie break Remove extra non-values",null,"If greater than 25 rank than =null","if DQ put DQ instead of rank","Placements in order 1st - 24th","Placements with a DQ","Placements with a DQ#2","Schools in order 1st - 20th but error on any ties","Assigning the ties a specific number","removing error","ranking with #NUM error","Ranking schools from top to bottom -- for Final placements & announcers form","Calling out Tie but need to get rid of \"99\"","Getting rid of a possible TIE on DQs","Putting TIE on final place & Announc",null,"Team",null,"Technique of Kicks","Kick Height","Creativity","Visual Effectiveness","Diffuculty of Routine Choreography","Difficulty of Formations and Transitions","Difficulty of Kicks","Placement & Control","Degree of Accuracy","Routine Effectiveness","SubTotal","(Deductions)","Total","Out of Total Points",null,"Rank perform order with DQ","Rank in order with DQ","Adding TIE","Schools in order","Technique of Kicks","Kick Height","Creativity","Visual Effectiveness","Diffuculty of Routine Choreography","Difficulty of Formations and Transitions","Difficulty of Kicks","Placement & Control","Degree of Accuracy","Routine Effectiveness","SubTotal","(Deductions)","Total","Out of Total Points","Rank Points",null,"Rank from Tie-breaker",null,"Technique of Kicks","Kick Height","Creativity","Visual Effectiveness","Diffuculty of Routine Choreography","Difficulty of Formations and Transitions","Difficulty of Kicks","Placement & Control","Degree of Accuracy","Routine Effectiveness","SubTotal","(Deductions)","Total","Out of Total Points",null,"Team",null,"Judge 1 Score","Judge 2 Score","Judge 3 Score","Judge 4 Score","Judge 5 Score","Judge 6 Score","Score 1 (lowest)","Score 2","Score 3","Score 4","Score 5 (Highest)","Score 6 (Highest - if applicable)","SubTotal","(Deductions)","Total","Out of Total Points",null,"Judge 1 rank","Judge 2 rank","Judge 3 rank","Judge 4 rank","Judge 5 rank","Judge 6 rank","Min Rank (Best)","Max Rank (Worst)","Rank Spread","2nd best rank","Rank Spread with 2nd best rank","2nd worst rank","Rank Spread with 2nd worst rank","Judge 1 Score","Judge 2 Score","Judge 3 Score","Judge 4 Score","Judge 5 Score","Judge 6 Score","Low Points","High Points","Point Spread","2nd Lowest Points","Point Spread with 2nd lowest points","2nd Highest Points","Point Spread with 2nd highest points","Average","Putting the information together on one line",null,null,null,"Team in order of final placements","School - in final placement order","If tie-breaker used","Final Ranking for announcers form","For tie-breaker announcer form","1st tie","2nd place for 1st tie","Tie for 2nd place","3rd place team","Tie for 3rd","4th place team","Rank for tie sheet "]
[1,{"$f":"IF('Ranking Sheet'!B12=0, \"\", 'Ranking Sheet'!B12)","v":""},{"$f":"IF(Team1!$D$21=0, \"\", Team1!$D$21)","v":""},{"$f":"IF(C8=\"DQ\", 98, IF(C8=\"\", \"\", RANK(C8,C$8:C$31,0)))","v":""},{"$f":"IF(C8=\"\", \"\", COUNTIF(D$8:D$31,D8))","v":""},{"$f":"IF(C8=\"\", \"\", (((D8+E8-1)*((D8+E8-1)+1)/2)-((D8-1)*((D8-1)+1)/2))/E8)","v":""},{"$f":"IF(F8=\"\", \"\", IF(F8>25, \"-\", F8))","v":""},{"$f":"IF(Team1!$E$21=0, \"\", Team1!$E$21)","v":""},{"$f":"IF(H8=\"DQ\", 98, IF(H8=\"\", \"\", RANK(H8,H$8:H$31,0)))","v":""},{"$f":"IF(H8=\"\", \"\", COUNTIF(I$8:I$31,I8))","v":""},{"$f":"IF(H8=\"\", \"\", (((I8+J8-1)*((I8+J8-1)+1)/2)-((I8-1)*((I8-1)+1)/2))/J8)","v":""},{"$f":"IF(K8=\"\", \"\", IF(K8>25, \"-\", K8))","v":""},{"$f":"IF(Team1!$F$21=0, \"\", Team1!$F$21)","v":""},{"$f":"IF(M8=\"DQ\", 98, IF(M8=\"\", \"\", RANK(M8,M$8:M$31,0)))","v":""},{"$f":"IF(M8=\"\", \"\", COUNTIF(N$8:N$31,N8))","v":""},{"$f":"IF(M8=\"\", \"\", (((N8+O8-1)*((N8+O8-1)+1)/2)-((N8-1)*((N8-1)+1)/2))/O8)","v":""},{"$f":"IF(P8=\"\", \"\", IF(P8>25, \"-\", P8))","v":""},{"$f":"IF(Team1!$G$21=0, \"\", Team1!$G$21)","v":""},{"$f":"IF(R8=\"DQ\", 98, IF(R8=\"\", \"\", RANK(R8,R$8:R$31,0)))","v":""},{"$f":"IF(R8=\"\", \"\", COUNTIF(S$8:S$31,S8))","v":""},{"$f":"IF(R8=\"\", \"\", (((S8+T8-1)*((S8+T8-1)+1)/2)-((S8-1)*((S8-1)+1)/2))/T8)","v":""},{"$f":"IF(U8=\"\", \"\", IF(U8>25, \"-\", U8))","v":""},{"$f":"IF(Team1!$H$21=0, \"\", Team1!$H$21)","v":""},{"$f":"IF(W8=\"DQ\", 98, IF(W8=\"\", \"\", RANK(W8,W$8:W$31,0)))","v":""},{"$f":"IF(W8=\"\", \"\", COUNTIF(X$8:X$31,X8))","v":""},{"$f":"IF(W8=\"\", \"\", (((X8+Y8-1)*((X8+Y8-1)+1)/2)-((X8-1)*((X8-1)+1)/2))/Y8)","v":""},{"$f":"IF(Z8=\"\", \"\", IF(Z8>25, \"-\", Z8))","v":""},{"$f":"IF(Team1!$I$21=0, \"\", Team1!$I$21)","v":""},{"$f":"IF(AB8=\"DQ\", 98, IF(AB8=\"\", \"\", RANK(AB8,AB$8:AB$31,0)))","v":""},{"$f":"IF(AB8=\"\", \"\", COUNTIF(AC$8:AC$31,AC8))","v":""},{"$f":"IF(AB8=\"\", \"\", (((AC8+AD8-1)*((AC8+AD8-1)+1)/2)-((AC8-1)*((AC8-1)+1)/2))/AD8)","v":""},{"$f":"IF(AE8=\"\", \"\", IF(AE8>25, \"-\", AE8))","v":""},{"$f":"SUM(F8,K8,P8,U8,Z8,AE8)","v":0},{"$f":"MIN(F8,K8,P8,U8,Z8,AE8)","v":0},{"$f":"MAX(F8,K8,P8,U8,Z8,AE8)","v":0},{"$f":"AG8-AH8-AI8","v":0},{"$f":"IF(AJ8=0, \"\", AJ8)","v":""},{"$f":"IF(AK8=\"\", \"\", IF(AK8>150, \"-\", AK8))","v":""},{"$f":"RANK(AK8,AK$8:AK$31,1)","v":{"$error":"#VALUE!"}},{"$f":"IF(AND(ISNUMBER(AJ8),AJ8<>0),RANK(AJ8,AJ$8:AJ$31,1),99)","v":99},{"$f":"AN8-(SMALL(AN$8:AN$31,1))+1","v":1},{"$f":"COUNTIF(AM$8:AM$31,AM8)","v":24},{"$f":"(((AM8+AP8-1)*((AM8+AP8-1)+1)/2)-((AM8-1)*((AM8-1)+1)/2))/AP8","v":{"$error":"#VALUE!"}},{"$f":"IF(ISERROR(AQ8), \"\", AQ8)","v":""},{"$f":"AJ8+AH8+AI8","v":0},{"$f":"IF(AS8=0, \"\", AS8)","v":""},{"$f":"1+SUMPRODUCT(--($AO$8:$AO$31+$AS$8:$AS$31/1000000<$AO8+$AS8/1000000))","v":1},{"$f":"IF(C8=\"\", \"\", AU8)","v":""},{"$f":"COUNTIF(AU$8:AU$31,AU8)","v":24},{"$f":"(((AU8+AW8-1)*((AU8+AW8-1)+1)/2)-((AU8-1)*((AU8-1)+1)/2))/AW8","v":12.5},{"$f":"IF(AS8=0, \"\", AX8)","v":""},{"$f":"MIN(C8,H8,M8,R8,W8,AB8)","v":0},{"$f":"MAX(C8,H8,M8,R8,W8,AB8)","v":0},{"$f":"SUM(C8,H8,M8,R8,W8,AB8)-MIN(C8,H8,M8,R8,W8,AB8)-MAX(C8,H8,M8,R8,W8,AB8)","v":0},{"$f":"IF(BB8=0, \"\", BB8)","v":""},{"$f":"1+SUMPRODUCT(--($AU$8:$AU$31+1-$BB$8:$BB$31/1000000<$AU8+1-$BB8/1000000))","v":1},{"$f":"IF(L8=\"\", \"\", BD8)","v":""},{"$f":"COUNTIF(BD$8:BD$31,BD8)","v":24},{"$f":"(((BD8+BF8-1)*((BD8+BF8-1)+1)/2)-((BD8-1)*((BD8-1)+1)/2))/BF8","v":12.5},{"$f":"IF(AT8=\"\", \"\", BG8)","v":""},{"$f":"IF(ISNUMBER(BH8),BH8,IF(ISNUMBER(AY8),AY8,AO8))","v":1},{"$f":"IF(BI8>25, \"\", BI8)","v":1},{"$f":"IF(C8=\"DQ\", \"DQ\", BJ8 )","v":1},{"$f":"IF(BJ8=\"\", \"\", SMALL(BJ$8:BJ$31, 1))","v":1},{"$f":"IF(AG8<>0, INDEX($BK$8:$BK$31,MATCH(BL8,$BJ$8:$BJ$31,FALSE),1), \"\")","v":""},{"$f":"IF(BJ8=\"\", \"\", OFFSET(B$8,MATCH(SMALL(BJ$8:BJ$31,ROW()-ROW(BJ$8)+1),BJ$8:BJ$31,0)-1,0))","v":""},{"$f":"COUNT($BJ$8:$BJ$31)-(RANK(BJ8,$BJ$8:$BJ$31,0)+COUNTIF(BJ$8:$BJ8,BJ8))+2","v":24},{"$f":"IF(ISERROR(BO8), \" \", BO8)","v":24},{"$f":"OFFSET(B$8,MATCH(SMALL(BP$8:BP$31,ROW()-ROW(BQ$8)+1),BP$8:BP$31,0)-1,0)","v":""},{"$f":"IF(C8=\"\", \"\", IF(ISERROR(BQ8), \" \", BQ8))","v":""},{"$f":"IF(COUNTIF($BL$8:$BL31,BL8)>1,\"TIE\",\"\")","v":"TIE"},{"$f":"IF(BM8=\"DQ\", \"\", BS8)","v":"TIE"},{"$f":"IF(AG8<>0, IF(BL8<>\"\",BS8),  \"\")","v":""},{"$f":"OFFSET(AL$8,MATCH(SMALL(BP$8:BP$31,ROW()-ROW(BQ$8)+1),BP$8:BP$31,0)-1,0)","v":""},{"$f":"IF(ISERROR(BV8), \" \", BV8)","v":""},{"$f":"IF(AND(AP8>1, BK8<>\"DQ\"), \"*\", \"\")","v":"*"},{"$f":"OFFSET(BX$8,MATCH(SMALL(BP$8:BP$31,ROW()-ROW(BQ$8)+1),BP$8:BP$31,0)-1,0)","v":"*"},{"$f":"IF(ISERROR(BY8), \" \", BY8)","v":"*"},{"$f":"IF(C8=\"\", \"\", BZ8)","v":""},null,{"$f":"SUM(C8,H8,M8,R8,W8,AB8)","v":0},{"$f":"IF(CC8=0, \"\", CC8)","v":""},{"$f":"1+SUMPRODUCT(--($BD$8:$BD$31+1-$CC$8:$CC$31/1000000<$BD8+1-$CC8/1000000))","v":1},{"$f":"COUNTIF(CE$8:CE$31,CE8)","v":24},{"$f":"(((CE8+CF8-1)*((CE8+CF8-1)+1)/2)-((CE8-1)*((CE8-1)+1)/2))/CF8","v":12.5},{"$f":"IF(AV8=\"\", \"\", CG8)","v":""},{"$f":"IF($F8=\"\", 0, $F8)","v":0},{"$f":"IF(CI8=0, \"\", CI8)","v":""},{"$f":"1+SUMPRODUCT(--($CE$8:$CE$31+$CI$8:$CI$31/1000000<$CE8+$CI8/1000000))","v":1},{"$f":"COUNTIF(CK$8:CK$31,CK8)","v":24},{"$f":"(((CK8+CL8-1)*((CK8+CL8-1)+1)/2)-((CK8-1)*((CK8-1)+1)/2))/CL8","v":12.5},{"$f":"IF(AV8=\"\", \"\", CM8)","v":""},{"$f":"AG8-F8","v":{"$error":"#VALUE!"}},{"$f":"IF(ISERROR(CO8), 0, CO8)","v":0},{"$f":"IF(CP8=0, \"\", CP8)","v":""},{"$f":"1+SUMPRODUCT(--($CK$8:$CK$31+$CP$8:$CP$31/1000000<$CK8+$CP8/1000000))","v":1},{"$f":"COUNTIF(CR$8:CR$31,CR8)","v":24},{"$f":"(((CR8+CS8-1)*((CR8+CS8-1)+1)/2)-((CR8-1)*((CR8-1)+1)/2))/CS8","v":12.5},{"$f":"IF(AV8=\"\", \"\", CT8)","v":""},{"$f":"IF(ISNUMBER(CU8),CU8,IF(ISNUMBER(CN8),CN8,BI8))","v":1},{"$f":"IF(CV8>25, \"\", CV8)","v":1},{"$f":"IF(C8=\"DQ\", \"DQ\", CW8 )","v":1},{"$f":"IF(CW8=\"\", \"\", SMALL(CW$8:CW$31, 1))","v":1},{"$f":"INDEX($CX$8:$CX$31,MATCH(CY8,$CW$8:$CW$31,FALSE),1)","v":1},{"$f":"IF(CZ8=FALSE, \"\", CZ8)","v":1},{"$f":"IF(CW8=\"\", \"\", OFFSET(B$8,MATCH(SMALL(CW$8:CW$31,ROW()-ROW(CW$8)+1),CW$8:CW$31,0)-1,0))","v":""},{"$f":"COUNT($CW$8:$CW$31)-(RANK(CW8,$CW$8:$CW$31,0)+COUNTIF(CW$8:$CW8,CW8))+2","v":24},{"$f":"IF(ISERROR(DC8), \" \", DC8)","v":24},{"$f":"OFFSET(B$8,MATCH(SMALL(DD$8:DD$31,ROW()-ROW(DE$8)+1),DD$8:DD$31,0)-1,0)","v":""},{"$f":"IF(ISERROR(DE8), \" \", DE8)","v":""},{"$f":"IF(COUNTIF($CY$8:$CY31,CY8)>1,\"TIE\",\"\")","v":"TIE"},{"$f":"IF(CZ8=\"DQ\", \"\", DG8)","v":"TIE"},{"$f":"IF(CY8=\"\", \"\", DH8)","v":"TIE"},null,1,{"$f":"IF('Ranking Sheet'!B12=0, \"\", 'Ranking Sheet'!B12)","v":""},{"$f":"IF(Team1!$J$9=0, \"\", Team1!$J$9)","v":""},{"$f":"IF(Team1!$J$10=0, \"\", Team1!$J$10)","v":""},{"$f":"IF(Team1!$J$11=0, \"\", Team1!$J$11)","v":""},{"$f":"IF(Team1!$J$12=0, \"\", Team1!$J$12)","v":""},{"$f":"IF(Team1!$J$13=0, \"\", Team1!$J$13)","v":""},{"$f":"IF(Team1!$J$14=0, \"\", Team1!$J$14)","v":""},{"$f":"IF(Team1!$J$15=0, \"\", Team1!$J$15)","v":""},{"$f":"IF(Team1!$J$16=0, \"\", Team1!$J$16)","v":""},{"$f":"IF(Team1!$J$17=0, \"\", Team1!$J$17)","v":""},{"$f":"IF(Team1!$J$18=0, \"\", Team1!$J$18)","v":""},{"$f":"IF(Team1!$J$19=0, \"\", Team1!$J$19)","v":""},{"$f":"IF(Team1!$J$20=0, \"\", Team1!$J$20)","v":""},{"$f":"IF(Team1!$J$21=0, \"\", Team1!$J$21)","v":""},{"$f":"IF(Team1!$L$21=0, \"\", Team1!$L$21)","v":""},null,{"$f":"BK8","v":1},{"$f":"BM8","v":""},{"$f":"BU8","v":""},{"$f":"DF8","v":""},{"$f":"IF(BJ8=\"\", \"\", OFFSET(DM$8,MATCH(SMALL('Rank Wkst'!DD$8:DD$31,ROW()-ROW(DD$8)+1),DD$8:DD$31,0)-1,0))","v":""},{"$f":"IF(BJ8=\"\", \"\", OFFSET(DN$8,MATCH(SMALL('Rank Wkst'!DD$8:DD$31,ROW()-ROW(DD$8)+1),DD$8:DD$31,0)-1,0))","v":""},{"$f":"IF(BJ8=\"\", \"\", OFFSET(DO$8,MATCH(SMALL('Rank Wkst'!DD$8:DD$31,ROW()-ROW(DD$8)+1),DD$8:DD$31,0)-1,0))","v":""},{"$f":"IF(BJ8=\"\", \"\", OFFSET(DP$8,MATCH(SMALL(DD$8:DD$31,ROW()-ROW(DD$8)+1),DD$8:DD$31,0)-1,0))","v":""},{"$f":"IF(BJ8=\"\", \"\", OFFSET(DQ$8,MATCH(SMALL(DD$8:DD$31,ROW()-ROW(DD$8)+1),DD$8:DD$31,0)-1,0))","v":""},{"$f":"IF(BJ8=\"\", \"\", OFFSET(DR$8,MATCH(SMALL(DD$8:DD$31,ROW()-ROW(DD$8)+1),DD$8:DD$31,0)-1,0))","v":""},{"$f":"IF(BJ8=\"\", \"\", OFFSET(DS$8,MATCH(SMALL(DD$8:DD$31,ROW()-ROW(DD$8)+1),DD$8:DD$31,0)-1,0))","v":""},{"$f":"IF(BJ8=\"\", \"\", OFFSET(DT$8,MATCH(SMALL(DD$8:DD$31,ROW()-ROW(DD$8)+1),DD$8:DD$31,0)-1,0))","v":""},{"$f":"IF(BJ8=\"\", \"\", OFFSET(DU$8,MATCH(SMALL(DD$8:DD$31,ROW()-ROW(DD$8)+1),DD$8:DD$31,0)-1,0))","v":""},{"$f":"IF(BJ8=\"\", \"\", OFFSET(DV$8,MATCH(SMALL(DD$8:DD$31,ROW()-ROW(DD$8)+1),DD$8:DD$31,0)-1,0))","v":""},{"$f":"IF(BJ8=\"\", \"\", OFFSET(DW$8,MATCH(SMALL(DD$8:DD$31,ROW()-ROW(DD$8)+1),DD$8:DD$31,0)-1,0))","v":""},{"$f":"IF(BJ8=\"\", \"\", OFFSET(DX$8,MATCH(SMALL(DD$8:DD$31,ROW()-ROW(DD$8)+1),DD$8:DD$31,0)-1,0))","v":""},{"$f":"IF(BJ8=\"\", \"\", OFFSET(DY$8,MATCH(SMALL(DD$8:DD$31,ROW()-ROW(DD$8)+1),DD$8:DD$31,0)-1,0))","v":""},{"$f":"IF(BJ8=\"\", \"\", OFFSET(DZ$8,MATCH(SMALL(DD$8:DD$31,ROW()-ROW(DD$8)+1),DD$8:DD$31,0)-1,0))","v":""},{"$f":"BW8","v":""},null,{"$f":"DA8","v":1},{"$f":"DF8","v":""},{"$f":"IF(BJ8=\"\", \"\", OFFSET(DM$8,MATCH(SMALL('Rank Wkst'!DD$8:DD$31,ROW()-ROW(DD$8)+1),DD$8:DD$31,0)-1,0))","v":""},{"$f":"IF(BJ8=\"\", \"\", OFFSET(DN$8,MATCH(SMALL('Rank Wkst'!DD$8:DD$31,ROW()-ROW(DD$8)+1),DD$8:DD$31,0)-1,0))","v":""},{"$f":"IF(BJ8=\"\", \"\", OFFSET(DO$8,MATCH(SMALL(DD$8:DD$31,ROW()-ROW(DD$8)+1),DD$8:DD$31,0)-1,0))","v":""},{"$f":"IF(BJ8=\"\", \"\", OFFSET(DP$8,MATCH(SMALL(DD$8:DD$31,ROW()-ROW(DD$8)+1),DD$8:DD$31,0)-1,0))","v":""},{"$f":"IF(BJ8=\"\", \"\", OFFSET(DQ$8,MATCH(SMALL(DD$8:DD$31,ROW()-ROW(DD$8)+1),DD$8:DD$31,0)-1,0))","v":""},{"$f":"IF(BJ8=\"\", \"\", OFFSET(DR$8,MATCH(SMALL(DD$8:DD$31,ROW()-ROW(DD$8)+1),DD$8:DD$31,0)-1,0))","v":""},{"$f":"IF(BJ8=\"\", \"\", OFFSET(DS$8,MATCH(SMALL(DD$8:DD$31,ROW()-ROW(DD$8)+1),DD$8:DD$31,0)-1,0))","v":""},{"$f":"IF(BJ8=\"\", \"\", OFFSET(DT$8,MATCH(SMALL(DD$8:DD$31,ROW()-ROW(DD$8)+1),DD$8:DD$31,0)-1,0))","v":""},{"$f":"IF(BJ8=\"\", \"\", OFFSET(DU$8,MATCH(SMALL(DD$8:DD$31,ROW()-ROW(DD$8)+1),DD$8:DD$31,0)-1,0))","v":""},{"$f":"IF(BJ8=\"\", \"\", OFFSET(DV$8,MATCH(SMALL(DD$8:DD$31,ROW()-ROW(DD$8)+1),DD$8:DD$31,0)-1,0))","v":""},{"$f":"IF(BJ8=\"\", \"\", OFFSET(DW$8,MATCH(SMALL(DD$8:DD$31,ROW()-ROW(DD$8)+1),DD$8:DD$31,0)-1,0))","v":""},{"$f":"IF(BJ8=\"\", \"\", OFFSET(DX$8,MATCH(SMALL(DD$8:DD$31,ROW()-ROW(DD$8)+1),DD$8:DD$31,0)-1,0))","v":""},{"$f":"IF(BJ8=\"\", \"\", OFFSET(DY$8,MATCH(SMALL(DD$8:DD$31,ROW()-ROW(DD$8)+1),DD$8:DD$31,0)-1,0))","v":""},{"$f":"IF(BJ8=\"\", \"\", OFFSET(DZ$8,MATCH(SMALL(DD$8:DD$31,ROW()-ROW(DD$8)+1),DD$8:DD$31,0)-1,0))","v":""},null,1,{"$f":"IF('Ranking Sheet'!B12=0, \"\", 'Ranking Sheet'!B12)","v":""},{"$f":"C8","v":""},{"$f":"H8","v":""},{"$f":"M8","v":""},{"$f":"R8","v":""},{"$f":"W8","v":""},{"$f":"AB8","v":""},{"$f":"IF(FO8=\"DQ\",\"DQ\", IF(FO8=\"\",\"\",SMALL(FO8:FT8,1)))","v":""},{"$f":"IF(FO8=\"DQ\",\"DQ\",IF(FO8=\"\",\"\",SMALL(FO8:FT8,2)))","v":""},{"$f":"IF(FO8=\"DQ\",\"DQ\",IF(FO8=\"\", \"\",SMALL(FO8:FT8,3)))","v":""},{"$f":"IF(FO8=\"DQ\",\"DQ\",IF(FO8=\"\", \"\",SMALL(FO8:FT8,4)))","v":""},{"$f":"IF(FO8=\"DQ\",\"DQ\",IF(FO8=\"\", \"\",SMALL(FO8:FT8,5)))","v":""},{"$f":"IF(FO8=\"DQ\",\"DQ\",IF(FT8=\"\", \"\", SMALL(FO8:FT8,6)))","v":""},{"$f":"DW8","v":""},{"$f":"DX8","v":""},{"$f":"DY8","v":""},{"$f":"DZ8","v":""},null,{"$f":"IF(BK8=\"DQ\", \"DQ\", F8)","v":""},{"$f":"IF(BK8=\"DQ\", \"DQ\", K8)","v":""},{"$f":"IF(BK8=\"DQ\", \"DQ\", P8)","v":""},{"$f":"IF(BK8=\"DQ\", \"DQ\", U8)","v":""},{"$f":"IF(BK8=\"DQ\", \"DQ\", Z8)","v":""},{"$f":"IF(BK8=\"DQ\", \"DQ\", AE8)","v":""},{"$f":"IF(BK8=\"DQ\", \"DQ\", IF(GF8=\"\", \"\", MIN(F8,K8,P8,U8,Z8,AE8)))","v":""},{"$f":"IF(BK8=\"DQ\", \"DQ\", IF(GF8=\"\", \"\", MAX(F8,K8,P8,U8,Z8,AE8)))","v":""},{"$f":"IF(BK8=\"DQ\", \"DQ\", IF(GF8=\"\", \"\", GM8-GL8))","v":""},{"$f":"IF(BK8=\"DQ\", \"DQ\", IF(GF8=\"\", \"\", SMALL(GF8:GK8,2)))","v":""},{"$f":"IF(BK8=\"DQ\", \"DQ\", IF(GF8=\"\", \"\", GM8-GO8))","v":""},{"$f":"IF(BK8=\"DQ\", \"DQ\", IF(GF8=\"\", \"\", IF(GK8=\"\", SMALL(GF8:GK8,4), SMALL(GF8:GK8,5))))","v":""},{"$f":"IF(BK8=\"DQ\", \"DQ\", IF(GF8=\"\", \"\",GQ8-GL8))","v":""},{"$f":"IF(BK8=\"DQ\", \"DQ\", C8)","v":""},{"$f":"IF(BK8=\"DQ\", \"DQ\", H8)","v":""},{"$f":"IF(BK8=\"DQ\", \"DQ\", M8)","v":""},{"$f":"IF(BK8=\"DQ\", \"DQ\", R8)","v":""},{"$f":"IF(BK8=\"DQ\", \"DQ\", W8)","v":""},{"$f":"IF(BK8=\"DQ\", \"DQ\", AB8)","v":""},{"$f":"IF(BK8=\"DQ\", \"DQ\", IF(GF8=\"\", \"\", AZ8))","v":""},{"$f":"IF(BK8=\"DQ\", \"DQ\", IF(GF8=\"\", \"\", BA8))","v":""},{"$f":"IF(BK8=\"DQ\", \"DQ\", IF(GF8=\"\", \"\", GZ8-GY8))","v":""},{"$f":"IF(BK8=\"DQ\", \"DQ\", IF(GS8=\"\", \"\", SMALL(GS8:GX8,2)))","v":""},{"$f":"IF(BK8=\"DQ\", \"DQ\", IF(GS8=\"\", \"\", GZ8-HB8))","v":""},{"$f":"IF(BK8=\"DQ\", \"DQ\", IF(GS8=\"\", \"\", IF(GX8=\"\", SMALL(GS8:GX8,4), SMALL(GS8:GX8,5))))","v":""},{"$f":"IF(BK8=\"DQ\", \"DQ\", IF(GS8=\"\", \"\",HD8-GY8))","v":""},{"$f":"IF(BK8=\"DQ\", \"DQ\",  IF(GF8=\"\", \"\", AVERAGE(GS8:GX8)))","v":""},{"$f":"CONCATENATE(EC8,\",\",ED8,\",\",EE8,\",\",EF8,\",\",EG8,\",\",EH8,\",\",EI8,\",\",EJ8,\",\",)","v":",,,,,,,,"},{"$f":"CONCATENATE(EK8,\",\",EL8,\",\",EM8,\",\",EN8,\",\",EO8,\",\",EP8,\",\",EQ8,\",\",ER8,\",\",\"/\",\",\",ES8,\",\",ET8)","v":",,,,,,,,/,,"},{"$f":"CONCATENATE(HG8,HH8)","v":",,,,,,,,,,,,,,,,/,,"},null,{"$f":"DA8","v":1},{"$f":"DF8","v":""},{"$f":"CA8","v":""},{"$f":"BW8","v":""},{"$f":"AND(HN8=HN9, HM8=HM9)","v":true},{"$f":"IF(HO8=TRUE, HL8, \"\")","v":""},{"$f":"IF(HO8=TRUE,HL9,\"\")","v":""},null,null,null,null,{"$f":"IF(HO8=TRUE,HN8,\"\")","v":""}]
[2,{"$f":"IF('Ranking Sheet'!B13=0, \"\", 'Ranking Sheet'!B13)","v":""},{"$f":"IF(Team2!$D$21=0, \"\", Team2!$D$21)","v":""},"","",{"$f":"IF(C9=\"\", \"\", (((D9+E9-1)*((D9+E9-1)+1)/2)-((D9-1)*((D9-1)+1)/2))/E9)","v":""},"",{"$f":"IF(Team2!$E$21=0, \"\", Team2!$E$21)","v":""},"","",{"$f":"IF(H9=\"\", \"\", (((I9+J9-1)*((I9+J9-1)+1)/2)-((I9-1)*((I9-1)+1)/2))/J9)","v":""},"",{"$f":"IF(Team2!$F$21=0, \"\", Team2!$F$21)","v":""},"","",{"$f":"IF(M9=\"\", \"\", (((N9+O9-1)*((N9+O9-1)+1)/2)-((N9-1)*((N9-1)+1)/2))/O9)","v":""},{"$f":"IF(P9=\"\", \"\", IF(P9>25, \"-\", P9))","v":""},{"$f":"IF(Team2!$G$21=0, \"\", Team2!$G$21)","v":""},{"$f":"IF(R9=\"DQ\", 98, IF(R9=\"\", \"\", RANK(R9,R$8:R$31,0)))","v":""},{"$f":"IF(R9=\"\", \"\", COUNTIF(S$8:S$31,S9))","v":""},{"$f":"IF(R9=\"\", \"\", (((S9+T9-1)*((S9+T9-1)+1)/2)-((S9-1)*((S9-1)+1)/2))/T9)","v":""},{"$f":"IF(U9=\"\", \"\", IF(U9>25, \"-\", U9))","v":""},{"$f":"IF(Team2!$H$21=0, \"\", Team2!$H$21)","v":""},{"$f":"IF(W9=\"DQ\", 98, IF(W9=\"\", \"\", RANK(W9,W$8:W$31,0)))","v":""},{"$f":"IF(W9=\"\", \"\", COUNTIF(X$8:X$31,X9))","v":""},{"$f":"IF(W9=\"\", \"\", (((X9+Y9-1)*((X9+Y9-1)+1)/2)-((X9-1)*((X9-1)+1)/2))/Y9)","v":""},{"$f":"IF(Z9=\"\", \"\", IF(Z9>25, \"-\", Z9))","v":""},{"$f":"IF(Team2!$I$21=0, \"\", Team2!$I$21)","v":""},{"$f":"IF(AB9=\"DQ\", 98, IF(AB9=\"\", \"\", RANK(AB9,AB$8:AB$31,0)))","v":""},{"$f":"IF(AB9=\"\", \"\", COUNTIF(AC$8:AC$31,AC9))","v":""},{"$f":"IF(AB9=\"\", \"\", (((AC9+AD9-1)*((AC9+AD9-1)+1)/2)-((AC9-1)*((AC9-1)+1)/2))/AD9)","v":""},{"$f":"IF(AE9=\"\", \"\", IF(AE9>25, \"-\", AE9))","v":""},0,{"$f":"MIN(F9,K9,P9,U9,Z9,AE9)","v":0},0,0,{"$f":"IF(AJ9=0, \"\", AJ9)","v":""},{"$f":"IF(AK9=\"\", \"\", IF(AK9>150, \"-\", AK9))","v":""},{"$f":"RANK(AK9,AK$8:AK$31,1)","v":{"$error":"#VALUE!"}},{"$f":"IF(AND(ISNUMBER(AJ9),AJ9<>0),RANK(AJ9,AJ$8:AJ$31,1),99)","v":99},{"$f":"AN9-(SMALL(AN$8:AN$31,1))+1","v":1},{"$f":"COUNTIF(AM$8:AM$31,AM9)","v":24},{"$f":"(((AM9+AP9-1)*((AM9+AP9-1)+1)/2)-((AM9-1)*((AM9-1)+1)/2))/AP9","v":{"$error":"#VALUE!"}},{"$f":"IF(ISERROR(AQ9), \"\", AQ9)","v":""},0,{"$f":"IF(AS9=0, \"\", AS9)","v":""},{"$f":"1+SUMPRODUCT(--($AO$8:$AO$31+$AS$8:$AS$31/1000000<$AO9+$AS9/1000000))","v":1},"",{"$f":"COUNTIF(AU$8:AU$31,AU9)","v":24},12.5,{"$f":"IF(AS9=0, \"\", AX9)","v":""},0,0,0,{"$f":"IF(BB9=0, \"\", BB9)","v":""},{"$f":"1+SUMPRODUCT(--($AU$8:$AU$31+1-$BB$8:$BB$31/1000000<$AU9+1-$BB9/1000000))","v":1},{"$f":"IF(L9=\"\", \"\", BD9)","v":""},{"$f":"COUNTIF(BD$8:BD$31,BD9)","v":24},12.5,{"$f":"IF(AT9=\"\", \"\", BG9)","v":""},1,{"$f":"IF(BI9>25, \"\", BI9)","v":1},{"$f":"IF(C9=\"DQ\", \"DQ\", BJ9 )","v":1},{"$f":"IF(BJ9=\"\", \"\", SMALL(BJ$8:BJ$31, 2))","v":1},{"$f":"IF(AG9<>0, INDEX($BK$8:$BK$31,MATCH(BL9,$BJ$8:$BJ$31,FALSE),1), \"\")","v":""},{"$f":"IF(BJ9=\"\", \"\", OFFSET(B$8,MATCH(SMALL(BJ$8:BJ$31,ROW()-ROW(BJ$8)+1),BJ$8:BJ$31,0)-1,0))","v":""},{"$f":"COUNT($BJ$8:$BJ$31)-(RANK(BJ9,$BJ$8:$BJ$31,0)+COUNTIF(BJ$8:$BJ9,BJ9))+2","v":23},{"$f":"IF(ISERROR(BO9), \" \", BO9)","v":23},{"$f":"OFFSET(B$8,MATCH(SMALL(BP$8:BP$31,ROW()-ROW(BQ$8)+1),BP$8:BP$31,0)-1,0)","v":""},{"$f":"IF(C9=\"\", \"\", IF(ISERROR(BQ9), \" \", BQ9))","v":""},{"$f":"IF(COUNTIF($BL$8:$BL32,BL9)>1,\"TIE\",\"\")","v":"TIE"},{"$f":"IF(BM9=\"DQ\", \"\", BS9)","v":"TIE"},{"$f":"IF(AG9<>0, IF(BL9<>\"\",BS9),  \"\")","v":""},{"$f":"OFFSET(AL$8,MATCH(SMALL(BP$8:BP$31,ROW()-ROW(BQ$8)+1),BP$8:BP$31,0)-1,0)","v":""},{"$f":"IF(ISERROR(BV9), \" \", BV9)","v":""},{"$f":"IF(AND(AP9>1, BK9<>\"DQ\"), \"*\", \"\")","v":"*"},{"$f":"OFFSET(BX$8,MATCH(SMALL(BP$8:BP$31,ROW()-ROW(BQ$8)+1),BP$8:BP$31,0)-1,0)","v":"*"},{"$f":"IF(ISERROR(BY9), \" \", BY9)","v":"*"},{"$f":"IF(C9=\"\", \"\", BZ9)","v":""},null,{"$f":"SUM(C9,H9,M9,R9,W9,AB9)","v":0},{"$f":"IF(CC9=0, \"\", CC9)","v":""},{"$f":"1+SUMPRODUCT(--($BD$8:$BD$31+1-$CC$8:$CC$31/1000000<$BD9+1-$CC9/1000000))","v":1},{"$f":"COUNTIF(CE$8:CE$31,CE9)","v":24},{"$f":"(((CE9+CF9-1)*((CE9+CF9-1)+1)/2)-((CE9-1)*((CE9-1)+1)/2))/CF9","v":12.5},{"$f":"IF(AV9=\"\", \"\", CG9)","v":""},{"$f":"IF($F9=\"\", 0, $F9)","v":0},{"$f":"IF(CI9=0, \"\", CI9)","v":""},{"$f":"1+SUMPRODUCT(--($CE$8:$CE$31+$CI$8:$CI$31/1000000<$CE9+$CI9/1000000))","v":1},{"$f":"COUNTIF(CK$8:CK$31,CK9)","v":24},{"$f":"(((CK9+CL9-1)*((CK9+CL9-1)+1)/2)-((CK9-1)*((CK9-1)+1)/2))/CL9","v":12.5},{"$f":"IF(AV9=\"\", \"\", CM9)","v":""},{"$f":"AG9-F9","v":{"$error":"#VALUE!"}},{"$f":"IF(ISERROR(CO9), 0, CO9)","v":0},{"$f":"IF(CP9=0, \"\", CP9)","v":""},1,{"$f":"COUNTIF(CR$8:CR$31,CR9)","v":24},{"$f":"(((CR9+CS9-1)*((CR9+CS9-1)+1)/2)-((CR9-1)*((CR9-1)+1)/2))/CS9","v":12.5},"",{"$f":"IF(ISNUMBER(CU9),CU9,IF(ISNUMBER(CN9),CN9,BI9))","v":1},{"$f":"IF(CV9>25, \"\", CV9)","v":1},{"$f":"IF(C9=\"DQ\", \"DQ\", CW9 )","v":1},{"$f":"IF(CW9=\"\", \"\", SMALL(CW$8:CW$31, 2))","v":1},{"$f":"INDEX($CX$8:$CX$31,MATCH(CY9,$CW$8:$CW$31,FALSE),1)","v":1},{"$f":"IF(CZ9=FALSE, \"\", CZ9)","v":1},{"$f":"IF(CW9=\"\", \"\", OFFSET(B$8,MATCH(SMALL(CW$8:CW$31,ROW()-ROW(CW$8)+1),CW$8:CW$31,0)-1,0))","v":""},{"$f":"COUNT($CW$8:$CW$31)-(RANK(CW9,$CW$8:$CW$31,0)+COUNTIF(CW$8:$CW9,CW9))+2","v":23},{"$f":"IF(ISERROR(DC9), \" \", DC9)","v":23},{"$f":"OFFSET(B$8,MATCH(SMALL(DD$8:DD$31,ROW()-ROW(DE$8)+1),DD$8:DD$31,0)-1,0)","v":""},{"$f":"IF(ISERROR(DE9), \" \", DE9)","v":""},{"$f":"IF(COUNTIF($CY$8:$CY32,CY9)>1,\"TIE\",\"\")","v":"TIE"},{"$f":"IF(CZ9=\"DQ\", \"\", DG9)","v":"TIE"},{"$f":"IF(CY9=\"\", \"\", DH9)","v":"TIE"},null,2,{"$f":"IF('Ranking Sheet'!B13=0, \"\", 'Ranking Sheet'!B13)","v":""},{"$f":"IF(Team2!$J$9=0, \"\", Team2!$J$9)","v":""},{"$f":"IF(Team2!$J$10=0, \"\", Team2!$J$10)","v":""},{"$f":"IF(Team2!$J$11=0, \"\", Team2!$J$11)","v":""},{"$f":"IF(Team2!$J$12=0, \"\", Team2!$J$12)","v":""},{"$f":"IF(Team2!$J$13=0, \"\", Team2!$J$13)","v":""},{"$f":"IF(Team2!$J$14=0, \"\", Team2!$J$14)","v":""},{"$f":"IF(Team2!$J$15=0, \"\", Team2!$J$15)","v":""},{"$f":"IF(Team2!$J$16=0, \"\", Team2!$J$16)","v":""},{"$f":"IF(Team2!$J$17=0, \"\", Team2!$J$17)","v":""},{"$f":"IF(Team2!$J$18=0, \"\", Team2!$J$18)","v":""},{"$f":"IF(Team2!$J$19=0, \"\", Team2!$J$19)","v":""},{"$f":"IF(Team2!$J$20=0, \"\", Team2!$J$20)","v":""},{"$f":"IF(Team2!$J$21=0, \"\", Team2!$J$21)","v":""},{"$f":"IF(Team2!$L$21=0, \"\", Team2!$L$21)","v":""},null,{"$f":"BK9","v":1},{"$f":"BM9","v":""},{"$f":"BU9","v":""},{"$f":"DF9","v":""},{"$f":"IF(BJ9=\"\", \"\", OFFSET(DM$8,MATCH(SMALL('Rank Wkst'!DD$8:DD$31,ROW()-ROW(DD$8)+1),DD$8:DD$31,0)-1,0))","v":""},{"$f":"IF(BJ9=\"\", \"\", OFFSET(DN$8,MATCH(SMALL('Rank Wkst'!DD$8:DD$31,ROW()-ROW(DD$8)+1),DD$8:DD$31,0)-1,0))","v":""},{"$f":"IF(BJ9=\"\", \"\", OFFSET(DO$8,MATCH(SMALL('Rank Wkst'!DD$8:DD$31,ROW()-ROW(DD$8)+1),DD$8:DD$31,0)-1,0))","v":""},{"$f":"IF(BJ9=\"\", \"\", OFFSET(DP$8,MATCH(SMALL(DD$8:DD$31,ROW()-ROW(DD$8)+1),DD$8:DD$31,0)-1,0))","v":""},{"$f":"IF(BJ9=\"\", \"\", OFFSET(DQ$8,MATCH(SMALL(DD$8:DD$31,ROW()-ROW(DD$8)+1),DD$8:DD$31,0)-1,0))","v":""},{"$f":"IF(BJ9=\"\", \"\", OFFSET(DR$8,MATCH(SMALL(DD$8:DD$31,ROW()-ROW(DD$8)+1),DD$8:DD$31,0)-1,0))","v":""},{"$f":"IF(BJ9=\"\", \"\", OFFSET(DS$8,MATCH(SMALL(DD$8:DD$31,ROW()-ROW(DD$8)+1),DD$8:DD$31,0)-1,0))","v":""},{"$f":"IF(BJ9=\"\", \"\", OFFSET(DT$8,MATCH(SMALL(DD$8:DD$31,ROW()-ROW(DD$8)+1),DD$8:DD$31,0)-1,0))","v":""},{"$f":"IF(BJ9=\"\", \"\", OFFSET(DU$8,MATCH(SMALL(DD$8:DD$31,ROW()-ROW(DD$8)+1),DD$8:DD$31,0)-1,0))","v":""},{"$f":"IF(BJ9=\"\", \"\", OFFSET(DV$8,MATCH(SMALL(DD$8:DD$31,ROW()-ROW(DD$8)+1),DD$8:DD$31,0)-1,0))","v":""},{"$f":"IF(BJ9=\"\", \"\", OFFSET(DW$8,MATCH(SMALL(DD$8:DD$31,ROW()-ROW(DD$8)+1),DD$8:DD$31,0)-1,0))","v":""},{"$f":"IF(BJ9=\"\", \"\", OFFSET(DX$8,MATCH(SMALL(DD$8:DD$31,ROW()-ROW(DD$8)+1),DD$8:DD$31,0)-1,0))","v":""},{"$f":"IF(BJ9=\"\", \"\", OFFSET(DY$8,MATCH(SMALL(DD$8:DD$31,ROW()-ROW(DD$8)+1),DD$8:DD$31,0)-1,0))","v":""},{"$f":"IF(BJ9=\"\", \"\", OFFSET(DZ$8,MATCH(SMALL(DD$8:DD$31,ROW()-ROW(DD$8)+1),DD$8:DD$31,0)-1,0))","v":""},{"$f":"BW9","v":""},null,{"$f":"DA9","v":1},{"$f":"DF9","v":""},{"$f":"IF(BJ9=\"\", \"\", OFFSET(DM$8,MATCH(SMALL('Rank Wkst'!DD$8:DD$31,ROW()-ROW(DD$8)+1),DD$8:DD$31,0)-1,0))","v":""},{"$f":"IF(BJ9=\"\", \"\", OFFSET(DN$8,MATCH(SMALL('Rank Wkst'!DD$8:DD$31,ROW()-ROW(DD$8)+1),DD$8:DD$31,0)-1,0))","v":""},{"$f":"IF(BJ9=\"\", \"\", OFFSET(DO$8,MATCH(SMALL(DD$8:DD$31,ROW()-ROW(DD$8)+1),DD$8:DD$31,0)-1,0))","v":""},{"$f":"IF(BJ9=\"\", \"\", OFFSET(DP$8,MATCH(SMALL(DD$8:DD$31,ROW()-ROW(DD$8)+1),DD$8:DD$31,0)-1,0))","v":""},{"$f":"IF(BJ9=\"\", \"\", OFFSET(DQ$8,MATCH(SMALL(DD$8:DD$31,ROW()-ROW(DD$8)+1),DD$8:DD$31,0)-1,0))","v":""},{"$f":"IF(BJ9=\"\", \"\", OFFSET(DR$8,MATCH(SMALL(DD$8:DD$31,ROW()-ROW(DD$8)+1),DD$8:DD$31,0)-1,0))","v":""},{"$f":"IF(BJ9=\"\", \"\", OFFSET(DS$8,MATCH(SMALL(DD$8:DD$31,ROW()-ROW(DD$8)+1),DD$8:DD$31,0)-1,0))","v":""},{"$f":"IF(BJ9=\"\", \"\", OFFSET(DT$8,MATCH(SMALL(DD$8:DD$31,ROW()-ROW(DD$8)+1),DD$8:DD$31,0)-1,0))","v":""},{"$f":"IF(BJ9=\"\", \"\", OFFSET(DU$8,MATCH(SMALL(DD$8:DD$31,ROW()-ROW(DD$8)+1),DD$8:DD$31,0)-1,0))","v":""},{"$f":"IF(BJ9=\"\", \"\", OFFSET(DV$8,MATCH(SMALL(DD$8:DD$31,ROW()-ROW(DD$8)+1),DD$8:DD$31,0)-1,0))","v":""},{"$f":"IF(BJ9=\"\", \"\", OFFSET(DW$8,MATCH(SMALL(DD$8:DD$31,ROW()-ROW(DD$8)+1),DD$8:DD$31,0)-1,0))","v":""},{"$f":"IF(BJ9=\"\", \"\", OFFSET(DX$8,MATCH(SMALL(DD$8:DD$31,ROW()-ROW(DD$8)+1),DD$8:DD$31,0)-1,0))","v":""},{"$f":"IF(BJ9=\"\", \"\", OFFSET(DY$8,MATCH(SMALL(DD$8:DD$31,ROW()-ROW(DD$8)+1),DD$8:DD$31,0)-1,0))","v":""},{"$f":"IF(BJ9=\"\", \"\", OFFSET(DZ$8,MATCH(SMALL(DD$8:DD$31,ROW()-ROW(DD$8)+1),DD$8:DD$31,0)-1,0))","v":""},null,2,{"$f":"IF('Ranking Sheet'!B13=0, \"\", 'Ranking Sheet'!B13)","v":""},{"$f":"C9","v":""},{"$f":"H9","v":""},{"$f":"M9","v":""},{"$f":"R9","v":""},{"$f":"W9","v":""},{"$f":"AB9","v":""},{"$f":"IF(FO9=\"DQ\",\"DQ\", IF(FO9=\"\",\"\",SMALL(FO9:FT9,1)))","v":""},{"$f":"IF(FO9=\"DQ\",\"DQ\",IF(FO9=\"\",\"\",SMALL(FO9:FT9,2)))","v":""},{"$f":"IF(FO9=\"DQ\",\"DQ\",IF(FO9=\"\", \"\",SMALL(FO9:FT9,3)))","v":""},{"$f":"IF(FO9=\"DQ\",\"DQ\",IF(FO9=\"\", \"\",SMALL(FO9:FT9,4)))","v":""},{"$f":"IF(FO9=\"DQ\",\"DQ\",IF(FO9=\"\", \"\",SMALL(FO9:FT9,5)))","v":""},{"$f":"IF(FO9=\"DQ\",\"DQ\",IF(FT9=\"\", \"\", SMALL(FO9:FT9,6)))","v":""},{"$f":"DW9","v":""},{"$f":"DX9","v":""},{"$f":"DY9","v":""},{"$f":"DZ9","v":""},null,{"$f":"IF(BK9=\"DQ\", \"DQ\", F9)","v":""},{"$f":"IF(BK9=\"DQ\", \"DQ\", K9)","v":""},{"$f":"IF(BK9=\"DQ\", \"DQ\", P9)","v":""},{"$f":"IF(BK9=\"DQ\", \"DQ\", U9)","v":""},{"$f":"IF(BK9=\"DQ\", \"DQ\", Z9)","v":""},{"$f":"IF(BK9=\"DQ\", \"DQ\", AE9)","v":""},{"$f":"IF(BK9=\"DQ\", \"DQ\", IF(GF9=\"\", \"\", MIN(F9,K9,P9,U9,Z9,AE9)))","v":""},{"$f":"IF(BK9=\"DQ\", \"DQ\", IF(GF9=\"\", \"\", MAX(F9,K9,P9,U9,Z9,AE9)))","v":""},{"$f":"IF(BK9=\"DQ\", \"DQ\", IF(GF9=\"\", \"\", GM9-GL9))","v":""},{"$f":"IF(BK9=\"DQ\", \"DQ\", IF(GF9=\"\", \"\", SMALL(GF9:GK9,2)))","v":""},{"$f":"IF(BK9=\"DQ\", \"DQ\", IF(GF9=\"\", \"\", GM9-GO9))","v":""},{"$f":"IF(BK9=\"DQ\", \"DQ\", IF(GF9=\"\", \"\", IF(GK9=\"\", SMALL(GF9:GK9,4), SMALL(GF9:GK9,5))))","v":""},{"$f":"IF(BK9=\"DQ\", \"DQ\", IF(GF9=\"\", \"\",GQ9-GL9))","v":""},{"$f":"IF(BK9=\"DQ\", \"DQ\", C9)","v":""},{"$f":"IF(BK9=\"DQ\", \"DQ\", H9)","v":""},{"$f":"IF(BK9=\"DQ\", \"DQ\", M9)","v":""},{"$f":"IF(BK9=\"DQ\", \"DQ\", R9)","v":""},{"$f":"IF(BK9=\"DQ\", \"DQ\", W9)","v":""},{"$f":"IF(BK9=\"DQ\", \"DQ\", AB9)","v":""},{"$f":"IF(BK9=\"DQ\", \"DQ\", IF(GF9=\"\", \"\", AZ9))","v":""},{"$f":"IF(BK9=\"DQ\", \"DQ\", IF(GF9=\"\", \"\", BA9))","v":""},{"$f":"IF(BK9=\"DQ\", \"DQ\", IF(GF9=\"\", \"\", GZ9-GY9))","v":""},{"$f":"IF(BK9=\"DQ\", \"DQ\", IF(GS9=\"\", \"\", SMALL(GS9:GX9,2)))","v":""},{"$f":"IF(BK9=\"DQ\", \"DQ\", IF(GS9=\"\", \"\", GZ9-HB9))","v":""},{"$f":"IF(BK9=\"DQ\", \"DQ\", IF(GS9=\"\", \"\", IF(GX9=\"\", SMALL(GS9:GX9,4), SMALL(GS9:GX9,5))))","v":""},{"$f":"IF(BK9=\"DQ\", \"DQ\", IF(GS9=\"\", \"\",HD9-GY9))","v":""},{"$f":"IF(BK9=\"DQ\", \"DQ\",  IF(GF9=\"\", \"\", AVERAGE(GS9:GX9)))","v":""},{"$f":"CONCATENATE(EC9,\",\",ED9,\",\",EE9,\",\",EF9,\",\",EG9,\",\",EH9,\",\",EI9,\",\",EJ9,\",\",)","v":",,,,,,,,"},{"$f":"CONCATENATE(EK9,\",\",EL9,\",\",EM9,\",\",EN9,\",\",EO9,\",\",EP9,\",\",EQ9,\",\",ER9,\",\",\"/\",\",\",ES9,\",\",ET9)","v":",,,,,,,,/,,"},{"$f":"CONCATENATE(HG9,HH9)","v":",,,,,,,,,,,,,,,,/,,"},null,{"$f":"DA9","v":1},{"$f":"DF9","v":""},{"$f":"CA9","v":""},{"$f":"BW9","v":""},{"$f":"AND(HN9=HN10, HM9=HM10)","v":true},null,null,{"$f":"IF(HO9=TRUE, HL9, \"\")","v":""},{"$f":"IF(HO9=TRUE, HL10, \"\")","v":""},null,null,{"$f":"IF(HO9=TRUE,HN9,\"\")","v":""}]
[3,{"$f":"IF('Ranking Sheet'!B14=0, \"\", 'Ranking Sheet'!B14)","v":""},{"$f":"IF(Team3!$D$21=0, \"\", Team3!$D$21)","v":""},"","","","",{"$f":"IF(Team3!$E$21=0, \"\", Team3!$E$21)","v":""},"","","","",{"$f":"IF(Team3!$F$21=0, \"\", Team3!$F$21)","v":""},"","","",{"$f":"IF(P10=\"\", \"\", IF(P10>25, \"-\", P10))","v":""},{"$f":"IF(Team3!$G$21=0, \"\", Team3!$G$21)","v":""},"","","","",{"$f":"IF(Team3!$H$21=0, \"\", Team3!$H$21)","v":""},"","","","",{"$f":"IF(Team3!$I$21=0, \"\", Team3!$I$21)","v":""},"","","","",0,0,0,0,"","",{"$error":"#VALUE!"},99,1,24,{"$error":"#VALUE!"},"",0,"",1,"",24,12.5,"",0,0,0,"",1,"",24,12.5,{"$f":"IF(AT10=\"\", \"\", BG10)","v":""},1,1,1,{"$f":"IF(BJ10=\"\", \"\", SMALL(BJ$8:BJ$31, 3))","v":1},"","",{"$f":"COUNT($BJ$8:$BJ$31)-(RANK(BJ10,$BJ$8:$BJ$31,0)+COUNTIF(BJ$8:$BJ10,BJ10))+2","v":22},22,"","",{"$f":"IF(COUNTIF($BL$8:$BL33,BL10)>1,\"TIE\",\"\")","v":"TIE"},"TIE","","","","*","*","*","",null,0,"",1,24,12.5,"",0,"",1,24,12.5,"",{"$error":"#VALUE!"},0,"",1,24,12.5,"",1,1,1,{"$f":"IF(CW10=\"\", \"\", SMALL(CW$8:CW$31, 3))","v":1},1,1,"",{"$f":"COUNT($CW$8:$CW$31)-(RANK(CW10,$CW$8:$CW$31,0)+COUNTIF(CW$8:$CW10,CW10))+2","v":22},22,"","",{"$f":"IF(COUNTIF($CY$8:$CY33,CY10)>1,\"TIE\",\"\")","v":"TIE"},"TIE","TIE",null,3,{"$f":"IF('Ranking Sheet'!B14=0, \"\", 'Ranking Sheet'!B14)","v":""},{"$f":"IF(Team3!$J$9=0, \"\", Team3!$J$9)","v":""},{"$f":"IF(Team3!$J$10=0, \"\", Team3!$J$10)","v":""},{"$f":"IF(Team3!$J$11=0, \"\", Team3!$J$11)","v":""},{"$f":"IF(Team3!$J$12=0, \"\", Team3!$J$12)","v":""},{"$f":"IF(Team3!$J$13=0, \"\", Team3!$J$13)","v":""},{"$f":"IF(Team3!$J$14=0, \"\", Team3!$J$14)","v":""},{"$f":"IF(Team3!$J$15=0, \"\", Team3!$J$15)","v":""},{"$f":"IF(Team3!$J$16=0, \"\", Team3!$J$16)","v":""},{"$f":"IF(Team3!$J$17=0, \"\", Team3!$J$17)","v":""},{"$f":"IF(Team3!$J$18=0, \"\", Team3!$J$18)","v":""},{"$f":"IF(Team3!$J$19=0, \"\", Team3!$J$19)","v":""},{"$f":"IF(Team3!$J$20=0, \"\", Team3!$J$20)","v":""},{"$f":"IF(Team3!$J$21=0, \"\", Team3!$J$21)","v":""},{"$f":"IF(Team3!$L$21=0, \"\", Team3!$L$21)","v":""},null,1,"","","",{"$f":"IF(BJ10=\"\", \"\", OFFSET(DM$8,MATCH(SMALL('Rank Wkst'!DD$8:DD$31,ROW()-ROW(DD$8)+1),DD$8:DD$31,0)-1,0))","v":""},{"$f":"IF(BJ10=\"\", \"\", OFFSET(DN$8,MATCH(SMALL('Rank Wkst'!DD$8:DD$31,ROW()-ROW(DD$8)+1),DD$8:DD$31,0)-1,0))","v":""},{"$f":"IF(BJ10=\"\", \"\", OFFSET(DO$8,MATCH(SMALL('Rank Wkst'!DD$8:DD$31,ROW()-ROW(DD$8)+1),DD$8:DD$31,0)-1,0))","v":""},"","","","","","","","","","","","",null,1,"",{"$f":"IF(BJ10=\"\", \"\", OFFSET(DM$8,MATCH(SMALL('Rank Wkst'!DD$8:DD$31,ROW()-ROW(DD$8)+1),DD$8:DD$31,0)-1,0))","v":""},{"$f":"IF(BJ10=\"\", \"\", OFFSET(DN$8,MATCH(SMALL('Rank Wkst'!DD$8:DD$31,ROW()-ROW(DD$8)+1),DD$8:DD$31,0)-1,0))","v":""},"","","","","","","","","","","","",null,3,{"$f":"IF('Ranking Sheet'!B14=0, \"\", 'Ranking Sheet'!B14)","v":""},"","","","","","","","","","","","","","","","",null,"","","","","","","","","","","","","","","","","","","","","","","","","","","",",,,,,,,,",",,,,,,,,/,,",",,,,,,,,,,,,,,,,/,,",null,{"$f":"DA10","v":1},{"$f":"DF10","v":""},{"$f":"CA10","v":""},{"$f":"BW10","v":""},{"$f":"AND(HN10=HN11, HM10=HM11)","v":true},null,null,null,null,{"$f":"IF(HO10=TRUE, HL10, \"\")","v":""},{"$f":"IF(HO10=TRUE, HL11, \"\")","v":""},{"$f":"IF(HO10=TRUE,HN10,\"\")","v":""}]
[4,{"$f":"IF('Ranking Sheet'!B15=0, \"\", 'Ranking Sheet'!B15)","v":""},{"$f":"IF(Team4!$D$21=0,\"\", Team4!$D$21)","v":""},"","","","",{"$f":"IF(Team4!$E$21=0,\"\", Team4!$E$21)","v":""},"","","","",{"$f":"IF(Team4!$F$21=0,\"\", Team4!$F$21)","v":""},"","","","",{"$f":"IF(Team4!$G$21=0,\"\", Team4!$G$21)","v":""},"","","","",{"$f":"IF(Team4!$H$21=0,\"\", Team4!$H$21)","v":""},"","","","",{"$f":"IF(Team4!$I$21=0,\"\", Team4!$I$21)","v":""},"","","","",0,0,0,0,"","",{"$error":"#VALUE!"},99,1,24,{"$error":"#VALUE!"},"",0,"",1,"",24,12.5,"",0,0,0,"",1,"",24,12.5,"",1,1,1,{"$f":"IF(BJ11=\"\", \"\", SMALL(BJ$8:BJ$31, 4))","v":1},"","",{"$f":"COUNT($BJ$8:$BJ$31)-(RANK(BJ11,$BJ$8:$BJ$31,0)+COUNTIF(BJ$8:$BJ11,BJ11))+2","v":21},21,"","",{"$f":"IF(COUNTIF($BL$8:$BL34,BL11)>1,\"TIE\",\"\")","v":"TIE"},"TIE","","","","*","*","*","",null,0,"",1,24,12.5,"",0,"",1,24,12.5,"",{"$error":"#VALUE!"},0,"",1,24,12.5,"",1,1,1,{"$f":"IF(CW11=\"\", \"\", SMALL(CW$8:CW$31, 4))","v":1},1,1,"",{"$f":"COUNT($CW$8:$CW$31)-(RANK(CW11,$CW$8:$CW$31,0)+COUNTIF(CW$8:$CW11,CW11))+2","v":21},21,"","",{"$f":"IF(COUNTIF($CY$8:$CY34,CY11)>1,\"TIE\",\"\")","v":"TIE"},"TIE","TIE",null,4,{"$f":"IF('Ranking Sheet'!B15=0, \"\", 'Ranking Sheet'!B15)","v":""},{"$f":"IF(Team4!$J$9=0, \"\", Team4!$J$9)","v":""},{"$f":"IF(Team4!$J$10=0, \"\", Team4!$J$10)","v":""},{"$f":"IF(Team4!$J$11=0, \"\", Team4!$J$11)","v":""},{"$f":"IF(Team4!$J$12=0, \"\", Team4!$J$12)","v":""},{"$f":"IF(Team4!$J$13=0, \"\", Team4!$J$13)","v":""},{"$f":"IF(Team4!$J$14=0, \"\", Team4!$J$14)","v":""},{"$f":"IF(Team4!$J$15=0, \"\", Team4!$J$15)","v":""},{"$f":"IF(Team4!$J$16=0, \"\", Team4!$J$16)","v":""},{"$f":"IF(Team4!$J$17=0, \"\", Team4!$J$17)","v":""},{"$f":"IF(Team4!$J$18=0, \"\", Team4!$J$18)","v":""},{"$f":"IF(Team4!$J$19=0, \"\", Team4!$J$19)","v":""},{"$f":"IF(Team4!$J$20=0, \"\", Team4!$J$20)","v":""},{"$f":"IF(Team4!$J$21=0, \"\", Team4!$J$21)","v":""},{"$f":"IF(Team4!$L$21=0, \"\", Team4!$L$21)","v":""},null,1,"","","",{"$f":"IF(BJ11=\"\", \"\", OFFSET(DM$8,MATCH(SMALL('Rank Wkst'!DD$8:DD$31,ROW()-ROW(DD$8)+1),DD$8:DD$31,0)-1,0))","v":""},{"$f":"IF(BJ11=\"\", \"\", OFFSET(DN$8,MATCH(SMALL('Rank Wkst'!DD$8:DD$31,ROW()-ROW(DD$8)+1),DD$8:DD$31,0)-1,0))","v":""},{"$f":"IF(BJ11=\"\", \"\", OFFSET(DO$8,MATCH(SMALL('Rank Wkst'!DD$8:DD$31,ROW()-ROW(DD$8)+1),DD$8:DD$31,0)-1,0))","v":""},"","","","","","","","","","","","",null,1,"",{"$f":"IF(BJ11=\"\", \"\", OFFSET(DM$8,MATCH(SMALL('Rank Wkst'!DD$8:DD$31,ROW()-ROW(DD$8)+1),DD$8:DD$31,0)-1,0))","v":""},{"$f":"IF(BJ11=\"\", \"\", OFFSET(DN$8,MATCH(SMALL('Rank Wkst'!DD$8:DD$31,ROW()-ROW(DD$8)+1),DD$8:DD$31,0)-1,0))","v":""},"","","","","","","","","","","","",null,4,{"$f":"IF('Ranking Sheet'!B15=0, \"\", 'Ranking Sheet'!B15)","v":""},"","","","","","","","","","","","","","","","",null,"","","","","","","","","","","","","","","","","","","","","","","","","","","",",,,,,,,,",",,,,,,,,/,,",",,,,,,,,,,,,,,,,/,,",null,{"$f":"DA11","v":1},{"$f":"DF11","v":""},{"$f":"CA11","v":""},{"$f":"BW11","v":""}]
[5,{"$f":"IF('Ranking Sheet'!B16=0, \"\", 'Ranking Sheet'!B16)","v":""},{"$f":"IF(Team5!$D$21=0, \"\", Team5!$D$21)","v":""},"","","","",{"$f":"IF(Team5!$E$21=0, \"\", Team5!$E$21)","v":""},"","","","",{"$f":"IF(Team5!$F$21=0, \"\", Team5!$F$21)","v":""},"","","","",{"$f":"IF(Team5!$G$21=0, \"\", Team5!$G$21)","v":""},"","","","",{"$f":"IF(Team5!$H$21=0, \"\", Team5!$H$21)","v":""},"","","","",{"$f":"IF(Team5!$I$21=0, \"\", Team5!$I$21)","v":""},"","","","",0,0,0,0,"","",{"$error":"#VALUE!"},99,1,24,{"$error":"#VALUE!"},"",0,"",1,"",24,12.5,"",0,0,0,"",1,"",24,12.5,"",1,1,1,{"$f":"IF(BJ12=\"\", \"\", SMALL(BJ$8:BJ$31, 5))","v":1},"","",{"$f":"COUNT($BJ$8:$BJ$31)-(RANK(BJ12,$BJ$8:$BJ$31,0)+COUNTIF(BJ$8:$BJ12,BJ12))+2","v":20},20,"","",{"$f":"IF(COUNTIF($BL$8:$BL35,BL12)>1,\"TIE\",\"\")","v":"TIE"},"TIE","","","","*","*",{"$f":"IF(ISERROR(BY12), \" \", BY12)","v":"*"},"",null,0,"",1,24,12.5,"",0,"",1,24,12.5,"",{"$error":"#VALUE!"},0,"",1,24,12.5,"",1,1,1,{"$f":"IF(CW12=\"\", \"\", SMALL(CW$8:CW$31, 5))","v":1},1,1,"",{"$f":"COUNT($CW$8:$CW$31)-(RANK(CW12,$CW$8:$CW$31,0)+COUNTIF(CW$8:$CW12,CW12))+2","v":20},20,"","",{"$f":"IF(COUNTIF($CY$8:$CY35,CY12)>1,\"TIE\",\"\")","v":"TIE"},"TIE","TIE",null,5,{"$f":"IF('Ranking Sheet'!B16=0, \"\", 'Ranking Sheet'!B16)","v":""},{"$f":"IF(Team5!$J$9=0, \"\", Team5!$J$9)","v":""},{"$f":"IF(Team5!$J$10=0, \"\", Team5!$J$10)","v":""},{"$f":"IF(Team5!$J$11=0, \"\", Team5!$J$11)","v":""},{"$f":"IF(Team5!$J$12=0, \"\", Team5!$J$12)","v":""},{"$f":"IF(Team5!$J$13=0, \"\", Team5!$J$13)","v":""},{"$f":"IF(Team5!$J$14=0, \"\", Team5!$J$14)","v":""},{"$f":"IF(Team5!$J$15=0, \"\", Team5!$J$15)","v":""},{"$f":"IF(Team5!$J$16=0, \"\", Team5!$J$16)","v":""},{"$f":"IF(Team5!$J$17=0, \"\", Team5!$J$17)","v":""},{"$f":"IF(Team5!$J$18=0, \"\", Team5!$J$18)","v":""},{"$f":"IF(Team5!$J$19=0, \"\", Team5!$J$19)","v":""},{"$f":"IF(Team5!$J$20=0, \"\", Team5!$J$20)","v":""},{"$f":"IF(Team5!$J$21=0, \"\", Team5!$J$21)","v":""},{"$f":"IF(Team5!$L$21=0, \"\", Team5!$L$21)","v":""},null,1,"","","",{"$f":"IF(BJ12=\"\", \"\", OFFSET(DM$8,MATCH(SMALL('Rank Wkst'!DD$8:DD$31,ROW()-ROW(DD$8)+1),DD$8:DD$31,0)-1,0))","v":""},{"$f":"IF(BJ12=\"\", \"\", OFFSET(DN$8,MATCH(SMALL('Rank Wkst'!DD$8:DD$31,ROW()-ROW(DD$8)+1),DD$8:DD$31,0)-1,0))","v":""},{"$f":"IF(BJ12=\"\", \"\", OFFSET(DO$8,MATCH(SMALL('Rank Wkst'!DD$8:DD$31,ROW()-ROW(DD$8)+1),DD$8:DD$31,0)-1,0))","v":""},"","","","","","","","","","","","",null,1,"",{"$f":"IF(BJ12=\"\", \"\", OFFSET(DM$8,MATCH(SMALL('Rank Wkst'!DD$8:DD$31,ROW()-ROW(DD$8)+1),DD$8:DD$31,0)-1,0))","v":""},{"$f":"IF(BJ12=\"\", \"\", OFFSET(DN$8,MATCH(SMALL('Rank Wkst'!DD$8:DD$31,ROW()-ROW(DD$8)+1),DD$8:DD$31,0)-1,0))","v":""},"","","","","","","","","","","","",null,5,{"$f":"IF('Ranking Sheet'!B16=0, \"\", 'Ranking Sheet'!B16)","v":""},"","","","","","","","","","","","","","","","",null,"","","","","","","","","","","","","","","","","","","","","","","","","","","",",,,,,,,,",",,,,,,,,/,,",",,,,,,,,,,,,,,,,/,,"]
[6,{"$f":"IF('Ranking Sheet'!B17=0, \"\", 'Ranking Sheet'!B17)","v":""},{"$f":"IF(Team6!$D$21=0, \"\", Team6!$D$21)","v":""},"","","","",{"$f":"IF(Team6!$E$21=0, \"\", Team6!$E$21)","v":""},"","","","",{"$f":"IF(Team6!$F$21=0, \"\", Team6!$F$21)","v":""},"","","","",{"$f":"IF(Team6!$G$21=0, \"\", Team6!$G$21)","v":""},"","","","",{"$f":"IF(Team6!$H$21=0, \"\", Team6!$H$21)","v":""},"","","","",{"$f":"IF(Team6!$I$21=0, \"\", Team6!$I$21)","v":""},"","","","",0,0,0,0,"","",{"$error":"#VALUE!"},99,1,24,{"$error":"#VALUE!"},"",0,"",1,"",24,12.5,"",0,0,0,"",1,"",24,12.5,"",1,1,1,{"$f":"IF(BJ13=\"\", \"\", SMALL(BJ$8:BJ$31, 6))","v":1},"","",{"$f":"COUNT($BJ$8:$BJ$31)-(RANK(BJ13,$BJ$8:$BJ$31,0)+COUNTIF(BJ$8:$BJ13,BJ13))+2","v":19},19,"","",{"$f":"IF(COUNTIF($BL$8:$BL36,BL13)>1,\"TIE\",\"\")","v":"TIE"},"TIE","","","","*","*","*","",null,0,"",1,24,12.5,"",0,"",1,24,12.5,"",{"$error":"#VALUE!"},0,"",1,24,12.5,"",1,1,1,{"$f":"IF(CW13=\"\", \"\", SMALL(CW$8:CW$31, 6))","v":1},1,1,"",{"$f":"COUNT($CW$8:$CW$31)-(RANK(CW13,$CW$8:$CW$31,0)+COUNTIF(CW$8:$CW13,CW13))+2","v":19},19,"","",{"$f":"IF(COUNTIF($CY$8:$CY36,CY13)>1,\"TIE\",\"\")","v":"TIE"},"TIE","TIE",null,6,{"$f":"IF('Ranking Sheet'!B17=0, \"\", 'Ranking Sheet'!B17)","v":""},{"$f":"IF(Team6!$J$9=0, \"\", Team6!$J$9)","v":""},{"$f":"IF(Team6!$J$10=0, \"\", Team6!$J$10)","v":""},{"$f":"IF(Team6!$J$11=0, \"\", Team6!$J$11)","v":""},{"$f":"IF(Team6!$J$12=0, \"\", Team6!$J$12)","v":""},{"$f":"IF(Team6!$J$13=0, \"\", Team6!$J$13)","v":""},{"$f":"IF(Team6!$J$14=0, \"\", Team6!$J$14)","v":""},{"$f":"IF(Team6!$J$15=0, \"\", Team6!$J$15)","v":""},{"$f":"IF(Team6!$J$16=0, \"\", Team6!$J$16)","v":""},{"$f":"IF(Team6!$J$17=0, \"\", Team6!$J$17)","v":""},{"$f":"IF(Team6!$J$18=0, \"\", Team6!$J$18)","v":""},{"$f":"IF(Team6!$J$19=0, \"\", Team6!$J$19)","v":""},{"$f":"IF(Team6!$J$20=0, \"\", Team6!$J$20)","v":""},{"$f":"IF(Team6!$J$21=0, \"\", Team6!$J$21)","v":""},{"$f":"IF(Team6!$L$21=0, \"\", Team6!$L$21)","v":""},null,1,"","","",{"$f":"IF(BJ13=\"\", \"\", OFFSET(DM$8,MATCH(SMALL('Rank Wkst'!DD$8:DD$31,ROW()-ROW(DD$8)+1),DD$8:DD$31,0)-1,0))","v":""},{"$f":"IF(BJ13=\"\", \"\", OFFSET(DN$8,MATCH(SMALL('Rank Wkst'!DD$8:DD$31,ROW()-ROW(DD$8)+1),DD$8:DD$31,0)-1,0))","v":""},{"$f":"IF(BJ13=\"\", \"\", OFFSET(DO$8,MATCH(SMALL('Rank Wkst'!DD$8:DD$31,ROW()-ROW(DD$8)+1),DD$8:DD$31,0)-1,0))","v":""},"","","","","","","","","","","","",null,1,"",{"$f":"IF(BJ13=\"\", \"\", OFFSET(DM$8,MATCH(SMALL('Rank Wkst'!DD$8:DD$31,ROW()-ROW(DD$8)+1),DD$8:DD$31,0)-1,0))","v":""},{"$f":"IF(BJ13=\"\", \"\", OFFSET(DN$8,MATCH(SMALL('Rank Wkst'!DD$8:DD$31,ROW()-ROW(DD$8)+1),DD$8:DD$31,0)-1,0))","v":""},"","","","","","","","","","","","",null,6,{"$f":"IF('Ranking Sheet'!B17=0, \"\", 'Ranking Sheet'!B17)","v":""},"","","","","","","","","","","","","","","","",null,"","","","","","","","","","",{"$f":"IF(BK13=\"DQ\", \"DQ\", IF(GF13=\"\", \"\", GM13-GO13))","v":""},"","","","","","","","","","","","","","","","",",,,,,,,,",",,,,,,,,/,,",",,,,,,,,,,,,,,,,/,,"]
[7,{"$f":"IF('Ranking Sheet'!B18=0, \"\", 'Ranking Sheet'!B18)","v":""},{"$f":"IF(Team7!$D$21=0, \"\", Team7!$D$21)","v":""},"","","","",{"$f":"IF(Team7!$E$21=0, \"\", Team7!$E$21)","v":""},"","","","",{"$f":"IF(Team7!$F$21=0, \"\", Team7!$F$21)","v":""},"","","","",{"$f":"IF(Team7!$G$21=0, \"\", Team7!$G$21)","v":""},"","","","",{"$f":"IF(Team7!$H$21=0, \"\", Team7!$H$21)","v":""},"","","","",{"$f":"IF(Team7!$I$21=0, \"\", Team7!$I$21)","v":""},"","","","",0,0,0,0,"","",{"$error":"#VALUE!"},99,1,24,{"$error":"#VALUE!"},"",0,"",1,"",24,12.5,"",0,0,0,"",1,"",24,12.5,"",1,1,1,{"$f":"IF(BJ14=\"\", \"\", SMALL(BJ$8:BJ$31, 7))","v":1},"","",{"$f":"COUNT($BJ$8:$BJ$31)-(RANK(BJ14,$BJ$8:$BJ$31,0)+COUNTIF(BJ$8:$BJ14,BJ14))+2","v":18},18,"","",{"$f":"IF(COUNTIF($BL$8:$BL37,BL14)>1,\"TIE\",\"\")","v":"TIE"},"TIE","","","","*","*","*","",null,0,"",1,24,12.5,"",0,"",1,24,12.5,"",{"$error":"#VALUE!"},0,"",1,24,12.5,"",1,1,1,{"$f":"IF(CW14=\"\", \"\", SMALL(CW$8:CW$31, 7))","v":1},1,1,"",{"$f":"COUNT($CW$8:$CW$31)-(RANK(CW14,$CW$8:$CW$31,0)+COUNTIF(CW$8:$CW14,CW14))+2","v":18},18,"","",{"$f":"IF(COUNTIF($CY$8:$CY37,CY14)>1,\"TIE\",\"\")","v":"TIE"},"TIE","TIE",null,7,{"$f":"IF('Ranking Sheet'!B18=0, \"\", 'Ranking Sheet'!B18)","v":""},{"$f":"IF(Team7!$J$9=0, \"\", Team7!$J$9)","v":""},{"$f":"IF(Team7!$J$10=0, \"\", Team7!$J$10)","v":""},{"$f":"IF(Team7!$J$11=0, \"\", Team7!$J$11)","v":""},{"$f":"IF(Team7!$J$12=0, \"\", Team7!$J$12)","v":""},{"$f":"IF(Team7!$J$13=0, \"\", Team7!$J$13)","v":""},{"$f":"IF(Team7!$J$14=0, \"\", Team7!$J$14)","v":""},{"$f":"IF(Team7!$J$15=0, \"\", Team7!$J$15)","v":""},{"$f":"IF(Team7!$J$16=0, \"\", Team7!$J$16)","v":""},{"$f":"IF(Team7!$J$17=0, \"\", Team7!$J$17)","v":""},{"$f":"IF(Team7!$J$18=0, \"\", Team7!$J$18)","v":""},{"$f":"IF(Team7!$J$19=0, \"\", Team7!$J$19)","v":""},{"$f":"IF(Team7!$J$20=0, \"\", Team7!$J$20)","v":""},{"$f":"IF(Team7!$J$21=0, \"\", Team7!$J$21)","v":""},{"$f":"IF(Team7!$L$21=0, \"\", Team7!$L$21)","v":""},null,1,"","","",{"$f":"IF(BJ14=\"\", \"\", OFFSET(DM$8,MATCH(SMALL('Rank Wkst'!DD$8:DD$31,ROW()-ROW(DD$8)+1),DD$8:DD$31,0)-1,0))","v":""},{"$f":"IF(BJ14=\"\", \"\", OFFSET(DN$8,MATCH(SMALL('Rank Wkst'!DD$8:DD$31,ROW()-ROW(DD$8)+1),DD$8:DD$31,0)-1,0))","v":""},{"$f":"IF(BJ14=\"\", \"\", OFFSET(DO$8,MATCH(SMALL('Rank Wkst'!DD$8:DD$31,ROW()-ROW(DD$8)+1),DD$8:DD$31,0)-1,0))","v":""},"","","","","","","","","","","","",null,1,"",{"$f":"IF(BJ14=\"\", \"\", OFFSET(DM$8,MATCH(SMALL('Rank Wkst'!DD$8:DD$31,ROW()-ROW(DD$8)+1),DD$8:DD$31,0)-1,0))","v":""},{"$f":"IF(BJ14=\"\", \"\", OFFSET(DN$8,MATCH(SMALL('Rank Wkst'!DD$8:DD$31,ROW()-ROW(DD$8)+1),DD$8:DD$31,0)-1,0))","v":""},"","","","","","","","","","","","",null,7,{"$f":"IF('Ranking Sheet'!B18=0, \"\", 'Ranking Sheet'!B18)","v":""},"","","","","","","","","","","","","","","","",null,"","","","","","","","","","","","","","","","","","","","","","","","","","","",",,,,,,,,",",,,,,,,,/,,",",,,,,,,,,,,,,,,,/,,"]
[8,{"$f":"IF('Ranking Sheet'!B19=0, \"\", 'Ranking Sheet'!B19)","v":""},{"$f":"IF(Team8!$D$21=0, \"\", Team8!$D$21)","v":""},"","","","",{"$f":"IF(Team8!$E$21=0, \"\", Team8!$E$21)","v":""},"","","","",{"$f":"IF(Team8!$F$21=0, \"\", Team8!$F$21)","v":""},"","","","",{"$f":"IF(Team8!$G$21=0, \"\", Team8!$G$21)","v":""},"","","","",{"$f":"IF(Team8!$H$21=0, \"\", Team8!$H$21)","v":""},"","","","",{"$f":"IF(Team8!$I$21=0, \"\", Team8!$I$21)","v":""},"","","","",0,0,0,0,"","",{"$error":"#VALUE!"},99,1,24,{"$error":"#VALUE!"},"",0,"",1,"",24,12.5,"",0,0,0,"",1,"",24,12.5,"",1,1,1,{"$f":"IF(BJ15=\"\", \"\", SMALL(BJ$8:BJ$31, 8))","v":1},"","",{"$f":"COUNT($BJ$8:$BJ$31)-(RANK(BJ15,$BJ$8:$BJ$31,0)+COUNTIF(BJ$8:$BJ15,BJ15))+2","v":17},17,"","",{"$f":"IF(COUNTIF($BL$8:$BL38,BL15)>1,\"TIE\",\"\")","v":"TIE"},"TIE","","","","*","*","*","",null,0,"",1,24,12.5,"",0,"",1,24,12.5,"",{"$error":"#VALUE!"},0,"",1,24,12.5,"",1,1,1,{"$f":"IF(CW15=\"\", \"\", SMALL(CW$8:CW$31, 8))","v":1},1,1,"",{"$f":"COUNT($CW$8:$CW$31)-(RANK(CW15,$CW$8:$CW$31,0)+COUNTIF(CW$8:$CW15,CW15))+2","v":17},17,"","",{"$f":"IF(COUNTIF($CY$8:$CY38,CY15)>1,\"TIE\",\"\")","v":"TIE"},"TIE","TIE",null,8,{"$f":"IF('Ranking Sheet'!B19=0, \"\", 'Ranking Sheet'!B19)","v":""},{"$f":"IF(Team8!$J$9=0, \"\", Team8!$J$9)","v":""},{"$f":"IF(Team8!$J$10=0, \"\", Team8!$J$10)","v":""},{"$f":"IF(Team8!$J$11=0, \"\", Team8!$J$11)","v":""},{"$f":"IF(Team8!$J$12=0, \"\", Team8!$J$12)","v":""},{"$f":"IF(Team8!$J$13=0, \"\", Team8!$J$13)","v":""},{"$f":"IF(Team8!$J$14=0, \"\", Team8!$J$14)","v":""},{"$f":"IF(Team8!$J$15=0, \"\", Team8!$J$15)","v":""},{"$f":"IF(Team8!$J$16=0, \"\", Team8!$J$16)","v":""},{"$f":"IF(Team8!$J$17=0, \"\", Team8!$J$17)","v":""},{"$f":"IF(Team8!$J$18=0, \"\", Team8!$J$18)","v":""},{"$f":"IF(Team8!$J$19=0, \"\", Team8!$J$19)","v":""},{"$f":"IF(Team8!$J$20=0, \"\", Team8!$J$20)","v":""},{"$f":"IF(Team8!$J$21=0, \"\", Team8!$J$21)","v":""},{"$f":"IF(Team8!$L$21=0, \"\", Team8!$L$21)","v":""},null,1,"","","",{"$f":"IF(BJ15=\"\", \"\", OFFSET(DM$8,MATCH(SMALL('Rank Wkst'!DD$8:DD$31,ROW()-ROW(DD$8)+1),DD$8:DD$31,0)-1,0))","v":""},{"$f":"IF(BJ15=\"\", \"\", OFFSET(DN$8,MATCH(SMALL('Rank Wkst'!DD$8:DD$31,ROW()-ROW(DD$8)+1),DD$8:DD$31,0)-1,0))","v":""},{"$f":"IF(BJ15=\"\", \"\", OFFSET(DO$8,MATCH(SMALL('Rank Wkst'!DD$8:DD$31,ROW()-ROW(DD$8)+1),DD$8:DD$31,0)-1,0))","v":""},"","","","","","","","","","","","",null,1,"",{"$f":"IF(BJ15=\"\", \"\", OFFSET(DM$8,MATCH(SMALL('Rank Wkst'!DD$8:DD$31,ROW()-ROW(DD$8)+1),DD$8:DD$31,0)-1,0))","v":""},{"$f":"IF(BJ15=\"\", \"\", OFFSET(DN$8,MATCH(SMALL('Rank Wkst'!DD$8:DD$31,ROW()-ROW(DD$8)+1),DD$8:DD$31,0)-1,0))","v":""},"","","","","","","","","","","","",null,8,{"$f":"IF('Ranking Sheet'!B19=0, \"\", 'Ranking Sheet'!B19)","v":""},"","","","","","","","","","","","","","","","",null,"","","","","","","","","","","","","","","","","","","","","","","","","","","",",,,,,,,,",",,,,,,,,/,,",",,,,,,,,,,,,,,,,/,,"]
[9,{"$f":"IF('Ranking Sheet'!B20=0, \"\", 'Ranking Sheet'!B20)","v":""},{"$f":"IF(Team9!$D$21=0, \"\", Team9!$D$21)","v":""},"","","","",{"$f":"IF(Team9!$E$21=0, \"\", Team9!$E$21)","v":""},"","","","",{"$f":"IF(Team9!$F$21=0, \"\", Team9!$F$21)","v":""},"","","","",{"$f":"IF(Team9!$G$21=0, \"\", Team9!$G$21)","v":""},"","","","",{"$f":"IF(Team9!$H$21=0, \"\", Team9!$H$21)","v":""},"","","","",{"$f":"IF(Team9!$I$21=0, \"\", Team9!$I$21)","v":""},"","","","",{"$f":"SUM(F16,K16,P16,U16,Z16,AE16)","v":0},{"$f":"MIN(F16,K16,P16,U16,Z16,AE16)","v":0},{"$f":"MAX(F16,K16,P16,U16,Z16,AE16)","v":0},0,"","",{"$error":"#VALUE!"},99,1,24,{"$error":"#VALUE!"},"",0,"",1,"",24,12.5,"",0,0,0,"",1,"",24,12.5,"",1,1,1,{"$f":"IF(BJ16=\"\", \"\", SMALL(BJ$8:BJ$31, 9))","v":1},"","",{"$f":"COUNT($BJ$8:$BJ$31)-(RANK(BJ16,$BJ$8:$BJ$31,0)+COUNTIF(BJ$8:$BJ16,BJ16))+2","v":16},16,"","",{"$f":"IF(COUNTIF($BL$8:$BL39,BL16)>1,\"TIE\",\"\")","v":"TIE"},"TIE","","","",{"$f":"IF(AND(AP16>1, BK16<>\"DQ\"), \"*\", \"\")","v":"*"},"*","*","",null,0,"",1,24,12.5,"",0,"",1,24,12.5,"",{"$error":"#VALUE!"},0,"",1,24,12.5,"",1,1,1,{"$f":"IF(CW16=\"\", \"\", SMALL(CW$8:CW$31, 9))","v":1},1,1,"",{"$f":"COUNT($CW$8:$CW$31)-(RANK(CW16,$CW$8:$CW$31,0)+COUNTIF(CW$8:$CW16,CW16))+2","v":16},16,"","",{"$f":"IF(COUNTIF($CY$8:$CY39,CY16)>1,\"TIE\",\"\")","v":"TIE"},"TIE","TIE",null,9,{"$f":"IF('Ranking Sheet'!B20=0, \"\", 'Ranking Sheet'!B20)","v":""},{"$f":"IF(Team9!$J$9=0, \"\", Team9!$J$9)","v":""},{"$f":"IF(Team9!$J$10=0, \"\", Team9!$J$10)","v":""},{"$f":"IF(Team9!$J$11=0, \"\", Team9!$J$11)","v":""},{"$f":"IF(Team9!$J$12=0, \"\", Team9!$J$12)","v":""},{"$f":"IF(Team9!$J$13=0, \"\", Team9!$J$13)","v":""},{"$f":"IF(Team9!$J$14=0, \"\", Team9!$J$14)","v":""},{"$f":"IF(Team9!$J$15=0, \"\", Team9!$J$15)","v":""},{"$f":"IF(Team9!$J$16=0, \"\", Team9!$J$16)","v":""},{"$f":"IF(Team9!$J$17=0, \"\", Team9!$J$17)","v":""},{"$f":"IF(Team9!$J$18=0, \"\", Team9!$J$18)","v":""},{"$f":"IF(Team9!$J$19=0, \"\", Team9!$J$19)","v":""},{"$f":"IF(Team9!$J$20=0, \"\", Team9!$J$20)","v":""},{"$f":"IF(Team9!$J$21=0, \"\", Team9!$J$21)","v":""},{"$f":"IF(Team9!$L$21=0, \"\", Team9!$L$21)","v":""},null,1,"","","",{"$f":"IF(BJ16=\"\", \"\", OFFSET(DM$8,MATCH(SMALL('Rank Wkst'!DD$8:DD$31,ROW()-ROW(DD$8)+1),DD$8:DD$31,0)-1,0))","v":""},{"$f":"IF(BJ16=\"\", \"\", OFFSET(DN$8,MATCH(SMALL('Rank Wkst'!DD$8:DD$31,ROW()-ROW(DD$8)+1),DD$8:DD$31,0)-1,0))","v":""},{"$f":"IF(BJ16=\"\", \"\", OFFSET(DO$8,MATCH(SMALL('Rank Wkst'!DD$8:DD$31,ROW()-ROW(DD$8)+1),DD$8:DD$31,0)-1,0))","v":""},"","","","","","","","","","","","",null,1,"",{"$f":"IF(BJ16=\"\", \"\", OFFSET(DM$8,MATCH(SMALL('Rank Wkst'!DD$8:DD$31,ROW()-ROW(DD$8)+1),DD$8:DD$31,0)-1,0))","v":""},{"$f":"IF(BJ16=\"\", \"\", OFFSET(DN$8,MATCH(SMALL('Rank Wkst'!DD$8:DD$31,ROW()-ROW(DD$8)+1),DD$8:DD$31,0)-1,0))","v":""},"","","","","","","","","","","","",null,9,{"$f":"IF('Ranking Sheet'!B20=0, \"\", 'Ranking Sheet'!B20)","v":""},"","","","","","","","","","","","","","","","",null,"","","","","","","","","","","","","","","","","","","","","","","","","","","",",,,,,,,,",",,,,,,,,/,,",",,,,,,,,,,,,,,,,/,,"]
[10,{"$f":"IF('Ranking Sheet'!B21=0, \"\", 'Ranking Sheet'!B21)","v":""},{"$f":"IF(Team10!$D$21=0, \"\", Team10!$D$21)","v":""},"","","","",{"$f":"IF(Team10!$E$21=0, \"\", Team10!$E$21)","v":""},"","","","",{"$f":"IF(Team10!$F$21=0, \"\", Team10!$F$21)","v":""},"","","","",{"$f":"IF(Team10!$G$21=0, \"\", Team10!$G$21)","v":""},"","","","",{"$f":"IF(Team10!$H$21=0, \"\", Team10!$H$21)","v":""},"","","","",{"$f":"IF(Team10!$I$21=0, \"\", Team10!$I$21)","v":""},"","","","",0,0,0,0,"","",{"$error":"#VALUE!"},99,1,24,{"$error":"#VALUE!"},"",0,"",1,"",24,12.5,"",0,0,0,"",1,"",{"$f":"COUNTIF(BD$8:BD$31,BD17)","v":24},12.5,"",1,1,1,{"$f":"IF(BJ17=\"\", \"\", SMALL(BJ$8:BJ$31, 10))","v":1},"","",{"$f":"COUNT($BJ$8:$BJ$31)-(RANK(BJ17,$BJ$8:$BJ$31,0)+COUNTIF(BJ$8:$BJ17,BJ17))+2","v":15},15,"","",{"$f":"IF(COUNTIF($BL$8:$BL40,BL17)>1,\"TIE\",\"\")","v":"TIE"},"TIE","","","","*","*","*","",null,0,"",1,24,12.5,"",0,"",1,24,12.5,"",{"$error":"#VALUE!"},0,"",1,24,12.5,"",1,1,1,{"$f":"IF(CW17=\"\", \"\", SMALL(CW$8:CW$31, 10))","v":1},1,1,"",{"$f":"COUNT($CW$8:$CW$31)-(RANK(CW17,$CW$8:$CW$31,0)+COUNTIF(CW$8:$CW17,CW17))+2","v":15},15,"","",{"$f":"IF(COUNTIF($CY$8:$CY40,CY17)>1,\"TIE\",\"\")","v":"TIE"},"TIE","TIE",null,10,{"$f":"IF('Ranking Sheet'!B21=0, \"\", 'Ranking Sheet'!B21)","v":""},{"$f":"IF(Team10!$J$9=0, \"\", Team10!$J$9)","v":""},{"$f":"IF(Team10!$J$10=0, \"\", Team10!$J$10)","v":""},{"$f":"IF(Team10!$J$11=0, \"\", Team10!$J$11)","v":""},{"$f":"IF(Team10!$J$12=0, \"\", Team10!$J$12)","v":""},{"$f":"IF(Team10!$J$13=0, \"\", Team10!$J$13)","v":""},{"$f":"IF(Team10!$J$14=0, \"\", Team10!$J$14)","v":""},{"$f":"IF(Team10!$J$15=0, \"\", Team10!$J$15)","v":""},{"$f":"IF(Team10!$J$16=0, \"\", Team10!$J$16)","v":""},{"$f":"IF(Team10!$J$17=0, \"\", Team10!$J$17)","v":""},{"$f":"IF(Team10!$J$18=0, \"\", Team10!$J$18)","v":""},{"$f":"IF(Team10!$J$19=0, \"\", Team10!$J$19)","v":""},{"$f":"IF(Team10!$J$20=0, \"\", Team10!$J$20)","v":""},{"$f":"IF(Team10!$J$21=0, \"\", Team10!$J$21)","v":""},{"$f":"IF(Team10!$L$21=0, \"\", Team10!$L$21)","v":""},null,1,"","","",{"$f":"IF(BJ17=\"\", \"\", OFFSET(DM$8,MATCH(SMALL('Rank Wkst'!DD$8:DD$31,ROW()-ROW(DD$8)+1),DD$8:DD$31,0)-1,0))","v":""},{"$f":"IF(BJ17=\"\", \"\", OFFSET(DN$8,MATCH(SMALL('Rank Wkst'!DD$8:DD$31,ROW()-ROW(DD$8)+1),DD$8:DD$31,0)-1,0))","v":""},{"$f":"IF(BJ17=\"\", \"\", OFFSET(DO$8,MATCH(SMALL('Rank Wkst'!DD$8:DD$31,ROW()-ROW(DD$8)+1),DD$8:DD$31,0)-1,0))","v":""},"","","","","","","","","","","","",null,1,"",{"$f":"IF(BJ17=\"\", \"\", OFFSET(DM$8,MATCH(SMALL('Rank Wkst'!DD$8:DD$31,ROW()-ROW(DD$8)+1),DD$8:DD$31,0)-1,0))","v":""},{"$f":"IF(BJ17=\"\", \"\", OFFSET(DN$8,MATCH(SMALL('Rank Wkst'!DD$8:DD$31,ROW()-ROW(DD$8)+1),DD$8:DD$31,0)-1,0))","v":""},"","","","","","","","","","","","",null,10,{"$f":"IF('Ranking Sheet'!B21=0, \"\", 'Ranking Sheet'!B21)","v":""},"","","","","","","","","","","","","","","","",null,"","","","","","","","","","","","","","","","","","","","","","","","","","","",",,,,,,,,",",,,,,,,,/,,",",,,,,,,,,,,,,,,,/,,"]
[11,{"$f":"IF('Ranking Sheet'!B22=0, \"\", 'Ranking Sheet'!B22)","v":""},{"$f":"IF(Team11!$D$21=0, \"\", Team11!$D$21)","v":""},"","","","",{"$f":"IF(Team11!$E$21=0, \"\", Team11!$E$21)","v":""},"","","","",{"$f":"IF(Team11!$F$21=0, \"\", Team11!$F$21)","v":""},"","","","",{"$f":"IF(Team11!$G$21=0, \"\", Team11!$G$21)","v":""},"","","","",{"$f":"IF(Team11!$H$21=0, \"\", Team11!$H$21)","v":""},"","","","",{"$f":"IF(Team11!$I$21=0, \"\", Team11!$I$21)","v":""},"","","","",0,0,0,0,"","",{"$error":"#VALUE!"},99,1,24,{"$error":"#VALUE!"},"",0,"",1,"",24,12.5,"",0,0,0,"",1,"",24,12.5,"",1,1,1,{"$f":"IF(BJ18=\"\",\"\",SMALL(BJ$8:BJ$31,11))","v":1},"","",{"$f":"COUNT($BJ$8:$BJ$31)-(RANK(BJ18,$BJ$8:$BJ$31,0)+COUNTIF(BJ$8:$BJ18,BJ18))+2","v":14},14,"","",{"$f":"IF(COUNTIF($BL$8:$BL41,BL18)>1,\"TIE\",\"\")","v":"TIE"},"TIE","","","","*","*","*","",null,0,"",1,24,12.5,"",0,"",1,24,12.5,"",{"$error":"#VALUE!"},0,"",1,24,12.5,"",1,1,1,{"$f":"IF(CW18=\"\",\"\",SMALL(CW$8:CW$31,11))","v":1},1,1,"",{"$f":"COUNT($CW$8:$CW$31)-(RANK(CW18,$CW$8:$CW$31,0)+COUNTIF(CW$8:$CW18,CW18))+2","v":14},14,"","",{"$f":"IF(COUNTIF($CY$8:$CY41,CY18)>1,\"TIE\",\"\")","v":"TIE"},"TIE","TIE",null,11,{"$f":"IF('Ranking Sheet'!B22=0, \"\", 'Ranking Sheet'!B22)","v":""},{"$f":"IF(Team11!$J$9=0, \"\", Team11!$J$9)","v":""},{"$f":"IF(Team11!$J$10=0, \"\", Team11!$J$10)","v":""},{"$f":"IF(Team11!$J$11=0, \"\", Team11!$J$11)","v":""},{"$f":"IF(Team11!$J$12=0, \"\", Team11!$J$12)","v":""},{"$f":"IF(Team11!$J$13=0, \"\", Team11!$J$13)","v":""},{"$f":"IF(Team11!$J$14=0, \"\", Team11!$J$14)","v":""},{"$f":"IF(Team11!$J$15=0, \"\", Team11!$J$15)","v":""},{"$f":"IF(Team11!$J$16=0, \"\", Team11!$J$16)","v":""},{"$f":"IF(Team11!$J$17=0, \"\", Team11!$J$17)","v":""},{"$f":"IF(Team11!$J$18=0, \"\", Team11!$J$18)","v":""},{"$f":"IF(Team11!$J$19=0, \"\", Team11!$J$19)","v":""},{"$f":"IF(Team11!$J$20=0, \"\", Team11!$J$20)","v":""},{"$f":"IF(Team11!$J$21=0, \"\", Team11!$J$21)","v":""},{"$f":"IF(Team11!$L$21=0, \"\", Team11!$L$21)","v":""},null,1,"","","",{"$f":"IF(BJ18=\"\", \"\", OFFSET(DM$8,MATCH(SMALL('Rank Wkst'!DD$8:DD$31,ROW()-ROW(DD$8)+1),DD$8:DD$31,0)-1,0))","v":""},{"$f":"IF(BJ18=\"\", \"\", OFFSET(DN$8,MATCH(SMALL('Rank Wkst'!DD$8:DD$31,ROW()-ROW(DD$8)+1),DD$8:DD$31,0)-1,0))","v":""},{"$f":"IF(BJ18=\"\", \"\", OFFSET(DO$8,MATCH(SMALL('Rank Wkst'!DD$8:DD$31,ROW()-ROW(DD$8)+1),DD$8:DD$31,0)-1,0))","v":""},"","","","","","","","","","","","",null,1,"",{"$f":"IF(BJ18=\"\", \"\", OFFSET(DM$8,MATCH(SMALL('Rank Wkst'!DD$8:DD$31,ROW()-ROW(DD$8)+1),DD$8:DD$31,0)-1,0))","v":""},{"$f":"IF(BJ18=\"\", \"\", OFFSET(DN$8,MATCH(SMALL('Rank Wkst'!DD$8:DD$31,ROW()-ROW(DD$8)+1),DD$8:DD$31,0)-1,0))","v":""},"","","","","","","","","","","","",null,11,{"$f":"IF('Ranking Sheet'!B22=0, \"\", 'Ranking Sheet'!B22)","v":""},"","","","","","","","","","","","","","","","",null,"","","","","","","","","","","","","","","","","","","","","","","","","","","",",,,,,,,,",",,,,,,,,/,,",",,,,,,,,,,,,,,,,/,,"]
[12,{"$f":"IF('Ranking Sheet'!B23=0, \"\", 'Ranking Sheet'!B23)","v":""},{"$f":"IF(Team12!$D$21=0, \"\", Team12!$D$21)","v":""},"","","","",{"$f":"IF(Team12!$E$21=0, \"\", Team12!$E$21)","v":""},"","","","",{"$f":"IF(Team12!$F$21=0, \"\", Team12!$F$21)","v":""},"","","","",{"$f":"IF(Team12!$G$21=0, \"\", Team12!$G$21)","v":""},"","","","",{"$f":"IF(Team12!$H$21=0, \"\", Team12!$H$21)","v":""},"","","","",{"$f":"IF(Team12!$I$21=0, \"\", Team12!$I$21)","v":""},"","","","",0,0,0,0,"","",{"$error":"#VALUE!"},99,1,24,{"$error":"#VALUE!"},"",0,"",1,"",24,12.5,"",0,0,0,"",1,"",24,12.5,"",1,1,1,{"$f":"IF(BJ19=\"\", \"\", SMALL(BJ$8:BJ$31, 12))","v":1},"","",{"$f":"COUNT($BJ$8:$BJ$31)-(RANK(BJ19,$BJ$8:$BJ$31,0)+COUNTIF(BJ$8:$BJ19,BJ19))+2","v":13},13,"","",{"$f":"IF(COUNTIF($BL$8:$BL42,BL19)>1,\"TIE\",\"\")","v":"TIE"},"TIE","","","","*","*","*","",null,0,"",1,24,12.5,"",0,"",1,24,12.5,"",{"$error":"#VALUE!"},0,"",1,24,12.5,"",1,1,1,{"$f":"IF(CW19=\"\", \"\", SMALL(CW$8:CW$31, 12))","v":1},1,1,"",{"$f":"COUNT($CW$8:$CW$31)-(RANK(CW19,$CW$8:$CW$31,0)+COUNTIF(CW$8:$CW19,CW19))+2","v":13},13,"","",{"$f":"IF(COUNTIF($CY$8:$CY42,CY19)>1,\"TIE\",\"\")","v":"TIE"},"TIE","TIE",null,12,{"$f":"IF('Ranking Sheet'!B23=0, \"\", 'Ranking Sheet'!B23)","v":""},{"$f":"IF(Team12!$J$9=0, \"\", Team12!$J$9)","v":""},{"$f":"IF(Team12!$J$10=0, \"\", Team12!$J$10)","v":""},{"$f":"IF(Team12!$J$11=0, \"\", Team12!$J$11)","v":""},{"$f":"IF(Team12!$J$12=0, \"\", Team12!$J$12)","v":""},{"$f":"IF(Team12!$J$13=0, \"\", Team12!$J$13)","v":""},{"$f":"IF(Team12!$J$14=0, \"\", Team12!$J$14)","v":""},{"$f":"IF(Team12!$J$15=0, \"\", Team12!$J$15)","v":""},{"$f":"IF(Team12!$J$16=0, \"\", Team12!$J$16)","v":""},{"$f":"IF(Team12!$J$17=0, \"\", Team12!$J$17)","v":""},{"$f":"IF(Team12!$J$18=0, \"\", Team12!$J$18)","v":""},{"$f":"IF(Team12!$J$19=0, \"\", Team12!$J$19)","v":""},{"$f":"IF(Team12!$J$20=0, \"\", Team12!$J$20)","v":""},{"$f":"IF(Team12!$J$21=0, \"\", Team12!$J$21)","v":""},{"$f":"IF(Team12!$L$21=0, \"\", Team12!$L$21)","v":""},null,1,"","","",{"$f":"IF(BJ19=\"\", \"\", OFFSET(DM$8,MATCH(SMALL('Rank Wkst'!DD$8:DD$31,ROW()-ROW(DD$8)+1),DD$8:DD$31,0)-1,0))","v":""},{"$f":"IF(BJ19=\"\", \"\", OFFSET(DN$8,MATCH(SMALL('Rank Wkst'!DD$8:DD$31,ROW()-ROW(DD$8)+1),DD$8:DD$31,0)-1,0))","v":""},{"$f":"IF(BJ19=\"\", \"\", OFFSET(DO$8,MATCH(SMALL('Rank Wkst'!DD$8:DD$31,ROW()-ROW(DD$8)+1),DD$8:DD$31,0)-1,0))","v":""},"","","","","","","","","","","","",null,1,"",{"$f":"IF(BJ19=\"\", \"\", OFFSET(DM$8,MATCH(SMALL('Rank Wkst'!DD$8:DD$31,ROW()-ROW(DD$8)+1),DD$8:DD$31,0)-1,0))","v":""},{"$f":"IF(BJ19=\"\", \"\", OFFSET(DN$8,MATCH(SMALL('Rank Wkst'!DD$8:DD$31,ROW()-ROW(DD$8)+1),DD$8:DD$31,0)-1,0))","v":""},"","","","","","","","","","","","",null,12,{"$f":"IF('Ranking Sheet'!B23=0, \"\", 'Ranking Sheet'!B23)","v":""},"","","","","","","","","","","","","","","","",null,"","","","","","","","","","","","","","","","","","","","","","","","","","","",",,,,,,,,",",,,,,,,,/,,",",,,,,,,,,,,,,,,,/,,"]
[13,{"$f":"IF('Ranking Sheet'!B24=0, \"\", 'Ranking Sheet'!B24)","v":""},{"$f":"IF(Team13!$D$21=0, \"\", Team13!$D$21)","v":""},"","","","",{"$f":"IF(Team13!$E$21=0, \"\", Team13!$E$21)","v":""},"","","","",{"$f":"IF(Team13!$F$21=0, \"\", Team13!$F$21)","v":""},"","","","",{"$f":"IF(Team13!$G$21=0, \"\", Team13!$G$21)","v":""},"","","","",{"$f":"IF(Team13!$H$21=0, \"\", Team13!$H$21)","v":""},"","","","",{"$f":"IF(Team13!$I$21=0, \"\", Team13!$I$21)","v":""},"","","","",0,0,0,0,"","",{"$error":"#VALUE!"},99,1,24,{"$error":"#VALUE!"},"",0,"",1,"",24,12.5,"",0,0,0,"",1,"",24,12.5,"",1,1,1,{"$f":"IF(BJ20=\"\", \"\", SMALL(BJ$8:BJ$31, 13))","v":1},"","",{"$f":"COUNT($BJ$8:$BJ$31)-(RANK(BJ20,$BJ$8:$BJ$31,0)+COUNTIF(BJ$8:$BJ20,BJ20))+2","v":12},12,"","",{"$f":"IF(COUNTIF($BL$8:$BL43,BL20)>1,\"TIE\",\"\")","v":"TIE"},"TIE","","","","*","*","*","",null,0,"",1,24,12.5,"",0,"",1,24,12.5,"",{"$error":"#VALUE!"},0,"",1,24,12.5,"",1,1,1,{"$f":"IF(CW20=\"\", \"\", SMALL(CW$8:CW$31, 13))","v":1},1,1,"",{"$f":"COUNT($CW$8:$CW$31)-(RANK(CW20,$CW$8:$CW$31,0)+COUNTIF(CW$8:$CW20,CW20))+2","v":12},12,"","",{"$f":"IF(COUNTIF($CY$8:$CY43,CY20)>1,\"TIE\",\"\")","v":"TIE"},"TIE","TIE",null,13,{"$f":"IF('Ranking Sheet'!B24=0, \"\", 'Ranking Sheet'!B24)","v":""},{"$f":"IF(Team13!$J$9=0, \"\", Team13!$J$9)","v":""},{"$f":"IF(Team13!$J$10=0, \"\", Team13!$J$10)","v":""},{"$f":"IF(Team13!$J$11=0, \"\", Team13!$J$11)","v":""},{"$f":"IF(Team13!$J$12=0, \"\", Team13!$J$12)","v":""},{"$f":"IF(Team13!$J$13=0, \"\", Team13!$J$13)","v":""},{"$f":"IF(Team13!$J$14=0, \"\", Team13!$J$14)","v":""},{"$f":"IF(Team13!$J$15=0, \"\", Team13!$J$15)","v":""},{"$f":"IF(Team13!$J$16=0, \"\", Team13!$J$16)","v":""},{"$f":"IF(Team13!$J$17=0, \"\", Team13!$J$17)","v":""},{"$f":"IF(Team13!$J$18=0, \"\", Team13!$J$18)","v":""},{"$f":"IF(Team13!$J$19=0, \"\", Team13!$J$19)","v":""},{"$f":"IF(Team13!$J$20=0, \"\", Team13!$J$20)","v":""},{"$f":"IF(Team13!$J$21=0, \"\", Team13!$J$21)","v":""},{"$f":"IF(Team13!$L$21=0, \"\", Team13!$L$21)","v":""},null,1,"","","",{"$f":"IF(BJ20=\"\", \"\", OFFSET(DM$8,MATCH(SMALL('Rank Wkst'!DD$8:DD$31,ROW()-ROW(DD$8)+1),DD$8:DD$31,0)-1,0))","v":""},{"$f":"IF(BJ20=\"\", \"\", OFFSET(DN$8,MATCH(SMALL('Rank Wkst'!DD$8:DD$31,ROW()-ROW(DD$8)+1),DD$8:DD$31,0)-1,0))","v":""},{"$f":"IF(BJ20=\"\", \"\", OFFSET(DO$8,MATCH(SMALL('Rank Wkst'!DD$8:DD$31,ROW()-ROW(DD$8)+1),DD$8:DD$31,0)-1,0))","v":""},"","","","","","","","","","","","",null,1,"",{"$f":"IF(BJ20=\"\", \"\", OFFSET(DM$8,MATCH(SMALL('Rank Wkst'!DD$8:DD$31,ROW()-ROW(DD$8)+1),DD$8:DD$31,0)-1,0))","v":""},{"$f":"IF(BJ20=\"\", \"\", OFFSET(DN$8,MATCH(SMALL('Rank Wkst'!DD$8:DD$31,ROW()-ROW(DD$8)+1),DD$8:DD$31,0)-1,0))","v":""},"","","","","","","","","","","","",null,13,{"$f":"IF('Ranking Sheet'!B24=0, \"\", 'Ranking Sheet'!B24)","v":""},"","","","","","","","","","","","","","","","",null,"","","","","","","","","","","","","","","","","","","","","","","","","","","",",,,,,,,,",",,,,,,,,/,,",",,,,,,,,,,,,,,,,/,,"]
[14,{"$f":"IF('Ranking Sheet'!B25=0, \"\", 'Ranking Sheet'!B25)","v":""},{"$f":"IF(Team14!$D$21=0, \"\", Team14!$D$21)","v":""},"","","","",{"$f":"IF(Team14!$E$21=0, \"\", Team14!$E$21)","v":""},"","","","",{"$f":"IF(Team14!$F$21=0, \"\", Team14!$F$21)","v":""},"","","","",{"$f":"IF(Team14!$G$21=0, \"\", Team14!$G$21)","v":""},"","","","",{"$f":"IF(Team14!$H$21=0, \"\", Team14!$H$21)","v":""},"","","","",{"$f":"IF(Team14!$I$21=0, \"\", Team14!$I$21)","v":""},"","","","",0,0,0,0,"","",{"$error":"#VALUE!"},99,1,24,{"$error":"#VALUE!"},"",0,"",1,"",24,12.5,"",0,0,0,"",1,"",24,12.5,"",1,1,1,{"$f":"IF(BJ21=\"\", \"\", SMALL(BJ$8:BJ$31, 14))","v":1},"","",{"$f":"COUNT($BJ$8:$BJ$31)-(RANK(BJ21,$BJ$8:$BJ$31,0)+COUNTIF(BJ$8:$BJ21,BJ21))+2","v":11},11,{"$f":"OFFSET(B$8,MATCH(SMALL(BP$8:BP$31,ROW()-ROW(BQ$8)+1),BP$8:BP$31,0)-1,0)","v":""},"",{"$f":"IF(COUNTIF($BL$8:$BL44,BL21)>1,\"TIE\",\"\")","v":"TIE"},"TIE","","","","*","*","*","",null,0,"",1,24,12.5,"",0,"",1,24,12.5,"",{"$error":"#VALUE!"},0,"",1,24,12.5,"",1,1,1,{"$f":"IF(CW21=\"\", \"\", SMALL(CW$8:CW$31, 14))","v":1},1,1,"",{"$f":"COUNT($CW$8:$CW$31)-(RANK(CW21,$CW$8:$CW$31,0)+COUNTIF(CW$8:$CW21,CW21))+2","v":11},11,"","",{"$f":"IF(COUNTIF($CY$8:$CY44,CY21)>1,\"TIE\",\"\")","v":"TIE"},"TIE","TIE",null,14,{"$f":"IF('Ranking Sheet'!B25=0, \"\", 'Ranking Sheet'!B25)","v":""},{"$f":"IF(Team14!$J$9=0, \"\", Team14!$J$9)","v":""},{"$f":"IF(Team14!$J$10=0, \"\", Team14!$J$10)","v":""},{"$f":"IF(Team14!$J$11=0, \"\", Team14!$J$11)","v":""},{"$f":"IF(Team14!$J$12=0, \"\", Team14!$J$12)","v":""},{"$f":"IF(Team14!$J$13=0, \"\", Team14!$J$13)","v":""},{"$f":"IF(Team14!$J$14=0, \"\", Team14!$J$14)","v":""},{"$f":"IF(Team14!$J$15=0, \"\", Team14!$J$15)","v":""},{"$f":"IF(Team14!$J$16=0, \"\", Team14!$J$16)","v":""},{"$f":"IF(Team14!$J$17=0, \"\", Team14!$J$17)","v":""},{"$f":"IF(Team14!$J$18=0, \"\", Team14!$J$18)","v":""},{"$f":"IF(Team14!$J$19=0, \"\", Team14!$J$19)","v":""},{"$f":"IF(Team14!$J$20=0, \"\", Team14!$J$20)","v":""},{"$f":"IF(Team14!$J$21=0, \"\", Team14!$J$21)","v":""},{"$f":"IF(Team14!$L$21=0, \"\", Team14!$L$21)","v":""},null,1,"","","",{"$f":"IF(BJ21=\"\", \"\", OFFSET(DM$8,MATCH(SMALL('Rank Wkst'!DD$8:DD$31,ROW()-ROW(DD$8)+1),DD$8:DD$31,0)-1,0))","v":""},{"$f":"IF(BJ21=\"\", \"\", OFFSET(DN$8,MATCH(SMALL('Rank Wkst'!DD$8:DD$31,ROW()-ROW(DD$8)+1),DD$8:DD$31,0)-1,0))","v":""},{"$f":"IF(BJ21=\"\", \"\", OFFSET(DO$8,MATCH(SMALL('Rank Wkst'!DD$8:DD$31,ROW()-ROW(DD$8)+1),DD$8:DD$31,0)-1,0))","v":""},"","","","","","","","","","","","",null,1,"",{"$f":"IF(BJ21=\"\", \"\", OFFSET(DM$8,MATCH(SMALL('Rank Wkst'!DD$8:DD$31,ROW()-ROW(DD$8)+1),DD$8:DD$31,0)-1,0))","v":""},{"$f":"IF(BJ21=\"\", \"\", OFFSET(DN$8,MATCH(SMALL('Rank Wkst'!DD$8:DD$31,ROW()-ROW(DD$8)+1),DD$8:DD$31,0)-1,0))","v":""},"","","","","","","","","","","","",null,14,{"$f":"IF('Ranking Sheet'!B25=0, \"\", 'Ranking Sheet'!B25)","v":""},"","","","","","","","","","","","","","","","",null,"","","","","","","","","","","","","","","","","","","","","","","","","","","",",,,,,,,,",",,,,,,,,/,,",",,,,,,,,,,,,,,,,/,,"]
[15,{"$f":"IF('Ranking Sheet'!B26=0, \"\", 'Ranking Sheet'!B26)","v":""},{"$f":"IF(Team15!$D$21=0, \"\", Team15!$D$21)","v":""},"","","","",{"$f":"IF(Team15!$E$21=0, \"\", Team15!$E$21)","v":""},"","","","",{"$f":"IF(Team15!$F$21=0, \"\", Team15!$F$21)","v":""},"","","","",{"$f":"IF(Team15!$G$21=0, \"\", Team15!$G$21)","v":""},"","","","",{"$f":"IF(Team15!$H$21=0, \"\", Team15!$H$21)","v":""},"","","","",{"$f":"IF(Team15!$I$21=0, \"\", Team15!$I$21)","v":""},"","","","",0,0,0,0,"","",{"$error":"#VALUE!"},99,1,24,{"$error":"#VALUE!"},"",0,"",1,"",24,12.5,"",0,0,0,"",1,"",24,12.5,"",1,1,1,{"$f":"IF(BJ22=\"\", \"\", SMALL(BJ$8:BJ$31, 15))","v":1},"","",{"$f":"COUNT($BJ$8:$BJ$31)-(RANK(BJ22,$BJ$8:$BJ$31,0)+COUNTIF(BJ$8:$BJ22,BJ22))+2","v":10},10,"","",{"$f":"IF(COUNTIF($BL$8:$BL45,BL22)>1,\"TIE\",\"\")","v":"TIE"},"TIE",{"$f":"IF(AG22<>0, IF(BL22<>\"\",BS22),  \"\")","v":""},"","","*","*","*","",null,0,"",1,24,12.5,"",0,"",1,24,12.5,"",{"$error":"#VALUE!"},0,"",1,24,12.5,"",1,1,1,{"$f":"IF(CW22=\"\", \"\", SMALL(CW$8:CW$31, 15))","v":1},1,1,"",{"$f":"COUNT($CW$8:$CW$31)-(RANK(CW22,$CW$8:$CW$31,0)+COUNTIF(CW$8:$CW22,CW22))+2","v":10},10,"","",{"$f":"IF(COUNTIF($CY$8:$CY45,CY22)>1,\"TIE\",\"\")","v":"TIE"},"TIE","TIE",null,15,{"$f":"IF('Ranking Sheet'!B26=0, \"\", 'Ranking Sheet'!B26)","v":""},{"$f":"IF(Team15!$J$9=0, \"\", Team15!$J$9)","v":""},{"$f":"IF(Team15!$J$10=0, \"\", Team15!$J$10)","v":""},{"$f":"IF(Team15!$J$11=0, \"\", Team15!$J$11)","v":""},{"$f":"IF(Team15!$J$12=0, \"\", Team15!$J$12)","v":""},{"$f":"IF(Team15!$J$13=0, \"\", Team15!$J$13)","v":""},{"$f":"IF(Team15!$J$14=0, \"\", Team15!$J$14)","v":""},{"$f":"IF(Team15!$J$15=0, \"\", Team15!$J$15)","v":""},{"$f":"IF(Team15!$J$16=0, \"\", Team15!$J$16)","v":""},{"$f":"IF(Team15!$J$17=0, \"\", Team15!$J$17)","v":""},{"$f":"IF(Team15!$J$18=0, \"\", Team15!$J$18)","v":""},{"$f":"IF(Team15!$J$19=0, \"\", Team15!$J$19)","v":""},{"$f":"IF(Team15!$J$20=0, \"\", Team15!$J$20)","v":""},{"$f":"IF(Team15!$J$21=0, \"\", Team15!$J$21)","v":""},{"$f":"IF(Team15!$L$21=0, \"\", Team15!$L$21)","v":""},null,1,"","","",{"$f":"IF(BJ22=\"\", \"\", OFFSET(DM$8,MATCH(SMALL('Rank Wkst'!DD$8:DD$31,ROW()-ROW(DD$8)+1),DD$8:DD$31,0)-1,0))","v":""},{"$f":"IF(BJ22=\"\", \"\", OFFSET(DN$8,MATCH(SMALL('Rank Wkst'!DD$8:DD$31,ROW()-ROW(DD$8)+1),DD$8:DD$31,0)-1,0))","v":""},{"$f":"IF(BJ22=\"\", \"\", OFFSET(DO$8,MATCH(SMALL('Rank Wkst'!DD$8:DD$31,ROW()-ROW(DD$8)+1),DD$8:DD$31,0)-1,0))","v":""},"","","","","","","","","","","","",null,1,"",{"$f":"IF(BJ22=\"\", \"\", OFFSET(DM$8,MATCH(SMALL('Rank Wkst'!DD$8:DD$31,ROW()-ROW(DD$8)+1),DD$8:DD$31,0)-1,0))","v":""},{"$f":"IF(BJ22=\"\", \"\", OFFSET(DN$8,MATCH(SMALL('Rank Wkst'!DD$8:DD$31,ROW()-ROW(DD$8)+1),DD$8:DD$31,0)-1,0))","v":""},"","","","","","","","","","","","",null,15,{"$f":"IF('Ranking Sheet'!B26=0, \"\", 'Ranking Sheet'!B26)","v":""},"","","","","","","","","","","","","","","","",null,"","","","","","","","","","","","","","","","","","","","","","","","","","","",",,,,,,,,",",,,,,,,,/,,",",,,,,,,,,,,,,,,,/,,"]
[16,{"$f":"IF('Ranking Sheet'!B27=0, \"\", 'Ranking Sheet'!B27)","v":""},{"$f":"IF(Team16!$D$21=0, \"\", Team16!$D$21)","v":""},"","","","",{"$f":"IF(Team16!$E$21=0, \"\", Team16!$E$21)","v":""},"","","","",{"$f":"IF(Team16!$F$21=0, \"\", Team16!$F$21)","v":""},"","","","",{"$f":"IF(Team16!$G$21=0, \"\", Team16!$G$21)","v":""},"","","","",{"$f":"IF(Team16!$H$21=0, \"\", Team16!$H$21)","v":""},"","","","",{"$f":"IF(Team16!$I$21=0, \"\", Team16!$I$21)","v":""},"","","","",0,0,0,0,"","",{"$error":"#VALUE!"},99,1,24,{"$error":"#VALUE!"},"",0,"",1,"",24,12.5,"",0,0,0,"",1,"",24,12.5,"",1,1,1,{"$f":"IF(BJ23=\"\", \"\", SMALL(BJ$8:BJ$31, 16))","v":1},"","",{"$f":"COUNT($BJ$8:$BJ$31)-(RANK(BJ23,$BJ$8:$BJ$31,0)+COUNTIF(BJ$8:$BJ23,BJ23))+2","v":9},9,"","",{"$f":"IF(COUNTIF($BL$8:$BL46,BL23)>1,\"TIE\",\"\")","v":"TIE"},"TIE","",{"$f":"OFFSET(AL$8,MATCH(SMALL(BP$8:BP$31,ROW()-ROW(BQ$8)+1),BP$8:BP$31,0)-1,0)","v":""},"","*","*","*","",null,0,"",1,24,12.5,"",0,"",1,24,12.5,"",{"$error":"#VALUE!"},0,"",1,24,12.5,"",1,1,1,{"$f":"IF(CW23=\"\", \"\", SMALL(CW$8:CW$31, 16))","v":1},1,1,"",{"$f":"COUNT($CW$8:$CW$31)-(RANK(CW23,$CW$8:$CW$31,0)+COUNTIF(CW$8:$CW23,CW23))+2","v":9},9,"","",{"$f":"IF(COUNTIF($CY$8:$CY46,CY23)>1,\"TIE\",\"\")","v":"TIE"},"TIE","TIE",null,16,{"$f":"IF('Ranking Sheet'!B27=0, \"\", 'Ranking Sheet'!B27)","v":""},{"$f":"IF(Team16!$J$9=0, \"\", Team16!$J$9)","v":""},{"$f":"IF(Team16!$J$10=0, \"\", Team16!$J$10)","v":""},{"$f":"IF(Team16!$J$11=0, \"\", Team16!$J$11)","v":""},{"$f":"IF(Team16!$J$12=0, \"\", Team16!$J$12)","v":""},{"$f":"IF(Team16!$J$13=0, \"\", Team16!$J$13)","v":""},{"$f":"IF(Team16!$J$14=0, \"\", Team16!$J$14)","v":""},{"$f":"IF(Team16!$J$15=0, \"\", Team16!$J$15)","v":""},{"$f":"IF(Team16!$J$16=0, \"\", Team16!$J$16)","v":""},{"$f":"IF(Team16!$J$17=0, \"\", Team16!$J$17)","v":""},{"$f":"IF(Team16!$J$18=0, \"\", Team16!$J$18)","v":""},{"$f":"IF(Team16!$J$19=0, \"\", Team16!$J$19)","v":""},{"$f":"IF(Team16!$J$20=0, \"\", Team16!$J$20)","v":""},{"$f":"IF(Team16!$J$21=0, \"\", Team16!$J$21)","v":""},{"$f":"IF(Team16!$L$21=0, \"\", Team16!$L$21)","v":""},null,1,"","","",{"$f":"IF(BJ23=\"\", \"\", OFFSET(DM$8,MATCH(SMALL('Rank Wkst'!DD$8:DD$31,ROW()-ROW(DD$8)+1),DD$8:DD$31,0)-1,0))","v":""},{"$f":"IF(BJ23=\"\", \"\", OFFSET(DN$8,MATCH(SMALL('Rank Wkst'!DD$8:DD$31,ROW()-ROW(DD$8)+1),DD$8:DD$31,0)-1,0))","v":""},{"$f":"IF(BJ23=\"\", \"\", OFFSET(DO$8,MATCH(SMALL('Rank Wkst'!DD$8:DD$31,ROW()-ROW(DD$8)+1),DD$8:DD$31,0)-1,0))","v":""},"","","","","","","","","","","","",null,1,"",{"$f":"IF(BJ23=\"\", \"\", OFFSET(DM$8,MATCH(SMALL('Rank Wkst'!DD$8:DD$31,ROW()-ROW(DD$8)+1),DD$8:DD$31,0)-1,0))","v":""},{"$f":"IF(BJ23=\"\", \"\", OFFSET(DN$8,MATCH(SMALL('Rank Wkst'!DD$8:DD$31,ROW()-ROW(DD$8)+1),DD$8:DD$31,0)-1,0))","v":""},"","","","","","","","","","","","",null,16,{"$f":"IF('Ranking Sheet'!B27=0, \"\", 'Ranking Sheet'!B27)","v":""},"","","","","","","","","","","","","","","","",null,"","","","","","","","","","","","","","","","","","","","","","","","","","","",",,,,,,,,",",,,,,,,,/,,",",,,,,,,,,,,,,,,,/,,"]
[17,{"$f":"IF('Ranking Sheet'!B28=0, \"\", 'Ranking Sheet'!B28)","v":""},{"$f":"IF(Team17!$D$21=0, \"\", Team17!$D$21)","v":""},"","","","",{"$f":"IF(Team17!$E$21=0, \"\", Team17!$E$21)","v":""},"","","","",{"$f":"IF(Team17!$F$21=0, \"\", Team17!$F$21)","v":""},"","","","",{"$f":"IF(Team17!$G$21=0, \"\", Team17!$G$21)","v":""},"","","","",{"$f":"IF(Team17!$H$21=0, \"\", Team17!$H$21)","v":""},"","","","",{"$f":"IF(Team17!$I$21=0, \"\", Team17!$I$21)","v":""},"","","","",0,0,0,0,"","",{"$error":"#VALUE!"},99,1,24,{"$error":"#VALUE!"},"",0,"",1,"",24,12.5,"",0,0,0,"",1,"",24,12.5,"",1,1,1,{"$f":"IF(BJ24=\"\", \"\", SMALL(BJ$8:BJ$31, 17))","v":1},"","",{"$f":"COUNT($BJ$8:$BJ$31)-(RANK(BJ24,$BJ$8:$BJ$31,0)+COUNTIF(BJ$8:$BJ24,BJ24))+2","v":8},8,"","",{"$f":"IF(COUNTIF($BL$8:$BL47,BL24)>1,\"TIE\",\"\")","v":"TIE"},"TIE","","","","*","*","*","",null,0,"",1,24,12.5,"",0,"",1,24,12.5,"",{"$error":"#VALUE!"},0,"",1,24,12.5,"",1,1,1,{"$f":"IF(CW24=\"\", \"\", SMALL(CW$8:CW$31, 17))","v":1},1,1,"",{"$f":"COUNT($CW$8:$CW$31)-(RANK(CW24,$CW$8:$CW$31,0)+COUNTIF(CW$8:$CW24,CW24))+2","v":8},8,"","",{"$f":"IF(COUNTIF($CY$8:$CY47,CY24)>1,\"TIE\",\"\")","v":"TIE"},"TIE","TIE",null,17,{"$f":"IF('Ranking Sheet'!B28=0, \"\", 'Ranking Sheet'!B28)","v":""},{"$f":"IF(Team17!$J$9=0, \"\", Team17!$J$9)","v":""},{"$f":"IF(Team17!$J$10=0, \"\", Team17!$J$10)","v":""},{"$f":"IF(Team17!$J$11=0, \"\", Team17!$J$11)","v":""},{"$f":"IF(Team17!$J$12=0, \"\", Team17!$J$12)","v":""},{"$f":"IF(Team17!$J$13=0, \"\", Team17!$J$13)","v":""},{"$f":"IF(Team17!$J$14=0, \"\", Team17!$J$14)","v":""},{"$f":"IF(Team17!$J$15=0, \"\", Team17!$J$15)","v":""},{"$f":"IF(Team17!$J$16=0, \"\", Team17!$J$16)","v":""},{"$f":"IF(Team17!$J$17=0, \"\", Team17!$J$17)","v":""},{"$f":"IF(Team17!$J$18=0, \"\", Team17!$J$18)","v":""},{"$f":"IF(Team17!$J$19=0, \"\", Team17!$J$19)","v":""},{"$f":"IF(Team17!$J$20=0, \"\", Team17!$J$20)","v":""},{"$f":"IF(Team17!$J$21=0, \"\", Team17!$J$21)","v":""},{"$f":"IF(Team17!$L$21=0, \"\", Team17!$L$21)","v":""},null,1,"","","",{"$f":"IF(BJ24=\"\", \"\", OFFSET(DM$8,MATCH(SMALL('Rank Wkst'!DD$8:DD$31,ROW()-ROW(DD$8)+1),DD$8:DD$31,0)-1,0))","v":""},{"$f":"IF(BJ24=\"\", \"\", OFFSET(DN$8,MATCH(SMALL('Rank Wkst'!DD$8:DD$31,ROW()-ROW(DD$8)+1),DD$8:DD$31,0)-1,0))","v":""},{"$f":"IF(BJ24=\"\", \"\", OFFSET(DO$8,MATCH(SMALL('Rank Wkst'!DD$8:DD$31,ROW()-ROW(DD$8)+1),DD$8:DD$31,0)-1,0))","v":""},"","","","","","","","","","","","",null,1,"",{"$f":"IF(BJ24=\"\", \"\", OFFSET(DM$8,MATCH(SMALL('Rank Wkst'!DD$8:DD$31,ROW()-ROW(DD$8)+1),DD$8:DD$31,0)-1,0))","v":""},{"$f":"IF(BJ24=\"\", \"\", OFFSET(DN$8,MATCH(SMALL('Rank Wkst'!DD$8:DD$31,ROW()-ROW(DD$8)+1),DD$8:DD$31,0)-1,0))","v":""},"","","","","","","","","","","","",null,17,{"$f":"IF('Ranking Sheet'!B28=0, \"\", 'Ranking Sheet'!B28)","v":""},"","","","","","","","","","","","","","","","",null,"","","","","","","","","","","","","","","","","","","","","","","","","","","",",,,,,,,,",",,,,,,,,/,,",",,,,,,,,,,,,,,,,/,,"]
[18,{"$f":"IF('Ranking Sheet'!B29=0, \"\", 'Ranking Sheet'!B29)","v":""},{"$f":"IF(Team18!$D$21=0, \"\", Team18!$D$21)","v":""},"","","","",{"$f":"IF(Team18!$E$21=0, \"\", Team18!$E$21)","v":""},"","","","",{"$f":"IF(Team18!$F$21=0, \"\", Team18!$F$21)","v":""},"","","","",{"$f":"IF(Team18!$G$21=0, \"\", Team18!$G$21)","v":""},"","","","",{"$f":"IF(Team18!$H$21=0, \"\", Team18!$H$21)","v":""},"","","","",{"$f":"IF(Team18!$I$21=0, \"\", Team18!$I$21)","v":""},"","","","",0,0,0,0,"","",{"$error":"#VALUE!"},99,1,24,{"$error":"#VALUE!"},"",0,"",1,"",24,12.5,"",0,0,0,"",1,"",24,12.5,"",1,1,1,{"$f":"IF(BJ25=\"\", \"\", SMALL(BJ$8:BJ$31, 18))","v":1},"","",{"$f":"COUNT($BJ$8:$BJ$31)-(RANK(BJ25,$BJ$8:$BJ$31,0)+COUNTIF(BJ$8:$BJ25,BJ25))+2","v":7},7,"","",{"$f":"IF(COUNTIF($BL$8:$BL48,BL25)>1,\"TIE\",\"\")","v":"TIE"},"TIE","","","","*","*","*","",null,0,"",1,24,12.5,"",0,"",1,24,12.5,"",{"$error":"#VALUE!"},0,"",1,24,12.5,"",1,1,1,{"$f":"IF(CW25=\"\", \"\", SMALL(CW$8:CW$31, 18))","v":1},1,1,"",{"$f":"COUNT($CW$8:$CW$31)-(RANK(CW25,$CW$8:$CW$31,0)+COUNTIF(CW$8:$CW25,CW25))+2","v":7},7,"","",{"$f":"IF(COUNTIF($CY$8:$CY48,CY25)>1,\"TIE\",\"\")","v":"TIE"},"TIE","TIE",null,18,{"$f":"IF('Ranking Sheet'!B29=0, \"\", 'Ranking Sheet'!B29)","v":""},{"$f":"IF(Team18!$J$9=0, \"\", Team18!$J$9)","v":""},{"$f":"IF(Team18!$J$10=0, \"\", Team18!$J$10)","v":""},{"$f":"IF(Team18!$J$11=0, \"\", Team18!$J$11)","v":""},{"$f":"IF(Team18!$J$12=0, \"\", Team18!$J$12)","v":""},{"$f":"IF(Team18!$J$13=0, \"\", Team18!$J$13)","v":""},{"$f":"IF(Team18!$J$14=0, \"\", Team18!$J$14)","v":""},{"$f":"IF(Team18!$J$15=0, \"\", Team18!$J$15)","v":""},{"$f":"IF(Team18!$J$16=0, \"\", Team18!$J$16)","v":""},{"$f":"IF(Team18!$J$17=0, \"\", Team18!$J$17)","v":""},{"$f":"IF(Team18!$J$18=0, \"\", Team18!$J$18)","v":""},{"$f":"IF(Team18!$J$19=0, \"\", Team18!$J$19)","v":""},{"$f":"IF(Team18!$J$20=0, \"\", Team18!$J$20)","v":""},{"$f":"IF(Team18!$J$21=0, \"\", Team18!$J$21)","v":""},{"$f":"IF(Team18!$L$21=0, \"\", Team18!$L$21)","v":""},null,1,"","","",{"$f":"IF(BJ25=\"\", \"\", OFFSET(DM$8,MATCH(SMALL('Rank Wkst'!DD$8:DD$31,ROW()-ROW(DD$8)+1),DD$8:DD$31,0)-1,0))","v":""},{"$f":"IF(BJ25=\"\", \"\", OFFSET(DN$8,MATCH(SMALL('Rank Wkst'!DD$8:DD$31,ROW()-ROW(DD$8)+1),DD$8:DD$31,0)-1,0))","v":""},{"$f":"IF(BJ25=\"\", \"\", OFFSET(DO$8,MATCH(SMALL('Rank Wkst'!DD$8:DD$31,ROW()-ROW(DD$8)+1),DD$8:DD$31,0)-1,0))","v":""},"","","","","","","","","","","","",null,1,"",{"$f":"IF(BJ25=\"\", \"\", OFFSET(DM$8,MATCH(SMALL('Rank Wkst'!DD$8:DD$31,ROW()-ROW(DD$8)+1),DD$8:DD$31,0)-1,0))","v":""},{"$f":"IF(BJ25=\"\", \"\", OFFSET(DN$8,MATCH(SMALL('Rank Wkst'!DD$8:DD$31,ROW()-ROW(DD$8)+1),DD$8:DD$31,0)-1,0))","v":""},"","","","","","","","","","","","",null,18,{"$f":"IF('Ranking Sheet'!B29=0, \"\", 'Ranking Sheet'!B29)","v":""},"","","","","","","","","","","","","","","","",null,"","","","","","","","","","","","","","","","","","","","","","","","","","","",",,,,,,,,",",,,,,,,,/,,",",,,,,,,,,,,,,,,,/,,"]
[19,{"$f":"IF('Ranking Sheet'!B30=0, \"\", 'Ranking Sheet'!B30)","v":""},{"$f":"IF(Team19!$D$21=0, \"\", Team19!$D$21)","v":""},"","","","",{"$f":"IF(Team19!$E$21=0, \"\", Team19!$E$21)","v":""},"","","","",{"$f":"IF(Team19!$F$21=0, \"\", Team19!$F$21)","v":""},"","","","",{"$f":"IF(Team19!$G$21=0, \"\", Team19!$G$21)","v":""},"","","","",{"$f":"IF(Team19!$H$21=0, \"\", Team19!$H$21)","v":""},"","","","",{"$f":"IF(Team19!$I$21=0, \"\", Team19!$I$21)","v":""},"","","","",0,0,0,0,"","",{"$error":"#VALUE!"},99,1,24,{"$error":"#VALUE!"},"",0,"",1,"",24,12.5,"",0,0,0,"",1,"",24,12.5,"",1,1,1,{"$f":"IF(BJ26=\"\", \"\", SMALL(BJ$8:BJ$31, 19))","v":1},"","",{"$f":"COUNT($BJ$8:$BJ$31)-(RANK(BJ26,$BJ$8:$BJ$31,0)+COUNTIF(BJ$8:$BJ26,BJ26))+2","v":6},6,"","",{"$f":"IF(COUNTIF($BL$8:$BL49,BL26)>1,\"TIE\",\"\")","v":"TIE"},"TIE","","","","*","*","*","",null,0,"",1,24,12.5,"",0,"",1,24,12.5,"",{"$error":"#VALUE!"},0,"",1,24,12.5,"",1,1,1,{"$f":"IF(CW26=\"\", \"\", SMALL(CW$8:CW$31, 19))","v":1},1,1,"",{"$f":"COUNT($CW$8:$CW$31)-(RANK(CW26,$CW$8:$CW$31,0)+COUNTIF(CW$8:$CW26,CW26))+2","v":6},6,"","",{"$f":"IF(COUNTIF($CY$8:$CY49,CY26)>1,\"TIE\",\"\")","v":"TIE"},"TIE","TIE",null,19,{"$f":"IF('Ranking Sheet'!B30=0, \"\", 'Ranking Sheet'!B30)","v":""},{"$f":"IF(Team19!$J$9=0, \"\", Team19!$J$9)","v":""},{"$f":"IF(Team19!$J$10=0, \"\", Team19!$J$10)","v":""},{"$f":"IF(Team19!$J$11=0, \"\", Team19!$J$11)","v":""},{"$f":"IF(Team19!$J$12=0, \"\", Team19!$J$12)","v":""},{"$f":"IF(Team19!$J$13=0, \"\", Team19!$J$13)","v":""},{"$f":"IF(Team19!$J$14=0, \"\", Team19!$J$14)","v":""},{"$f":"IF(Team19!$J$15=0, \"\", Team19!$J$15)","v":""},{"$f":"IF(Team19!$J$16=0, \"\", Team19!$J$16)","v":""},{"$f":"IF(Team19!$J$17=0, \"\", Team19!$J$17)","v":""},{"$f":"IF(Team19!$J$18=0, \"\", Team19!$J$18)","v":""},{"$f":"IF(Team19!$J$19=0, \"\", Team19!$J$19)","v":""},{"$f":"IF(Team19!$J$20=0, \"\", Team19!$J$20)","v":""},{"$f":"IF(Team19!$J$21=0, \"\", Team19!$J$21)","v":""},{"$f":"IF(Team19!$L$21=0, \"\", Team19!$L$21)","v":""},null,1,"","","",{"$f":"IF(BJ26=\"\", \"\", OFFSET(DM$8,MATCH(SMALL('Rank Wkst'!DD$8:DD$31,ROW()-ROW(DD$8)+1),DD$8:DD$31,0)-1,0))","v":""},{"$f":"IF(BJ26=\"\", \"\", OFFSET(DN$8,MATCH(SMALL('Rank Wkst'!DD$8:DD$31,ROW()-ROW(DD$8)+1),DD$8:DD$31,0)-1,0))","v":""},{"$f":"IF(BJ26=\"\", \"\", OFFSET(DO$8,MATCH(SMALL('Rank Wkst'!DD$8:DD$31,ROW()-ROW(DD$8)+1),DD$8:DD$31,0)-1,0))","v":""},"","","","","","","","","","","","",null,1,"",{"$f":"IF(BJ26=\"\", \"\", OFFSET(DM$8,MATCH(SMALL('Rank Wkst'!DD$8:DD$31,ROW()-ROW(DD$8)+1),DD$8:DD$31,0)-1,0))","v":""},{"$f":"IF(BJ26=\"\", \"\", OFFSET(DN$8,MATCH(SMALL('Rank Wkst'!DD$8:DD$31,ROW()-ROW(DD$8)+1),DD$8:DD$31,0)-1,0))","v":""},"","","","","","","","","","","","",null,19,{"$f":"IF('Ranking Sheet'!B30=0, \"\", 'Ranking Sheet'!B30)","v":""},"","","","","","","","","","","","","","","","",null,"","","","","","","","","","","","","","","","","","","","","","","","","","","",",,,,,,,,",",,,,,,,,/,,",",,,,,,,,,,,,,,,,/,,"]
[20,{"$f":"IF('Ranking Sheet'!B31=0, \"\", 'Ranking Sheet'!B31)","v":""},{"$f":"IF(Team20!$D$21=0, \"\", Team20!$D$21)","v":""},"","","","",{"$f":"IF(Team20!$E$21=0, \"\", Team20!$E$21)","v":""},"","","","",{"$f":"IF(Team20!$F$21=0, \"\", Team20!$F$21)","v":""},"","","","",{"$f":"IF(Team20!$G$21=0, \"\", Team20!$G$21)","v":""},"","","","",{"$f":"IF(Team20!$H$21=0, \"\", Team20!$H$21)","v":""},"","","","",{"$f":"IF(Team20!$I$21=0, \"\", Team20!$I$21)","v":""},"","","","",0,0,0,0,"","",{"$error":"#VALUE!"},99,1,24,{"$error":"#VALUE!"},"",0,"",1,"",24,12.5,"",0,0,0,"",1,"",24,12.5,"",1,1,1,{"$f":"IF(BJ27=\"\", \"\", SMALL(BJ$8:BJ$31, 20))","v":1},"","",{"$f":"COUNT($BJ$8:$BJ$31)-(RANK(BJ27,$BJ$8:$BJ$31,0)+COUNTIF(BJ$8:$BJ27,BJ27))+2","v":5},5,"","",{"$f":"IF(COUNTIF($BL$8:$BL50,BL27)>1,\"TIE\",\"\")","v":"TIE"},"TIE","","","","*","*","*","",null,0,"",1,24,12.5,"",0,"",1,24,12.5,"",{"$error":"#VALUE!"},0,"",1,24,12.5,"",1,1,1,{"$f":"IF(CW27=\"\", \"\", SMALL(CW$8:CW$31, 20))","v":1},1,1,"",{"$f":"COUNT($CW$8:$CW$31)-(RANK(CW27,$CW$8:$CW$31,0)+COUNTIF(CW$8:$CW27,CW27))+2","v":5},5,"","",{"$f":"IF(COUNTIF($CY$8:$CY50,CY27)>1,\"TIE\",\"\")","v":"TIE"},"TIE","TIE",null,20,{"$f":"IF('Ranking Sheet'!B31=0, \"\", 'Ranking Sheet'!B31)","v":""},{"$f":"IF(Team20!$J$9=0, \"\", Team20!$J$9)","v":""},{"$f":"IF(Team20!$J$10=0, \"\", Team20!$J$10)","v":""},{"$f":"IF(Team20!$J$11=0, \"\", Team20!$J$11)","v":""},{"$f":"IF(Team20!$J$12=0, \"\", Team20!$J$12)","v":""},{"$f":"IF(Team20!$J$13=0, \"\", Team20!$J$13)","v":""},{"$f":"IF(Team20!$J$14=0, \"\", Team20!$J$14)","v":""},{"$f":"IF(Team20!$J$15=0, \"\", Team20!$J$15)","v":""},{"$f":"IF(Team20!$J$16=0, \"\", Team20!$J$16)","v":""},{"$f":"IF(Team20!$J$17=0, \"\", Team20!$J$17)","v":""},{"$f":"IF(Team20!$J$18=0, \"\", Team20!$J$18)","v":""},{"$f":"IF(Team20!$J$19=0, \"\", Team20!$J$19)","v":""},{"$f":"IF(Team20!$J$20=0, \"\", Team20!$J$20)","v":""},{"$f":"IF(Team20!$J$21=0, \"\", Team20!$J$21)","v":""},{"$f":"IF(Team20!$L$21=0, \"\", Team20!$L$21)","v":""},null,1,"","","",{"$f":"IF(BJ27=\"\", \"\", OFFSET(DM$8,MATCH(SMALL('Rank Wkst'!DD$8:DD$31,ROW()-ROW(DD$8)+1),DD$8:DD$31,0)-1,0))","v":""},{"$f":"IF(BJ27=\"\", \"\", OFFSET(DN$8,MATCH(SMALL('Rank Wkst'!DD$8:DD$31,ROW()-ROW(DD$8)+1),DD$8:DD$31,0)-1,0))","v":""},{"$f":"IF(BJ27=\"\", \"\", OFFSET(DO$8,MATCH(SMALL('Rank Wkst'!DD$8:DD$31,ROW()-ROW(DD$8)+1),DD$8:DD$31,0)-1,0))","v":""},"","","","","","","","","","","","",null,1,"",{"$f":"IF(BJ27=\"\", \"\", OFFSET(DM$8,MATCH(SMALL('Rank Wkst'!DD$8:DD$31,ROW()-ROW(DD$8)+1),DD$8:DD$31,0)-1,0))","v":""},{"$f":"IF(BJ27=\"\", \"\", OFFSET(DN$8,MATCH(SMALL('Rank Wkst'!DD$8:DD$31,ROW()-ROW(DD$8)+1),DD$8:DD$31,0)-1,0))","v":""},"","","","","","","","","","","","",null,20,{"$f":"IF('Ranking Sheet'!B31=0, \"\", 'Ranking Sheet'!B31)","v":""},"","","","","","","","","","","","","","","","",null,"","","","","","","","","","","","","","","","","","","","","","","","","","","",",,,,,,,,",",,,,,,,,/,,",",,,,,,,,,,,,,,,,/,,"]
[21,{"$f":"IF('Ranking Sheet'!B32=0, \"\", 'Ranking Sheet'!B32)","v":""},{"$f":"IF(Team21!$D$21=0, \"\", Team21!$D$21)","v":""},"","",{"$f":"IF(C28=\"\", \"\", (((D28+E28-1)*((D28+E28-1)+1)/2)-((D28-1)*((D28-1)+1)/2))/E28)","v":""},"",{"$f":"IF(Team21!$E$21=0, \"\", Team21!$E$21)","v":""},"","",{"$f":"IF(H28=\"\", \"\", (((I28+J28-1)*((I28+J28-1)+1)/2)-((I28-1)*((I28-1)+1)/2))/J28)","v":""},"",{"$f":"IF(Team21!$F$21=0, \"\", Team21!$F$21)","v":""},"","",{"$f":"IF(M28=\"\", \"\", (((N28+O28-1)*((N28+O28-1)+1)/2)-((N28-1)*((N28-1)+1)/2))/O28)","v":""},"",{"$f":"IF(Team21!$G$21=0, \"\", Team21!$G$21)","v":""},"","",{"$f":"IF(R28=\"\", \"\", (((S28+T28-1)*((S28+T28-1)+1)/2)-((S28-1)*((S28-1)+1)/2))/T28)","v":""},"",{"$f":"IF(Team21!$H$21=0, \"\", Team21!$H$21)","v":""},"","",{"$f":"IF(W28=\"\", \"\", (((X28+Y28-1)*((X28+Y28-1)+1)/2)-((X28-1)*((X28-1)+1)/2))/Y28)","v":""},"",{"$f":"IF(Team21!$I$21=0, \"\", Team21!$I$21)","v":""},"","",{"$f":"IF(AB28=\"\", \"\", (((AC28+AD28-1)*((AC28+AD28-1)+1)/2)-((AC28-1)*((AC28-1)+1)/2))/AD28)","v":""},"",{"$f":"SUM(F28,K28,P28,U28,Z28,AE28)","v":0},{"$f":"MIN(F28,K28,P28,U28,Z28,AE28)","v":0},{"$f":"MAX(F28,K28,P28,U28,Z28,AE28)","v":0},{"$f":"AG28-AH28-AI28","v":0},{"$f":"IF(AJ28=0, \"\", AJ28)","v":""},"",{"$error":"#VALUE!"},99,1,24,{"$f":"(((AM28+AP28-1)*((AM28+AP28-1)+1)/2)-((AM28-1)*((AM28-1)+1)/2))/AP28","v":{"$error":"#VALUE!"}},"",{"$f":"AJ28+AH28+AI28","v":0},{"$f":"IF(AS28=0, \"\", AS28)","v":""},1,"",24,12.5,"",{"$f":"MIN(C28,H28,M28,R28,W28,AB28)","v":0},{"$f":"MAX(C28,H28,M28,R28,W28,AB28)","v":0},{"$f":"SUM(C28,H28,M28,R28,W28,AB28)-MIN(C28,H28,M28,R28,W28,AB28)-MAX(C28,H28,M28,R28,W28,AB28)","v":0},{"$f":"IF(BB28=0, \"\", BB28)","v":""},1,"",24,12.5,"",1,1,1,{"$f":"IF(BJ28=\"\", \"\", SMALL(BJ$8:BJ$31, 21))","v":1},"","",{"$f":"COUNT($BJ$8:$BJ$31)-(RANK(BJ28,$BJ$8:$BJ$31,0)+COUNTIF(BJ$8:$BJ28,BJ28))+2","v":4},{"$f":"IF(ISERROR(BO28), \" \", BO28)","v":4},"","",{"$f":"IF(COUNTIF($BL$8:$BL51,BL28)>1,\"TIE\",\"\")","v":"TIE"},"TIE","","","","*","*","*","",null,0,"",1,24,12.5,"",0,"",1,24,12.5,"",{"$error":"#VALUE!"},0,"",1,24,12.5,"",1,1,1,{"$f":"IF(CW28=\"\", \"\", SMALL(CW$8:CW$31, 21))","v":1},1,1,"",{"$f":"COUNT($CW$8:$CW$31)-(RANK(CW28,$CW$8:$CW$31,0)+COUNTIF(CW$8:$CW28,CW28))+2","v":4},4,"","",{"$f":"IF(COUNTIF($CY$8:$CY51,CY28)>1,\"TIE\",\"\")","v":"TIE"},"TIE","TIE",null,21,{"$f":"IF('Ranking Sheet'!B32=0, \"\", 'Ranking Sheet'!B32)","v":""},{"$f":"IF(Team21!$J$9=0, \"\", Team21!$J$9)","v":""},{"$f":"IF(Team21!$J$10=0, \"\", Team21!$J$10)","v":""},{"$f":"IF(Team21!$J$11=0, \"\", Team21!$J$11)","v":""},{"$f":"IF(Team21!$J$12=0, \"\", Team21!$J$12)","v":""},{"$f":"IF(Team21!$J$13=0, \"\", Team21!$J$13)","v":""},{"$f":"IF(Team21!$J$14=0, \"\", Team21!$J$14)","v":""},{"$f":"IF(Team21!$J$15=0, \"\", Team21!$J$15)","v":""},{"$f":"IF(Team21!$J$16=0, \"\", Team21!$J$16)","v":""},{"$f":"IF(Team21!$J$17=0, \"\", Team21!$J$17)","v":""},{"$f":"IF(Team21!$J$18=0, \"\", Team21!$J$18)","v":""},{"$f":"IF(Team21!$J$19=0, \"\", Team21!$J$19)","v":""},{"$f":"IF(Team21!$J$20=0, \"\", Team21!$J$20)","v":""},{"$f":"IF(Team21!$J$21=0, \"\", Team21!$J$21)","v":""},{"$f":"IF(Team21!$L$21=0, \"\", Team21!$L$21)","v":""},null,1,"","","",{"$f":"IF(BJ28=\"\", \"\", OFFSET(DM$8,MATCH(SMALL('Rank Wkst'!DD$8:DD$31,ROW()-ROW(DD$8)+1),DD$8:DD$31,0)-1,0))","v":""},{"$f":"IF(BJ28=\"\", \"\", OFFSET(DN$8,MATCH(SMALL('Rank Wkst'!DD$8:DD$31,ROW()-ROW(DD$8)+1),DD$8:DD$31,0)-1,0))","v":""},{"$f":"IF(BJ28=\"\", \"\", OFFSET(DO$8,MATCH(SMALL('Rank Wkst'!DD$8:DD$31,ROW()-ROW(DD$8)+1),DD$8:DD$31,0)-1,0))","v":""},"","","","","","","","","","","","",null,1,"",{"$f":"IF(BJ28=\"\", \"\", OFFSET(DM$8,MATCH(SMALL('Rank Wkst'!DD$8:DD$31,ROW()-ROW(DD$8)+1),DD$8:DD$31,0)-1,0))","v":""},{"$f":"IF(BJ28=\"\", \"\", OFFSET(DN$8,MATCH(SMALL('Rank Wkst'!DD$8:DD$31,ROW()-ROW(DD$8)+1),DD$8:DD$31,0)-1,0))","v":""},"","","","","","","","","","","","",null,21,{"$f":"IF('Ranking Sheet'!B32=0, \"\", 'Ranking Sheet'!B32)","v":""},"","","","","","","","","","","","","","","","",null,"","","","","","","","","","","","","","","","","","","","","","","","","","","",",,,,,,,,",",,,,,,,,/,,",",,,,,,,,,,,,,,,,/,,"]
[22,{"$f":"IF('Ranking Sheet'!B33=0, \"\", 'Ranking Sheet'!B33)","v":""},{"$f":"IF(Team22!$D$21=0, \"\", Team22!$D$21)","v":""},"","",{"$f":"IF(C29=\"\", \"\", (((D29+E29-1)*((D29+E29-1)+1)/2)-((D29-1)*((D29-1)+1)/2))/E29)","v":""},"",{"$f":"IF(Team22!$E$21=0, \"\", Team22!$E$21)","v":""},"","",{"$f":"IF(H29=\"\", \"\", (((I29+J29-1)*((I29+J29-1)+1)/2)-((I29-1)*((I29-1)+1)/2))/J29)","v":""},"",{"$f":"IF(Team22!$F$21=0, \"\", Team22!$F$21)","v":""},"","",{"$f":"IF(M29=\"\", \"\", (((N29+O29-1)*((N29+O29-1)+1)/2)-((N29-1)*((N29-1)+1)/2))/O29)","v":""},"",{"$f":"IF(Team22!$G$21=0, \"\", Team22!$G$21)","v":""},"","",{"$f":"IF(R29=\"\", \"\", (((S29+T29-1)*((S29+T29-1)+1)/2)-((S29-1)*((S29-1)+1)/2))/T29)","v":""},"",{"$f":"IF(Team22!$H$21=0, \"\", Team22!$H$21)","v":""},"","",{"$f":"IF(W29=\"\", \"\", (((X29+Y29-1)*((X29+Y29-1)+1)/2)-((X29-1)*((X29-1)+1)/2))/Y29)","v":""},"",{"$f":"IF(Team22!$I$21=0, \"\", Team22!$I$21)","v":""},"","",{"$f":"IF(AB29=\"\", \"\", (((AC29+AD29-1)*((AC29+AD29-1)+1)/2)-((AC29-1)*((AC29-1)+1)/2))/AD29)","v":""},"",{"$f":"SUM(F29,K29,P29,U29,Z29,AE29)","v":0},{"$f":"MIN(F29,K29,P29,U29,Z29,AE29)","v":0},{"$f":"MAX(F29,K29,P29,U29,Z29,AE29)","v":0},{"$f":"AG29-AH29-AI29","v":0},{"$f":"IF(AJ29=0, \"\", AJ29)","v":""},"",{"$error":"#VALUE!"},99,1,24,{"$f":"(((AM29+AP29-1)*((AM29+AP29-1)+1)/2)-((AM29-1)*((AM29-1)+1)/2))/AP29","v":{"$error":"#VALUE!"}},"",{"$f":"AJ29+AH29+AI29","v":0},{"$f":"IF(AS29=0, \"\", AS29)","v":""},1,"",24,12.5,"",{"$f":"MIN(C29,H29,M29,R29,W29,AB29)","v":0},{"$f":"MAX(C29,H29,M29,R29,W29,AB29)","v":0},{"$f":"SUM(C29,H29,M29,R29,W29,AB29)-MIN(C29,H29,M29,R29,W29,AB29)-MAX(C29,H29,M29,R29,W29,AB29)","v":0},{"$f":"IF(BB29=0, \"\", BB29)","v":""},1,"",24,12.5,"",1,1,1,{"$f":"IF(BJ29=\"\", \"\", SMALL(BJ$8:BJ$31, 22))","v":1},"","",{"$f":"COUNT($BJ$8:$BJ$31)-(RANK(BJ29,$BJ$8:$BJ$31,0)+COUNTIF(BJ$8:$BJ29,BJ29))+2","v":3},{"$f":"IF(ISERROR(BO29), \" \", BO29)","v":3},"","",{"$f":"IF(COUNTIF($BL$8:$BL52,BL29)>1,\"TIE\",\"\")","v":"TIE"},"TIE","","","","*","*","*","",null,0,"",1,24,12.5,"",0,"",1,24,12.5,"",{"$error":"#VALUE!"},0,"",1,24,12.5,"",1,1,1,{"$f":"IF(CW29=\"\", \"\", SMALL(CW$8:CW$31, 22))","v":1},1,1,"",{"$f":"COUNT($CW$8:$CW$31)-(RANK(CW29,$CW$8:$CW$31,0)+COUNTIF(CW$8:$CW29,CW29))+2","v":3},3,"","",{"$f":"IF(COUNTIF($CY$8:$CY52,CY29)>1,\"TIE\",\"\")","v":"TIE"},"TIE","TIE",null,22,{"$f":"IF('Ranking Sheet'!B33=0, \"\", 'Ranking Sheet'!B33)","v":""},{"$f":"IF(Team22!$J$9=0, \"\", Team22!$J$9)","v":""},{"$f":"IF(Team22!$J$10=0, \"\", Team22!$J$10)","v":""},{"$f":"IF(Team22!$J$11=0, \"\", Team22!$J$11)","v":""},{"$f":"IF(Team22!$J$12=0, \"\", Team22!$J$12)","v":""},{"$f":"IF(Team22!$J$13=0, \"\", Team22!$J$13)","v":""},{"$f":"IF(Team22!$J$14=0, \"\", Team22!$J$14)","v":""},{"$f":"IF(Team22!$J$15=0, \"\", Team22!$J$15)","v":""},{"$f":"IF(Team22!$J$16=0, \"\", Team22!$J$16)","v":""},{"$f":"IF(Team22!$J$17=0, \"\", Team22!$J$17)","v":""},{"$f":"IF(Team22!$J$18=0, \"\", Team22!$J$18)","v":""},{"$f":"IF(Team22!$J$19=0, \"\", Team22!$J$19)","v":""},{"$f":"IF(Team22!$J$20=0, \"\", Team22!$J$20)","v":""},{"$f":"IF(Team22!$J$21=0, \"\", Team22!$J$21)","v":""},{"$f":"IF(Team22!$L$21=0, \"\", Team22!$L$21)","v":""},null,1,"","","",{"$f":"IF(BJ29=\"\", \"\", OFFSET(DM$8,MATCH(SMALL('Rank Wkst'!DD$8:DD$31,ROW()-ROW(DD$8)+1),DD$8:DD$31,0)-1,0))","v":""},{"$f":"IF(BJ29=\"\", \"\", OFFSET(DN$8,MATCH(SMALL('Rank Wkst'!DD$8:DD$31,ROW()-ROW(DD$8)+1),DD$8:DD$31,0)-1,0))","v":""},{"$f":"IF(BJ29=\"\", \"\", OFFSET(DO$8,MATCH(SMALL('Rank Wkst'!DD$8:DD$31,ROW()-ROW(DD$8)+1),DD$8:DD$31,0)-1,0))","v":""},"","","","","","","","","","","","",null,1,"",{"$f":"IF(BJ29=\"\", \"\", OFFSET(DM$8,MATCH(SMALL('Rank Wkst'!DD$8:DD$31,ROW()-ROW(DD$8)+1),DD$8:DD$31,0)-1,0))","v":""},{"$f":"IF(BJ29=\"\", \"\", OFFSET(DN$8,MATCH(SMALL('Rank Wkst'!DD$8:DD$31,ROW()-ROW(DD$8)+1),DD$8:DD$31,0)-1,0))","v":""},"","","","","","","","","","","","",null,22,{"$f":"IF('Ranking Sheet'!B33=0, \"\", 'Ranking Sheet'!B33)","v":""},"","","","","","","","","","","","","","","","",null,"","","","","","","","","","","","","","","","","","","","","","","","","","","",",,,,,,,,",",,,,,,,,/,,",",,,,,,,,,,,,,,,,/,,"]
[23,{"$f":"IF('Ranking Sheet'!B34=0, \"\", 'Ranking Sheet'!B34)","v":""},{"$f":"IF(Team23!$D$21=0, \"\", Team23!$D$21)","v":""},"","",{"$f":"IF(C30=\"\", \"\", (((D30+E30-1)*((D30+E30-1)+1)/2)-((D30-1)*((D30-1)+1)/2))/E30)","v":""},"",{"$f":"IF(Team23!$E$21=0, \"\", Team23!$E$21)","v":""},"","",{"$f":"IF(H30=\"\", \"\", (((I30+J30-1)*((I30+J30-1)+1)/2)-((I30-1)*((I30-1)+1)/2))/J30)","v":""},"",{"$f":"IF(Team23!$F$21=0, \"\", Team23!$F$21)","v":""},"","",{"$f":"IF(M30=\"\", \"\", (((N30+O30-1)*((N30+O30-1)+1)/2)-((N30-1)*((N30-1)+1)/2))/O30)","v":""},"",{"$f":"IF(Team23!$G$21=0, \"\", Team23!$G$21)","v":""},"","",{"$f":"IF(R30=\"\", \"\", (((S30+T30-1)*((S30+T30-1)+1)/2)-((S30-1)*((S30-1)+1)/2))/T30)","v":""},"",{"$f":"IF(Team23!$H$21=0, \"\", Team23!$H$21)","v":""},"","",{"$f":"IF(W30=\"\", \"\", (((X30+Y30-1)*((X30+Y30-1)+1)/2)-((X30-1)*((X30-1)+1)/2))/Y30)","v":""},"",{"$f":"IF(Team23!$I$21=0, \"\", Team23!$I$21)","v":""},"","",{"$f":"IF(AB30=\"\", \"\", (((AC30+AD30-1)*((AC30+AD30-1)+1)/2)-((AC30-1)*((AC30-1)+1)/2))/AD30)","v":""},"",{"$f":"SUM(F30,K30,P30,U30,Z30,AE30)","v":0},{"$f":"MIN(F30,K30,P30,U30,Z30,AE30)","v":0},{"$f":"MAX(F30,K30,P30,U30,Z30,AE30)","v":0},{"$f":"AG30-AH30-AI30","v":0},{"$f":"IF(AJ30=0, \"\", AJ30)","v":""},"",{"$error":"#VALUE!"},99,1,24,{"$f":"(((AM30+AP30-1)*((AM30+AP30-1)+1)/2)-((AM30-1)*((AM30-1)+1)/2))/AP30","v":{"$error":"#VALUE!"}},"",{"$f":"AJ30+AH30+AI30","v":0},{"$f":"IF(AS30=0, \"\", AS30)","v":""},1,"",24,12.5,"",{"$f":"MIN(C30,H30,M30,R30,W30,AB30)","v":0},{"$f":"MAX(C30,H30,M30,R30,W30,AB30)","v":0},{"$f":"SUM(C30,H30,M30,R30,W30,AB30)-MIN(C30,H30,M30,R30,W30,AB30)-MAX(C30,H30,M30,R30,W30,AB30)","v":0},{"$f":"IF(BB30=0, \"\", BB30)","v":""},1,"",24,12.5,"",1,1,1,{"$f":"IF(BJ30=\"\", \"\", SMALL(BJ$8:BJ$31, 23))","v":1},"","",{"$f":"COUNT($BJ$8:$BJ$31)-(RANK(BJ30,$BJ$8:$BJ$31,0)+COUNTIF(BJ$8:$BJ30,BJ30))+2","v":2},{"$f":"IF(ISERROR(BO30), \" \", BO30)","v":2},"","",{"$f":"IF(COUNTIF($BL$8:$BL53,BL30)>1,\"TIE\",\"\")","v":"TIE"},"TIE","","","","*","*","*","",null,0,"",1,24,12.5,"",0,"",1,24,12.5,"",{"$error":"#VALUE!"},0,"",1,24,12.5,"",1,1,1,{"$f":"IF(CW30=\"\", \"\", SMALL(CW$8:CW$31, 23))","v":1},1,1,"",{"$f":"COUNT($CW$8:$CW$31)-(RANK(CW30,$CW$8:$CW$31,0)+COUNTIF(CW$8:$CW30,CW30))+2","v":2},2,"","",{"$f":"IF(COUNTIF($CY$8:$CY53,CY30)>1,\"TIE\",\"\")","v":"TIE"},"TIE","TIE",null,23,{"$f":"IF('Ranking Sheet'!B34=0, \"\", 'Ranking Sheet'!B34)","v":""},{"$f":"IF(Team23!$J$9=0, \"\", Team23!$J$9)","v":""},{"$f":"IF(Team23!$J$10=0, \"\", Team23!$J$10)","v":""},{"$f":"IF(Team23!$J$11=0, \"\", Team23!$J$11)","v":""},{"$f":"IF(Team23!$J$12=0, \"\", Team23!$J$12)","v":""},{"$f":"IF(Team23!$J$13=0, \"\", Team23!$J$13)","v":""},{"$f":"IF(Team23!$J$14=0, \"\", Team23!$J$14)","v":""},{"$f":"IF(Team23!$J$15=0, \"\", Team23!$J$15)","v":""},{"$f":"IF(Team23!$J$16=0, \"\", Team23!$J$16)","v":""},{"$f":"IF(Team23!$J$17=0, \"\", Team23!$J$17)","v":""},{"$f":"IF(Team23!$J$18=0, \"\", Team23!$J$18)","v":""},{"$f":"IF(Team23!$J$19=0, \"\", Team23!$J$19)","v":""},{"$f":"IF(Team23!$J$20=0, \"\", Team23!$J$20)","v":""},{"$f":"IF(Team23!$J$21=0, \"\", Team23!$J$21)","v":""},{"$f":"IF(Team23!$L$21=0, \"\", Team23!$L$21)","v":""},null,1,"","","",{"$f":"IF(BJ30=\"\", \"\", OFFSET(DM$8,MATCH(SMALL('Rank Wkst'!DD$8:DD$31,ROW()-ROW(DD$8)+1),DD$8:DD$31,0)-1,0))","v":""},{"$f":"IF(BJ30=\"\", \"\", OFFSET(DN$8,MATCH(SMALL('Rank Wkst'!DD$8:DD$31,ROW()-ROW(DD$8)+1),DD$8:DD$31,0)-1,0))","v":""},{"$f":"IF(BJ30=\"\", \"\", OFFSET(DO$8,MATCH(SMALL('Rank Wkst'!DD$8:DD$31,ROW()-ROW(DD$8)+1),DD$8:DD$31,0)-1,0))","v":""},"","","","","","","","","","","","",null,1,"",{"$f":"IF(BJ30=\"\", \"\", OFFSET(DM$8,MATCH(SMALL('Rank Wkst'!DD$8:DD$31,ROW()-ROW(DD$8)+1),DD$8:DD$31,0)-1,0))","v":""},{"$f":"IF(BJ30=\"\", \"\", OFFSET(DN$8,MATCH(SMALL('Rank Wkst'!DD$8:DD$31,ROW()-ROW(DD$8)+1),DD$8:DD$31,0)-1,0))","v":""},"","","","","","","","","","","","",null,23,{"$f":"IF('Ranking Sheet'!B34=0, \"\", 'Ranking Sheet'!B34)","v":""},"","","","","","","","","","","","","","","","",null,"","","","","","","","","","","","","","","","","","","","","","","","","","","",",,,,,,,,",",,,,,,,,/,,",",,,,,,,,,,,,,,,,/,,"]
[24,{"$f":"IF('Ranking Sheet'!B35=0, \"\", 'Ranking Sheet'!B35)","v":""},{"$f":"IF(Team24!$D$21=0, \"\", Team24!$D$21)","v":""},"","",{"$f":"IF(C31=\"\", \"\", (((D31+E31-1)*((D31+E31-1)+1)/2)-((D31-1)*((D31-1)+1)/2))/E31)","v":""},"",{"$f":"IF(Team24!$E$21=0, \"\", Team24!$E$21)","v":""},"","",{"$f":"IF(H31=\"\", \"\", (((I31+J31-1)*((I31+J31-1)+1)/2)-((I31-1)*((I31-1)+1)/2))/J31)","v":""},"",{"$f":"IF(Team24!$F$21=0, \"\", Team24!$F$21)","v":""},"","",{"$f":"IF(M31=\"\", \"\", (((N31+O31-1)*((N31+O31-1)+1)/2)-((N31-1)*((N31-1)+1)/2))/O31)","v":""},"",{"$f":"IF(Team24!$G$21=0, \"\", Team24!$G$21)","v":""},"","",{"$f":"IF(R31=\"\", \"\", (((S31+T31-1)*((S31+T31-1)+1)/2)-((S31-1)*((S31-1)+1)/2))/T31)","v":""},"",{"$f":"IF(Team24!$H$21=0, \"\", Team24!$H$21)","v":""},"","",{"$f":"IF(W31=\"\", \"\", (((X31+Y31-1)*((X31+Y31-1)+1)/2)-((X31-1)*((X31-1)+1)/2))/Y31)","v":""},"",{"$f":"IF(Team24!$I$21=0, \"\", Team24!$I$21)","v":""},"","",{"$f":"IF(AB31=\"\", \"\", (((AC31+AD31-1)*((AC31+AD31-1)+1)/2)-((AC31-1)*((AC31-1)+1)/2))/AD31)","v":""},"",{"$f":"SUM(F31,K31,P31,U31,Z31,AE31)","v":0},{"$f":"MIN(F31,K31,P31,U31,Z31,AE31)","v":0},{"$f":"MAX(F31,K31,P31,U31,Z31,AE31)","v":0},{"$f":"AG31-AH31-AI31","v":0},{"$f":"IF(AJ31=0, \"\", AJ31)","v":""},"",{"$error":"#VALUE!"},99,1,24,{"$f":"(((AM31+AP31-1)*((AM31+AP31-1)+1)/2)-((AM31-1)*((AM31-1)+1)/2))/AP31","v":{"$error":"#VALUE!"}},"",{"$f":"AJ31+AH31+AI31","v":0},{"$f":"IF(AS31=0, \"\", AS31)","v":""},1,"",24,12.5,"",{"$f":"MIN(C31,H31,M31,R31,W31,AB31)","v":0},{"$f":"MAX(C31,H31,M31,R31,W31,AB31)","v":0},{"$f":"SUM(C31,H31,M31,R31,W31,AB31)-MIN(C31,H31,M31,R31,W31,AB31)-MAX(C31,H31,M31,R31,W31,AB31)","v":0},{"$f":"IF(BB31=0, \"\", BB31)","v":""},1,"",24,12.5,"",1,1,1,{"$f":"IF(BJ31=\"\", \"\", SMALL(BJ$8:BJ$31, 24))","v":1},"","",{"$f":"COUNT($BJ$8:$BJ$31)-(RANK(BJ31,$BJ$8:$BJ$31,0)+COUNTIF(BJ$8:$BJ31,BJ31))+2","v":1},{"$f":"IF(ISERROR(BO31), \" \", BO31)","v":1},"","",{"$f":"IF(COUNTIF($BL$8:$BL54,BL31)>1,\"TIE\",\"\")","v":"TIE"},"TIE","","","","*","*","*","",null,0,"",1,24,12.5,"",0,"",1,24,12.5,"",{"$error":"#VALUE!"},0,"",1,24,12.5,"",1,1,1,{"$f":"IF(CW31=\"\", \"\", SMALL(CW$8:CW$31, 24))","v":1},1,1,"",{"$f":"COUNT($CW$8:$CW$31)-(RANK(CW31,$CW$8:$CW$31,0)+COUNTIF(CW$8:$CW31,CW31))+2","v":1},1,"","",{"$f":"IF(COUNTIF($CY$8:$CY54,CY31)>1,\"TIE\",\"\")","v":"TIE"},"TIE","TIE",null,24,{"$f":"IF('Ranking Sheet'!B35=0, \"\", 'Ranking Sheet'!B35)","v":""},{"$f":"IF(Team24!$J$9=0, \"\", Team24!$J$9)","v":""},{"$f":"IF(Team24!$J$10=0, \"\", Team24!$J$10)","v":""},{"$f":"IF(Team24!$J$11=0, \"\", Team24!$J$11)","v":""},{"$f":"IF(Team24!$J$12=0, \"\", Team24!$J$12)","v":""},{"$f":"IF(Team24!$J$13=0, \"\", Team24!$J$13)","v":""},{"$f":"IF(Team24!$J$14=0, \"\", Team24!$J$14)","v":""},{"$f":"IF(Team24!$J$15=0, \"\", Team24!$J$15)","v":""},{"$f":"IF(Team24!$J$16=0, \"\", Team24!$J$16)","v":""},{"$f":"IF(Team24!$J$17=0, \"\", Team24!$J$17)","v":""},{"$f":"IF(Team24!$J$18=0, \"\", Team24!$J$18)","v":""},{"$f":"IF(Team24!$J$19=0, \"\", Team24!$J$19)","v":""},{"$f":"IF(Team24!$J$20=0, \"\", Team24!$J$20)","v":""},{"$f":"IF(Team24!$J$21=0, \"\", Team24!$J$21)","v":""},{"$f":"IF(Team24!$L$21=0, \"\", Team24!$L$21)","v":""},null,1,"","","",{"$f":"IF(BJ31=\"\", \"\", OFFSET(DM$8,MATCH(SMALL('Rank Wkst'!DD$8:DD$31,ROW()-ROW(DD$8)+1),DD$8:DD$31,0)-1,0))","v":""},{"$f":"IF(BJ31=\"\", \"\", OFFSET(DN$8,MATCH(SMALL('Rank Wkst'!DD$8:DD$31,ROW()-ROW(DD$8)+1),DD$8:DD$31,0)-1,0))","v":""},{"$f":"IF(BJ31=\"\", \"\", OFFSET(DO$8,MATCH(SMALL('Rank Wkst'!DD$8:DD$31,ROW()-ROW(DD$8)+1),DD$8:DD$31,0)-1,0))","v":""},"","","","","","","","","","","","",null,1,"",{"$f":"IF(BJ31=\"\", \"\", OFFSET(DM$8,MATCH(SMALL('Rank Wkst'!DD$8:DD$31,ROW()-ROW(DD$8)+1),DD$8:DD$31,0)-1,0))","v":""},{"$f":"IF(BJ31=\"\", \"\", OFFSET(DN$8,MATCH(SMALL('Rank Wkst'!DD$8:DD$31,ROW()-ROW(DD$8)+1),DD$8:DD$31,0)-1,0))","v":""},"","","","","","","","","","","","",null,24,{"$f":"IF('Ranking Sheet'!B35=0, \"\", 'Ranking Sheet'!B35)","v":""},"","","","","","","","","","","","","","","","",null,"","","","","","","","","","","","","","","","","","","","","","","","","","","",",,,,,,,,",",,,,,,,,/,,",",,,,,,,,,,,,,,,,/,,"]
[null,null,null,null,null,null,null,null,null,null,null,null,null,null,null,null,null,null,null,null,null,null,null,null,null,null,null,null,null,null,null,null,null,null,null,null,null,null,null,null,null,null,null,null,null,null,null,null,null,null,null,null,null,null,null,null,null,null,null,null,null,null,null,null,null,null,null,null,null,null,null,null,null,null,null,""]
[null,null,null,null,null,null,null,null,null,null,null,null,null,null,null,null,null,null,null,null,null,null,null,null,null,null,null,null,null,null,null,null,null,null,null,null,null,null,null,null,null,null,null,null,null,null,null,null,null,null,null,null,null,null,null,null,null,null,null,null,null,null,null,null,null,null,null,null,null,null,null,null,null,null,null,""]
[null,null,null,null,null,null,null,null,null,null,null,null,null,null,null,null,null,null,null,null,null,null,null,null,null,null,null,null,null,null,null,null,null,null,null,null,null,null,null,null,null,null,null,null,null,null,null,null,null,null,null,null,null,null,null,null,null,null,null,null,null,null,null,null,null,null,null,null,null,null,null,null,null,null,null,""]
[null,null,null,null,null,null,null,null,null,null,null,null,null,null,null,null,null,null,null,null,null,null,null,null,null,null,null,null,null,null,null,null,null,null,null,null,null,null,null,null,null,null,null,null,null,null,null,null,null,null,null,null,null,null,null,null,null,null,null,null,null,null,null,null,null,null,null,null,null,null,null,null,null,null,null,""]
[null,null,null,null,null,null,null,null,null,null,null,null,null,null,null,null,null,null,null,null,null,null,null,null,null,null,null,null,null,null,null,null,null,null,null,null,null,null,null,null,null,null,null,null,null,null,null,null,null,null,null,null,null,null,null,null,null,null,null,null,null,null,null,null,null,null,null,null,null,null,null,null,null,null,null,""]
[null,"The formula for summation of “1 + 2 + 3 + .. + n” is “n * (n + 1) / 2” so the summation of 4 would be “4 * (4 + 1) / 2 = 10”.",null,null,null,null,null,null,null,null,null,null,null,null,null,null,null,null,null,null,null,null,null,null,null,null,null,null,null,null,null,null,null,null,null,null,null,null,null,null,null,null,null,null,null,null,null,null,null,null,null,null,null,null,null,null,null,null,null,null,null,null,null,null,null,null,null,null,null,null,null,null,null,null,null,"",null,null,null,null,null,null,null,null,null,null,null,null,null,null,null,null,null,null,null,null,null,null,null,null,null,null,null,null,null,null,null,null,null,null,null,null,null,null,null,"The formula for summation of “1 + 2 + 3 + .. + n” is “n * (n + 1) / 2” so the summation of 4 would be “4 * (4 + 1) / 2 = 10”."]
[null,"To compute the summation of 3 teams tied for third (ranks 3 thru 5) we just subtract the summation of 2 from the the summation of 5.",null,null,null,null,null,null,null,null,null,null,null,null,null,null,null,null,null,null,null,null,null,null,null,null,null,null,null,null,null,null,null,null,null,null,null,null,null,null,null,null,null,null,null,null,null,null,null,null,null,null,null,null,null,null,null,null,null,null,null,null,null,null,null,null,null,null,null,null,null,null,null,null,null,"",null,null,null,null,null,null,null,null,null,null,null,null,null,null,null,null,null,null,null,null,null,null,null,null,null,null,null,null,null,null,null,null,null,null,null,null,null,null,null,"To compute the summation of 3 teams tied for third (ranks 3 thru 5) we just subtract the summation of 2 from the the summation of 5."]
[null,null,null,null,null,null,null,null,null,null,null,null,null,null,null,null,null,null,null,null,null,null,null,null,null,null,null,null,null,null,null,null,null,null,null,null,null,null,null,null,null,null,null,null,null,null,null,null,null,null,null,null,null,null,null,null,null,null,null,null,null,null,null,null,null,null,null,null,null,null,null,null,null,null,null,""]
[null,"Rank Calculation “((sum of tied ranks – sum of all previous ranks) / # tied)”:",null,null,null,null,null,null,null,null,null,null,null,null,null,null,null,null,null,null,null,null,null,null,null,null,null,null,null,null,null,null,null,null,null,null,null,null,null,null,null,null,null,null,null,null,null,null,null,null,null,null,null,null,null,null,null,null,null,null,null,null,null,null,null,null,null,null,null,null,null,null,null,null,null,"",null,null,null,null,null,null,null,null,null,null,null,null,null,null,null,null,null,null,null,null,null,null,null,null,null,null,null,null,null,null,null,null,null,null,null,null,null,null,null,"Rank Calculation “((sum of tied ranks – sum of all previous ranks) / # tied)”:"]
[null,3,"< Enter Rank",null,null,null,null,null,null,null,null,null,null,null,null,null,null,null,null,null,null,null,null,null,null,null,null,null,null,null,null,null,null,null,null,null,null,null,null,null,null,null,null,null,null,null,null,null,null,null,null,null,null,null,null,null,null,null,null,null,null,null,null,null,null,null,null,null,null,null,null,null,null,null,null,"",null,null,null,null,null,null,null,null,null,null,null,null,null,null,null,null,null,null,null,null,null,null,null,null,null,null,null,null,null,null,null,null,null,null,null,null,null,null,null,3,null,null,"< Enter Rank"]
[null,3,"< Enter Ties",null,null,null,null,null,null,null,null,null,null,null,null,null,null,null,null,null,null,null,null,null,null,null,null,null,null,null,null,null,null,null,null,null,null,null,null,null,null,null,null,null,null,null,null,null,null,null,null,null,null,null,null,null,null,null,null,null,null,null,null,null,null,null,null,null,null,null,null,null,null,null,null,"",null,null,null,null,null,null,null,null,null,null,null,null,null,null,null,null,null,null,null,null,null,null,null,null,null,null,null,null,null,null,null,null,null,null,null,null,null,null,null,3,null,null,"< Enter Ties"]
[null,{"$f":"(((B41+B42-1)*((B41+B42-1)+1)/2)-((B41-1)*((B41-1)+1)/2))/B42","v":4},"< Result",null,null,null,null,null,null,null,null,null,null,null,null,null,null,null,null,null,null,null,null,null,null,null,null,null,null,null,null,null,null,null,null,null,null,null,null,null,null,null,null,null,null,null,null,null,null,null,null,null,null,null,null,null,null,null,null,null,null,null,null,null,null,null,null,null,null,null,null,null,null,null,null,"",null,null,null,null,null,null,null,null,null,null,null,null,null,null,null,null,null,null,null,null,null,null,null,null,null,null,null,null,null,null,null,null,null,null,null,null,null,null,null,{"$f":"(((DL41+DL42-1)*((DL41+DL42-1)+1)/2)-((DL41-1)*((DL41-1)+1)/2))/DL42","v":4},null,null,"< Result"]
[null,null,null,null,null,null,null,null,null,null,null,null,null,null,null,null,null,null,null,null,null,null,null,null,null,null,null,null,null,null,null,null,null,null,null,null,null,null,null,null,null,null,null,null,null,null,null,null,null,null,null,null,null,null,null,null,null,null,null,null,null,null,null,null,null,null,null,null,null,null,null,null,null,null,null,""]
[null,"Calculation Breakdown:",null,null,null,null,null,null,null,null,null,null,null,null,null,null,null,null,null,null,null,null,null,null,null,null,null,null,null,null,null,null,null,null,null,null,null,null,null,null,null,null,null,null,null,null,null,null,null,null,null,null,null,null,null,null,null,null,null,null,null,null,null,null,null,null,null,null,null,null,null,null,null,null,null,"",null,null,null,null,null,null,null,null,null,null,null,null,null,null,null,null,null,null,null,null,null,null,null,null,null,null,null,null,null,null,null,null,null,null,null,null,null,null,null,"Calculation Breakdown:"]
[null,{"$f":"B41+B42-1","v":5},"< Last rank for these ties",null,null,null,null,null,null,null,null,null,null,null,null,null,null,null,null,null,null,null,null,null,null,null,null,null,null,null,null,null,null,null,null,null,null,null,null,null,null,null,null,null,null,null,null,null,null,null,null,null,null,null,null,null,null,null,null,null,null,null,null,null,null,null,null,null,null,null,null,null,null,null,null,"",null,null,null,null,null,null,null,null,null,null,null,null,null,null,null,null,null,null,null,null,null,null,null,null,null,null,null,null,null,null,null,null,null,null,null,null,null,null,null,{"$f":"DL41+DL42-1","v":5},null,null,"< Last rank for these ties"]
[null,{"$f":"B41-1","v":2},"< Last previous rank",null,null,null,null,null,null,null,null,null,null,null,null,null,null,null,null,null,null,null,null,null,null,null,null,null,null,null,null,null,null,null,null,null,null,null,null,null,null,null,null,null,null,null,null,null,null,null,null,null,null,null,null,null,null,null,null,null,null,null,null,null,null,null,null,null,null,null,null,null,null,null,null,"",null,null,null,null,null,null,null,null,null,null,null,null,null,null,null,null,null,null,null,null,null,null,null,null,null,null,null,null,null,null,null,null,null,null,null,null,null,null,null,{"$f":"DL41-1","v":2},null,null,"< Last previous rank"]
[null,null,null,null,null,null,null,null,null,null,null,null,null,null,null,null,null,null,null,null,null,null,null,null,null,null,null,null,null,null,null,null,null,null,null,null,null,null,null,null,null,null,null,null,null,null,null,null,null,null,null,null,null,null,null,null,null,null,null,null,null,null,null,null,null,null,null,null,null,null,null,null,null,null,null,""]
[null,{"$f":"(B46)*(B46+1)/2","v":15},"< Summation of tied ranks",null,null,null,null,null,null,null,null,null,null,null,null,null,null,null,null,null,null,null,null,null,null,null,null,null,null,null,null,null,null,null,null,null,null,null,null,null,null,null,null,null,null,null,null,null,null,null,null,null,null,null,null,null,null,null,null,null,null,null,null,null,null,null,null,null,null,null,null,null,null,null,null,"",null,null,null,null,null,null,null,null,null,null,null,null,null,null,null,null,null,null,null,null,null,null,null,null,null,null,null,null,null,null,null,null,null,null,null,null,null,null,null,{"$f":"(DL46)*(DL46+1)/2","v":15},null,null,"< Summation of tied ranks"]
[null,{"$f":"(B47)*(B47+1)/2","v":3},"< Summation of all previous ranks",null,null,null,null,null,null,null,null,null,null,null,null,null,null,null,null,null,null,null,null,null,null,null,null,null,null,null,null,null,null,null,null,null,null,null,null,null,null,null,null,null,null,null,null,null,null,null,null,null,null,null,null,null,null,null,null,null,null,null,null,null,null,null,null,null,null,null,null,null,null,null,null,"",null,null,null,null,null,null,null,null,null,null,null,null,null,null,null,null,null,null,null,null,null,null,null,null,null,null,null,null,null,null,null,null,null,null,null,null,null,null,null,{"$f":"(DL47)*(DL47+1)/2","v":3},null,null,"< Summation of all previous ranks"]
[null,{"$f":"(B49-B50)/B42","v":4},"< Resulting rank for these tied ranks",null,null,null,null,null,null,null,null,null,null,null,null,null,null,null,null,null,null,null,null,null,null,null,null,null,null,null,null,null,null,null,null,null,null,null,null,null,null,null,null,null,null,null,null,null,null,null,null,null,null,null,null,null,null,null,null,null,null,null,null,null,null,null,null,null,null,null,null,null,null,null,null,"",null,null,null,null,null,null,null,null,null,null,null,null,null,null,null,null,null,null,null,null,null,null,null,null,null,null,null,null,null,null,null,null,null,null,null,null,null,null,null,{"$f":"(DL49-DL50)/DL42","v":4},null,null,"< Resulting rank for these tied ranks"]
[null,null,null,null,null,null,null,null,null,null,null,null,null,null,null,null,null,null,null,null,null,null,null,null,null,null,null,null,null,null,null,null,null,null,null,null,null,null,null,null,null,null,null,null,null,null,null,null,null,null,null,null,null,null,null,null,null,null,null,null,null,null,null,null,null,null,null,null,null,null,null,null,null,null,null,""]

{"sheet":"Final Placement","index":2,"n_rows":37,"n_cols":13,"rows_kept":37,"cut":false,"hidden":false,"merged":[[31,3,31,8],[32,3,32,8],[23,3,23,8],[24,3,24,8],[25,3,25,8],[27,3,27,8],[28,3,28,8],[29,3,29,8],[26,3,26,8],[18,3,18,8],[19,3,19,8],[20,3,20,8],[21,3,21,8],[22,3,22,8],[30,3,30,8],[11,3,11,8],[12,3,12,8],[14,3,14,8],[15,3,15,8],[16,3,16,8],[17,3,17,8],[34,0,34,3],[36,0,36,2],[6,0,6,1],[6,2,6,4],[13,3,13,8],[8,0,8,1],[6,8,6,10],[8,2,8,9],[9,3,9,8],[10,3,10,8],[4,0,4,1],[4,2,4,4],[1,0,1,10],[1,12,2,17],[2,0,2,10],[4,8,4,10]]}
[]
["Minnesota State High School League Dance Team Competition",null,null,null,null,null,null,null,null,null,null,null,"For Sections and State only:  If Extra Tie-breaker Sheet is used, put \"x\" in box below for new Final Placements"]
["Final Placements"]
[]
["MEET DATE:",null,{"$f":"IF(DATE=0, \"\", DATE)","v":""},null,null,null,"MEET SITE:",null,{"$f":"IF(Site=0, \"\", Site)","v":""}]
[]
["CLASS:",null,{"$f":"IF(Class=0, \"\", Class)","v":""},null,null,null,"CATEGORY:",null,{"$f":"CATEGORY","v":"High Kick Category"}]
[]
["Final \nPlace",null,"School",null,null,null,null,null,null,null,"Ranking Point Total"]
[{"$f":"IF($N$4=\"x\", 'Rank Wkst'!EV8, 'Rank Wkst'!EC8)","v":""},{"$f":"IF($N$4=\"x\", 'Rank Wkst'!DI8, 'Rank Wkst'!ED8)","v":""},null,{"$f":"IF($N$4=\"x\", 'Rank Wkst'!EW8, 'Rank Wkst'!EE8)","v":""},null,null,null,null,null,{"$f":"IF('Rank Wkst'!CA8=\"*\",\"Tie-breaker used\", \"\")","v":""},{"$f":"'Rank Wkst'!BW8","v":""}]
[{"$f":"IF($N$4=\"x\", 'Rank Wkst'!EV9, 'Rank Wkst'!EC9)","v":""},{"$f":"IF($N$4=\"x\", 'Rank Wkst'!DI9, 'Rank Wkst'!ED9)","v":""},null,{"$f":"IF($N$4=\"x\", 'Rank Wkst'!EW9, 'Rank Wkst'!EE9)","v":""},null,null,null,null,null,{"$f":"IF('Rank Wkst'!CA9=\"*\",\"Tie-breaker used\", \"\")","v":""},{"$f":"'Rank Wkst'!BW9","v":""}]
[{"$f":"IF($N$4=\"x\", 'Rank Wkst'!EV10, 'Rank Wkst'!EC10)","v":""},{"$f":"IF($N$4=\"x\", 'Rank Wkst'!DI10, 'Rank Wkst'!ED10)","v":""},null,{"$f":"IF($N$4=\"x\", 'Rank Wkst'!EW10, 'Rank Wkst'!EE10)","v":""},null,null,null,null,null,{"$f":"IF('Rank Wkst'!CA10=\"*\",\"Tie-breaker used\", \"\")","v":""},{"$f":"'Rank Wkst'!BW10","v":""}]
[{"$f":"IF($N$4=\"x\", 'Rank Wkst'!EV11, 'Rank Wkst'!EC11)","v":""},{"$f":"IF($N$4=\"x\", 'Rank Wkst'!DI11, 'Rank Wkst'!ED11)","v":""},null,{"$f":"IF($N$4=\"x\", 'Rank Wkst'!EW11, 'Rank Wkst'!EE11)","v":""},null,null,null,null,null,{"$f":"IF('Rank Wkst'!CA11=\"*\",\"Tie-breaker used\", \"\")","v":""},{"$f":"'Rank Wkst'!BW11","v":""}]
[{"$f":"IF($N$4=\"x\", 'Rank Wkst'!EV12, 'Rank Wkst'!EC12)","v":""},{"$f":"IF($N$4=\"x\", 'Rank Wkst'!DI12, 'Rank Wkst'!ED12)","v":""},null,{"$f":"IF($N$4=\"x\", 'Rank Wkst'!EW12, 'Rank Wkst'!EE12)","v":""},null,null,null,null,null,{"$f":"IF('Rank Wkst'!CA12=\"*\",\"Tie-breaker used\", \"\")","v":""},{"$f":"'Rank Wkst'!BW12","v":""}]
[{"$f":"IF($N$4=\"x\", 'Rank Wkst'!EV13, 'Rank Wkst'!EC13)","v":""},{"$f":"IF($N$4=\"x\", 'Rank Wkst'!DI13, 'Rank Wkst'!ED13)","v":""},null,{"$f":"IF($N$4=\"x\", 'Rank Wkst'!EW13, 'Rank Wkst'!EE13)","v":""},null,null,null,null,null,{"$f":"IF('Rank Wkst'!CA13=\"*\",\"Tie-breaker used\", \"\")","v":""},{"$f":"'Rank Wkst'!BW13","v":""}]
[{"$f":"IF($N$4=\"x\", 'Rank Wkst'!EV14, 'Rank Wkst'!EC14)","v":""},{"$f":"IF($N$4=\"x\", 'Rank Wkst'!DI14, 'Rank Wkst'!ED14)","v":""},null,{"$f":"IF($N$4=\"x\", 'Rank Wkst'!EW14, 'Rank Wkst'!EE14)","v":""},null,null,null,null,null,{"$f":"IF('Rank Wkst'!CA14=\"*\",\"Tie-breaker used\", \"\")","v":""},{"$f":"'Rank Wkst'!BW14","v":""}]
[{"$f":"IF($N$4=\"x\", 'Rank Wkst'!EV15, 'Rank Wkst'!EC15)","v":""},{"$f":"IF($N$4=\"x\", 'Rank Wkst'!DI15, 'Rank Wkst'!ED15)","v":""},null,{"$f":"IF($N$4=\"x\", 'Rank Wkst'!EW15, 'Rank Wkst'!EE15)","v":""},null,null,null,null,null,{"$f":"IF('Rank Wkst'!CA15=\"*\",\"Tie-breaker used\", \"\")","v":""},{"$f":"'Rank Wkst'!BW15","v":""}]
[{"$f":"IF($N$4=\"x\", 'Rank Wkst'!EV16, 'Rank Wkst'!EC16)","v":""},{"$f":"IF($N$4=\"x\", 'Rank Wkst'!DI16, 'Rank Wkst'!ED16)","v":""},null,{"$f":"IF($N$4=\"x\", 'Rank Wkst'!EW16, 'Rank Wkst'!EE16)","v":""},null,null,null,null,null,{"$f":"IF('Rank Wkst'!CA16=\"*\",\"Tie-breaker used\", \"\")","v":""},{"$f":"'Rank Wkst'!BW16","v":""}]
[{"$f":"IF($N$4=\"x\", 'Rank Wkst'!EV17, 'Rank Wkst'!EC17)","v":""},{"$f":"IF($N$4=\"x\", 'Rank Wkst'!DI17, 'Rank Wkst'!ED17)","v":""},null,{"$f":"IF($N$4=\"x\", 'Rank Wkst'!EW17, 'Rank Wkst'!EE17)","v":""},null,null,null,null,null,{"$f":"IF('Rank Wkst'!CA17=\"*\",\"Tie-breaker used\", \"\")","v":""},{"$f":"'Rank Wkst'!BW17","v":""}]
[{"$f":"IF($N$4=\"x\", 'Rank Wkst'!EV18, 'Rank Wkst'!EC18)","v":""},{"$f":"IF($N$4=\"x\", 'Rank Wkst'!DI18, 'Rank Wkst'!ED18)","v":""},null,{"$f":"IF($N$4=\"x\", 'Rank Wkst'!EW18, 'Rank Wkst'!EE18)","v":""},null,null,null,null,null,{"$f":"IF('Rank Wkst'!CA18=\"*\",\"Tie-breaker used\", \"\")","v":""},{"$f":"'Rank Wkst'!BW18","v":""}]
[{"$f":"IF($N$4=\"x\", 'Rank Wkst'!EV19, 'Rank Wkst'!EC19)","v":""},{"$f":"IF($N$4=\"x\", 'Rank Wkst'!DI19, 'Rank Wkst'!ED19)","v":""},null,{"$f":"IF($N$4=\"x\", 'Rank Wkst'!EW19, 'Rank Wkst'!EE19)","v":""},null,null,null,null,null,{"$f":"IF('Rank Wkst'!CA19=\"*\",\"Tie-breaker used\", \"\")","v":""},{"$f":"'Rank Wkst'!BW19","v":""}]
[{"$f":"IF($N$4=\"x\", 'Rank Wkst'!EV20, 'Rank Wkst'!EC20)","v":""},{"$f":"IF($N$4=\"x\", 'Rank Wkst'!DI20, 'Rank Wkst'!ED20)","v":""},null,{"$f":"IF($N$4=\"x\", 'Rank Wkst'!EW20, 'Rank Wkst'!EE20)","v":""},null,null,null,null,null,{"$f":"IF('Rank Wkst'!CA20=\"*\",\"Tie-breaker used\", \"\")","v":""},{"$f":"'Rank Wkst'!BW20","v":""}]
[{"$f":"IF($N$4=\"x\", 'Rank Wkst'!EV21, 'Rank Wkst'!EC21)","v":""},{"$f":"IF($N$4=\"x\", 'Rank Wkst'!DI21, 'Rank Wkst'!ED21)","v":""},null,{"$f":"IF($N$4=\"x\", 'Rank Wkst'!EW21, 'Rank Wkst'!EE21)","v":""},null,null,null,null,null,{"$f":"IF('Rank Wkst'!CA21=\"*\",\"Tie-breaker used\", \"\")","v":""},{"$f":"'Rank Wkst'!BW21","v":""}]
[{"$f":"IF($N$4=\"x\", 'Rank Wkst'!EV22, 'Rank Wkst'!EC22)","v":""},{"$f":"IF($N$4=\"x\", 'Rank Wkst'!DI22, 'Rank Wkst'!ED22)","v":""},null,{"$f":"IF($N$4=\"x\", 'Rank Wkst'!EW22, 'Rank Wkst'!EE22)","v":""},null,null,null,null,null,{"$f":"IF('Rank Wkst'!CA22=\"*\",\"Tie-breaker used\", \"\")","v":""},{"$f":"'Rank Wkst'!BW22","v":""}]
[{"$f":"IF($N$4=\"x\", 'Rank Wkst'!EV23, 'Rank Wkst'!EC23)","v":""},{"$f":"IF($N$4=\"x\", 'Rank Wkst'!DI23, 'Rank Wkst'!ED23)","v":""},null,{"$f":"IF($N$4=\"x\", 'Rank Wkst'!EW23, 'Rank Wkst'!EE23)","v":""},null,null,null,null,null,{"$f":"IF('Rank Wkst'!CA23=\"*\",\"Tie-breaker used\", \"\")","v":""},{"$f":"'Rank Wkst'!BW23","v":""}]
[{"$f":"IF($N$4=\"x\", 'Rank Wkst'!EV24, 'Rank Wkst'!EC24)","v":""},{"$f":"IF($N$4=\"x\", 'Rank Wkst'!DI24, 'Rank Wkst'!ED24)","v":""},null,{"$f":"IF($N$4=\"x\", 'Rank Wkst'!EW24, 'Rank Wkst'!EE24)","v":""},null,null,null,null,null,{"$f":"IF('Rank Wkst'!CA24=\"*\",\"Tie-breaker used\", \"\")","v":""},{"$f":"'Rank Wkst'!BW24","v":""}]
[{"$f":"IF($N$4=\"x\", 'Rank Wkst'!EV25, 'Rank Wkst'!EC25)","v":""},{"$f":"IF($N$4=\"x\", 'Rank Wkst'!DI25, 'Rank Wkst'!ED25)","v":""},null,{"$f":"IF($N$4=\"x\", 'Rank Wkst'!EW25, 'Rank Wkst'!EE25)","v":""},null,null,null,null,null,{"$f":"IF('Rank Wkst'!CA25=\"*\",\"Tie-breaker used\", \"\")","v":""},{"$f":"'Rank Wkst'!BW25","v":""}]
[{"$f":"IF($N$4=\"x\", 'Rank Wkst'!EV26, 'Rank Wkst'!EC26)","v":""},{"$f":"IF($N$4=\"x\", 'Rank Wkst'!DI26, 'Rank Wkst'!ED26)","v":""},null,{"$f":"IF($N$4=\"x\", 'Rank Wkst'!EW26, 'Rank Wkst'!EE26)","v":""},null,null,null,null,null,{"$f":"IF('Rank Wkst'!CA26=\"*\",\"Tie-breaker used\", \"\")","v":""},{"$f":"'Rank Wkst'!BW26","v":""}]
[{"$f":"IF($N$4=\"x\", 'Rank Wkst'!EV27, 'Rank Wkst'!EC27)","v":""},{"$f":"IF($N$4=\"x\", 'Rank Wkst'!DI27, 'Rank Wkst'!ED27)","v":""},null,{"$f":"IF($N$4=\"x\", 'Rank Wkst'!EW27, 'Rank Wkst'!EE27)","v":""},null,null,null,null,null,{"$f":"IF('Rank Wkst'!CA27=\"*\",\"Tie-breaker used\", \"\")","v":""},{"$f":"'Rank Wkst'!BW27","v":""}]
[{"$f":"IF($N$4=\"x\", 'Rank Wkst'!EV28, 'Rank Wkst'!EC28)","v":""},{"$f":"IF($N$4=\"x\", 'Rank Wkst'!DI28, 'Rank Wkst'!ED28)","v":""},null,{"$f":"IF($N$4=\"x\", 'Rank Wkst'!EW28, 'Rank Wkst'!EE28)","v":""},null,null,null,null,null,{"$f":"IF('Rank Wkst'!CA28=\"*\",\"Tie-breaker used\", \"\")","v":""},{"$f":"'Rank Wkst'!BW28","v":""}]
[{"$f":"IF($N$4=\"x\", 'Rank Wkst'!EV29, 'Rank Wkst'!EC29)","v":""},{"$f":"IF($N$4=\"x\", 'Rank Wkst'!DI29, 'Rank Wkst'!ED29)","v":""},null,{"$f":"IF($N$4=\"x\", 'Rank Wkst'!EW29, 'Rank Wkst'!EE29)","v":""},null,null,null,null,null,{"$f":"IF('Rank Wkst'!CA29=\"*\",\"Tie-breaker used\", \"\")","v":""},{"$f":"'Rank Wkst'!BW29","v":""}]
[{"$f":"IF($N$4=\"x\", 'Rank Wkst'!EV30, 'Rank Wkst'!EC30)","v":""},{"$f":"IF($N$4=\"x\", 'Rank Wkst'!DI30, 'Rank Wkst'!ED30)","v":""},null,{"$f":"IF($N$4=\"x\", 'Rank Wkst'!EW30, 'Rank Wkst'!EE30)","v":""},null,null,null,null,null,{"$f":"IF('Rank Wkst'!CA30=\"*\",\"Tie-breaker used\", \"\")","v":""},{"$f":"'Rank Wkst'!BW30","v":""}]
[{"$f":"IF($N$4=\"x\", 'Rank Wkst'!EV31, 'Rank Wkst'!EC31)","v":""},{"$f":"IF($N$4=\"x\", 'Rank Wkst'!DI31, 'Rank Wkst'!ED31)","v":""},null,{"$f":"IF($N$4=\"x\", 'Rank Wkst'!EW31, 'Rank Wkst'!EE31)","v":""},null,null,null,null,null,{"$f":"IF('Rank Wkst'!CA31=\"*\",\"Tie-breaker used\", \"\")","v":""},{"$f":"'Rank Wkst'!BW31","v":""}]
[]
["Superior Judge Signature"]
[]
["Tabulator Signature"]

{"sheet":"Announcers Form","index":3,"n_rows":38,"n_cols":14,"rows_kept":38,"cut":false,"hidden":false,"merged":[[1,3,1,15],[2,3,2,15],[12,3,12,15],[22,11,22,15],[33,4,33,15],[34,4,34,15],[20,3,20,15],[18,3,18,5],[18,10,18,13],[37,4,37,5],[37,6,37,7],[37,11,37,12],[37,13,37,14],[24,11,24,15],[32,4,32,15],[35,4,35,15],[9,0,13,1],[28,11,28,15],[29,11,29,15],[25,11,25,15],[26,11,26,15],[27,11,27,15],[20,0,20,1],[23,11,23,15]]}
[]
[null,null,null,"Minnesota State High School League Dance Team Competition"]
[null,null,null,"ANNOUNCER RESULTS FORM"]
[]
[null,null,null,"TABULATORS AND SUPERIOR JUDGES:"]
[null,null,null,"Please use this form to fill out the results and both sign to verify that the results are accurate."]
[]
[null,null,null,"ANNOUNCER:"]
[null,null,null,"Do not announce the results unless this form is signed on the bottom."]
["For Sections and State only: If Extra Tie-breaker Sheet is used, put \"x\" in box below for new Final Placements"]
[null,null,null,"Please announce: "]
[null,null,null,"\"The team packets will be available to pick up after the awards ceremony in:\""]
[]
[null,null,null,"Superior/Tabulator: fill this in and write the time the packets are available on the envelopes"]
[]
[null,null,null,"FINAL RESULTS FROM:"]
[null,null,null,"CLASS:",null,null,{"$f":"IF(Class=0, \"\", Class)","v":""}]
[]
[null,null,null,"CATEGORY:",null,null,{"$f":"CATEGORY","v":"High Kick Category"}]
[]
["Place \"x\" in Box if Announcing place:",null,null,"ANNOUNCER - Please announce ranking point total and announce that the lowest rank score wins."]
[]
["1st","x",null,{"$f":"IF(B23=\"x\", IF($B$16=\"x\",'Rank Wkst'!DI8, 'Rank Wkst'!BU8), \"\")","v":""},{"$f":"IF(B23=\"x\", IF($B$16=\"x\",'Rank Wkst'!DA8, 'Rank Wkst'!BM8), \"\")","v":""},"Place:","with a ranking point total of:",{"$f":"IF(B23= \"x\", 'Rank Wkst'!BW8, \"\")","v":""},{"$f":"IF(B23=\"x\",'Rank Wkst'!CA8, \"\")","v":""},":",null,{"$f":"IF(B23=\"x\", IF($B$16=\"x\",'Rank Wkst'!DF8, 'Rank Wkst'!BR8), \"\")","v":""}]
["2nd","x",null,{"$f":"IF(B24=\"x\", IF($B$16=\"x\",'Rank Wkst'!DI9, 'Rank Wkst'!BU9), \"\")","v":""},{"$f":"IF(B24=\"x\", IF($B$16=\"x\",'Rank Wkst'!DA9, 'Rank Wkst'!BM9), \"\")","v":""},"Place:","with a ranking point total of:",{"$f":"IF(B24= \"x\", 'Rank Wkst'!BW9, \"\")","v":""},{"$f":"IF(B24=\"x\",'Rank Wkst'!CA9, \"\")","v":""},":",null,{"$f":"IF(B24=\"x\", IF($B$16=\"x\",'Rank Wkst'!DF9, 'Rank Wkst'!BR9), \"\")","v":""}]
["3rd","x",null,{"$f":"IF(B25=\"x\", IF($B$16=\"x\",'Rank Wkst'!DI10, 'Rank Wkst'!BU10), \"\")","v":""},{"$f":"IF(B25=\"x\", IF($B$16=\"x\",'Rank Wkst'!DA10, 'Rank Wkst'!BM10), \"\")","v":""},"Place:","with a ranking point total of:",{"$f":"IF(B25= \"x\", 'Rank Wkst'!BW10, \"\")","v":""},{"$f":"IF(B25=\"x\",'Rank Wkst'!CA10, \"\")","v":""},":",null,{"$f":"IF(B25=\"x\", IF($B$16=\"x\",'Rank Wkst'!DF10, 'Rank Wkst'!BR10), \"\")","v":""}]
["4th","x",null,{"$f":"IF(B26=\"x\", IF($B$16=\"x\",'Rank Wkst'!DI11, 'Rank Wkst'!BU11), \"\")","v":""},{"$f":"IF(B26=\"x\", IF($B$16=\"x\",'Rank Wkst'!DA11, 'Rank Wkst'!BM11), \"\")","v":""},"Place:","with a ranking point total of:",{"$f":"IF(B26= \"x\", 'Rank Wkst'!BW11, \"\")","v":""},{"$f":"IF(B26=\"x\",'Rank Wkst'!CA11, \"\")","v":""},":",null,{"$f":"IF(B26=\"x\", IF($B$16=\"x\",'Rank Wkst'!DF11, 'Rank Wkst'!BR11), \"\")","v":""}]
["5th","x",null,{"$f":"IF(B27=\"x\", IF($B$16=\"x\",'Rank Wkst'!DI12, 'Rank Wkst'!BU12), \"\")","v":""},{"$f":"IF(B27=\"x\", IF($B$16=\"x\",'Rank Wkst'!DA12, 'Rank Wkst'!BM12), \"\")","v":""},"Place:","with a ranking point total of:",{"$f":"IF(B27= \"x\", 'Rank Wkst'!BW12, \"\")","v":""},{"$f":"IF(B27=\"x\",'Rank Wkst'!CA12, \"\")","v":""},":",null,{"$f":"IF(B27=\"x\", IF($B$16=\"x\",'Rank Wkst'!DF12, 'Rank Wkst'!BR12), \"\")","v":""}]
["6th","x",null,{"$f":"IF(B28=\"x\", IF($B$16=\"x\",'Rank Wkst'!DI13, 'Rank Wkst'!BU13), \"\")","v":""},{"$f":"IF(B28=\"x\", IF($B$16=\"x\",'Rank Wkst'!DA13, 'Rank Wkst'!BM13), \"\")","v":""},"Place:","with a ranking point total of:",{"$f":"IF(B28= \"x\", 'Rank Wkst'!BW13, \"\")","v":""},{"$f":"IF(B28=\"x\",'Rank Wkst'!CA13, \"\")","v":""},":",null,{"$f":"IF(B28=\"x\", IF($B$16=\"x\",'Rank Wkst'!DF13, 'Rank Wkst'!BR13), \"\")","v":""}]
["7th",null,null,{"$f":"IF(B29=\"x\", IF($B$16=\"x\",'Rank Wkst'!DI14, 'Rank Wkst'!BU14), \"\")","v":""},{"$f":"IF(B29=\"x\", IF($B$16=\"x\",'Rank Wkst'!DA14, 'Rank Wkst'!BM14), \"\")","v":""},"Place:","with a ranking point total of:",{"$f":"IF(B29= \"x\", 'Rank Wkst'!BW14, \"\")","v":""},{"$f":"IF(B29=\"x\",'Rank Wkst'!CA14, \"\")","v":""},":",null,{"$f":"IF(B29=\"x\", IF($B$16=\"x\",'Rank Wkst'!DF14, 'Rank Wkst'!BR14), \"\")","v":""}]
["8th",null,null,{"$f":"IF(B30=\"x\", IF($B$16=\"x\",'Rank Wkst'!DI15, 'Rank Wkst'!BU15), \"\")","v":""},{"$f":"IF(B30=\"x\", IF($B$16=\"x\",'Rank Wkst'!DA15, 'Rank Wkst'!BM15), \"\")","v":""},"Place:","with a ranking point total of:",{"$f":"IF(B30= \"x\", 'Rank Wkst'!BW15, \"\")","v":""},{"$f":"IF(B30=\"x\",'Rank Wkst'!CA15, \"\")","v":""},":",null,{"$f":"IF(B30=\"x\", IF($B$16=\"x\",'Rank Wkst'!DF15, 'Rank Wkst'!BR15), \"\")","v":""}]
[null,null,null,null,"* = Tie-breaker was used"]
[]
[]
[null,null,null,null,"Superior Judge Signature"]
[]
[null,null,null,null,"Tabulator Signature"]
[]
[null,null,null,null,"Meet Site:",null,{"$f":"IF(Site=0, \"\", Site)","v":""},null,null,null,null,"Meet Date:",null,{"$f":"IF(DATE=0, \"\", DATE)","v":""}]

{"sheet":"Point Summary","index":4,"n_rows":41,"n_cols":36,"rows_kept":41,"cut":false,"hidden":false,"merged":[[9,6,9,7],[10,0,10,1],[10,17,10,18],[10,20,10,21],[34,2,34,3],[8,14,8,18],[8,19,8,21],[9,11,9,12],[33,2,33,3],[27,2,27,3],[28,2,28,3],[29,2,29,3],[30,2,30,3],[31,2,31,3],[32,2,32,3],[21,2,21,3],[22,2,22,3],[23,2,23,3],[24,2,24,3],[25,2,25,3],[26,2,26,3],[15,2,15,3],[16,2,16,3],[17,2,17,3],[18,2,18,3],[19,2,19,3],[20,2,20,3],[10,2,10,3],[11,2,11,3],[12,2,12,3],[13,2,13,3],[14,2,14,3],[4,6,4,7],[6,6,6,7],[8,4,8,13],[9,4,9,5],[9,8,9,10],[2,0,2,21],[2,24,3,29],[4,8,4,16],[4,0,4,2],[6,0,6,2],[1,0,1,21],[6,8,6,16],[11,24,11,29],[12,24,12,29],[13,24,13,29],[14,24,14,29],[15,24,15,29],[16,24,16,29],[17,24,17,29],[18,24,18,29],[19,24,19,29],[20,24,20,29],[21,24,21,29],[22,24,22,29],[23,24,23,29],[24,24,24,29],[25,24,25,29],[26,24,26,29],[27,24,27,29],[28,24,28,29],[29,24,29,29],[30,24,30,29],[31,24,31,29],[32,24,32,29],[33,24,33,29],[34,24,34,29]]}
[]
["Minnesota State High School League Dance Team Competition"]
["Point and Rank Summary",null,null,null,null,null,null,null,null,null,null,null,null,null,null,null,null,null,null,null,null,null,null,null,"For Sections and State only:  If Extra Tie-breaker Sheet is used, put \"x\" in box below for new Final Placements"]
[]
["MEET DATE:",null,null,{"$f":"IF(DATE=0, \"\", DATE)","v":""},null,null,"MEET SITE:",null,{"$f":"IF(Site=0, \"\", Site)","v":""}]
[]
["CLASS:",null,null,{"$f":"IF(Class=0, \"\", Class)","v":""},null,null,"CATEGORY:",null,{"$f":"CATEGORY","v":"High Kick Category"}]
[]
[null,null,null,null,"Category Points Breakdown",null,null,null,null,null,null,null,null,null,"Category Points Total",null,null,null,null,"Rank"]
[null,null,null,null,"Kicks",null,"Choreography",null,"Difficulty",null,null,"Execution",null,"Routine Eff."]
["Final Rank",null,"School",null,"Technique of Kicks","Kick Height","Creativity","Visual Effectiveness","Difficulty of Routine Choreography","Difficulty of Formations & Transitions","Difficulty of Kicks","Placement & Control","Degree of Accuracy","Routine Effectiveness","SubTotal Points","(Deductions)","Total Points","Out of Total Points Possible",null,"Rank Points","Final \nRank",null,null,null,"Website"]
[{"$f":"IF($Z$5=\"x\", 'Rank Wkst'!EV8, 'Rank Wkst'!EC8)","v":""},{"$f":"IF($Z$5=\"x\", 'Rank Wkst'!DI8, 'Rank Wkst'!ED8)","v":""},{"$f":"IF($Z$5=\"x\", 'Rank Wkst'!EW8, 'Rank Wkst'!EE8)","v":""},null,{"$f":"IF($Z$5=\"x\", 'Rank Wkst'!EX8,'Rank Wkst'!EF8)","v":""},{"$f":"IF($Z$5=\"x\", 'Rank Wkst'!EY8,'Rank Wkst'!EG8)","v":""},{"$f":"IF($Z$5=\"x\", 'Rank Wkst'!EZ8,'Rank Wkst'!EH8)","v":""},{"$f":"IF($Z$5=\"x\", 'Rank Wkst'!FA8,'Rank Wkst'!EI8)","v":""},{"$f":"IF($Z$5=\"x\", 'Rank Wkst'!FB8,'Rank Wkst'!EJ8)","v":""},{"$f":"IF($Z$5=\"x\", 'Rank Wkst'!FC8,'Rank Wkst'!EK8)","v":""},{"$f":"IF($Z$5=\"x\", 'Rank Wkst'!FD8,'Rank Wkst'!EL8)","v":""},{"$f":"IF($Z$5=\"x\", 'Rank Wkst'!FE8,'Rank Wkst'!EM8)","v":""},{"$f":"IF($Z$5=\"x\", 'Rank Wkst'!FG8,'Rank Wkst'!EN8)","v":""},{"$f":"IF($Z$5=\"x\", 'Rank Wkst'!FG8,'Rank Wkst'!EO8)","v":""},{"$f":"IF($Z$5=\"x\", 'Rank Wkst'!FH8,'Rank Wkst'!EP8)","v":""},{"$f":"IF($Z$5=\"x\", 'Rank Wkst'!FI8,'Rank Wkst'!EQ8)","v":""},{"$f":"IF($Z$5=\"x\", 'Rank Wkst'!FJ8,'Rank Wkst'!ER8)","v":""},{"$f":"\"/\"","v":"/"},{"$f":"IF($Z$5=\"x\", 'Rank Wkst'!FK8,'Rank Wkst'!ES8)","v":""},{"$f":"'Rank Wkst'!ET8","v":""},{"$f":"IF($Z$5=\"x\", 'Rank Wkst'!EV8, 'Rank Wkst'!EC8)","v":""},{"$f":"IF($Z$5=\"x\", 'Rank Wkst'!DI8, 'Rank Wkst'!ED8)","v":""},null,null,{"$f":"IF(E12=\"\",\" \",'Rank Wkst'!HI8)","v":" "}]
[{"$f":"IF($Z$5=\"x\", 'Rank Wkst'!EV9, 'Rank Wkst'!EC9)","v":""},{"$f":"IF($Z$5=\"x\", 'Rank Wkst'!DI9, 'Rank Wkst'!ED9)","v":""},{"$f":"IF($Z$5=\"x\", 'Rank Wkst'!EW9, 'Rank Wkst'!EE9)","v":""},null,{"$f":"IF($Z$5=\"x\", 'Rank Wkst'!EX9,'Rank Wkst'!EF9)","v":""},{"$f":"IF($Z$5=\"x\", 'Rank Wkst'!EY9,'Rank Wkst'!EG9)","v":""},{"$f":"IF($Z$5=\"x\", 'Rank Wkst'!EZ9,'Rank Wkst'!EH9)","v":""},{"$f":"IF($Z$5=\"x\", 'Rank Wkst'!FA9,'Rank Wkst'!EI9)","v":""},{"$f":"IF($Z$5=\"x\", 'Rank Wkst'!FB9,'Rank Wkst'!EJ9)","v":""},{"$f":"IF($Z$5=\"x\", 'Rank Wkst'!FC9,'Rank Wkst'!EK9)","v":""},{"$f":"IF($Z$5=\"x\", 'Rank Wkst'!FD9,'Rank Wkst'!EL9)","v":""},{"$f":"IF($Z$5=\"x\", 'Rank Wkst'!FE9,'Rank Wkst'!EM9)","v":""},{"$f":"IF($Z$5=\"x\", 'Rank Wkst'!FG9,'Rank Wkst'!EN9)","v":""},{"$f":"IF($Z$5=\"x\", 'Rank Wkst'!FG9,'Rank Wkst'!EO9)","v":""},{"$f":"IF($Z$5=\"x\", 'Rank Wkst'!FH9,'Rank Wkst'!EP9)","v":""},{"$f":"IF($Z$5=\"x\", 'Rank Wkst'!FI9,'Rank Wkst'!EQ9)","v":""},{"$f":"IF($Z$5=\"x\", 'Rank Wkst'!FJ9,'Rank Wkst'!ER9)","v":""},{"$f":"\"/\"","v":"/"},{"$f":"IF($Z$5=\"x\", 'Rank Wkst'!FK9,'Rank Wkst'!ES9)","v":""},{"$f":"'Rank Wkst'!ET9","v":""},{"$f":"IF($Z$5=\"x\", 'Rank Wkst'!EV9, 'Rank Wkst'!EC9)","v":""},{"$f":"IF($Z$5=\"x\", 'Rank Wkst'!DI9, 'Rank Wkst'!ED9)","v":""},null,null,{"$f":"IF(E13=\"\",\" \",'Rank Wkst'!HI9)","v":" "}]
[{"$f":"IF($Z$5=\"x\", 'Rank Wkst'!EV10, 'Rank Wkst'!EC10)","v":""},{"$f":"IF($Z$5=\"x\", 'Rank Wkst'!DI10, 'Rank Wkst'!ED10)","v":""},{"$f":"IF($Z$5=\"x\", 'Rank Wkst'!EW10, 'Rank Wkst'!EE10)","v":""},null,{"$f":"IF($Z$5=\"x\", 'Rank Wkst'!EX10,'Rank Wkst'!EF10)","v":""},{"$f":"IF($Z$5=\"x\", 'Rank Wkst'!EY10,'Rank Wkst'!EG10)","v":""},{"$f":"IF($Z$5=\"x\", 'Rank Wkst'!EZ10,'Rank Wkst'!EH10)","v":""},{"$f":"IF($Z$5=\"x\", 'Rank Wkst'!FA10,'Rank Wkst'!EI10)","v":""},{"$f":"IF($Z$5=\"x\", 'Rank Wkst'!FB10,'Rank Wkst'!EJ10)","v":""},{"$f":"IF($Z$5=\"x\", 'Rank Wkst'!FC10,'Rank Wkst'!EK10)","v":""},{"$f":"IF($Z$5=\"x\", 'Rank Wkst'!FD10,'Rank Wkst'!EL10)","v":""},{"$f":"IF($Z$5=\"x\", 'Rank Wkst'!FE10,'Rank Wkst'!EM10)","v":""},{"$f":"IF($Z$5=\"x\", 'Rank Wkst'!FG10,'Rank Wkst'!EN10)","v":""},{"$f":"IF($Z$5=\"x\", 'Rank Wkst'!FG10,'Rank Wkst'!EO10)","v":""},{"$f":"IF($Z$5=\"x\", 'Rank Wkst'!FH10,'Rank Wkst'!EP10)","v":""},{"$f":"IF($Z$5=\"x\", 'Rank Wkst'!FI10,'Rank Wkst'!EQ10)","v":""},{"$f":"IF($Z$5=\"x\", 'Rank Wkst'!FJ10,'Rank Wkst'!ER10)","v":""},"/",{"$f":"IF($Z$5=\"x\", 'Rank Wkst'!FK10,'Rank Wkst'!ES10)","v":""},{"$f":"'Rank Wkst'!ET10","v":""},{"$f":"IF($Z$5=\"x\", 'Rank Wkst'!EV10, 'Rank Wkst'!EC10)","v":""},{"$f":"IF($Z$5=\"x\", 'Rank Wkst'!DI10, 'Rank Wkst'!ED10)","v":""},null,null,{"$f":"IF(E14=\"\",\" \",'Rank Wkst'!HI10)","v":" "}]
[{"$f":"IF($Z$5=\"x\", 'Rank Wkst'!EV11, 'Rank Wkst'!EC11)","v":""},{"$f":"IF($Z$5=\"x\", 'Rank Wkst'!DI11, 'Rank Wkst'!ED11)","v":""},{"$f":"IF($Z$5=\"x\", 'Rank Wkst'!EW11, 'Rank Wkst'!EE11)","v":""},null,{"$f":"IF($Z$5=\"x\", 'Rank Wkst'!EX11,'Rank Wkst'!EF11)","v":""},{"$f":"IF($Z$5=\"x\", 'Rank Wkst'!EY11,'Rank Wkst'!EG11)","v":""},{"$f":"IF($Z$5=\"x\", 'Rank Wkst'!EZ11,'Rank Wkst'!EH11)","v":""},{"$f":"IF($Z$5=\"x\", 'Rank Wkst'!FA11,'Rank Wkst'!EI11)","v":""},{"$f":"IF($Z$5=\"x\", 'Rank Wkst'!FB11,'Rank Wkst'!EJ11)","v":""},{"$f":"IF($Z$5=\"x\", 'Rank Wkst'!FC11,'Rank Wkst'!EK11)","v":""},{"$f":"IF($Z$5=\"x\", 'Rank Wkst'!FD11,'Rank Wkst'!EL11)","v":""},{"$f":"IF($Z$5=\"x\", 'Rank Wkst'!FE11,'Rank Wkst'!EM11)","v":""},{"$f":"IF($Z$5=\"x\", 'Rank Wkst'!FG11,'Rank Wkst'!EN11)","v":""},{"$f":"IF($Z$5=\"x\", 'Rank Wkst'!FG11,'Rank Wkst'!EO11)","v":""},{"$f":"IF($Z$5=\"x\", 'Rank Wkst'!FH11,'Rank Wkst'!EP11)","v":""},{"$f":"IF($Z$5=\"x\", 'Rank Wkst'!FI11,'Rank Wkst'!EQ11)","v":""},{"$f":"IF($Z$5=\"x\", 'Rank Wkst'!FJ11,'Rank Wkst'!ER11)","v":""},"/",{"$f":"IF($Z$5=\"x\", 'Rank Wkst'!FK11,'Rank Wkst'!ES11)","v":""},{"$f":"'Rank Wkst'!ET11","v":""},{"$f":"IF($Z$5=\"x\", 'Rank Wkst'!EV11, 'Rank Wkst'!EC11)","v":""},{"$f":"IF($Z$5=\"x\", 'Rank Wkst'!DI11, 'Rank Wkst'!ED11)","v":""},null,null,{"$f":"IF(E15=\"\",\" \",'Rank Wkst'!HI11)","v":" "}]
[{"$f":"IF($Z$5=\"x\", 'Rank Wkst'!EV12, 'Rank Wkst'!EC12)","v":""},{"$f":"IF($Z$5=\"x\", 'Rank Wkst'!DI12, 'Rank Wkst'!ED12)","v":""},{"$f":"IF($Z$5=\"x\", 'Rank Wkst'!EW12, 'Rank Wkst'!EE12)","v":""},null,{"$f":"IF($Z$5=\"x\", 'Rank Wkst'!EX12,'Rank Wkst'!EF12)","v":""},{"$f":"IF($Z$5=\"x\", 'Rank Wkst'!EY12,'Rank Wkst'!EG12)","v":""},{"$f":"IF($Z$5=\"x\", 'Rank Wkst'!EZ12,'Rank Wkst'!EH12)","v":""},{"$f":"IF($Z$5=\"x\", 'Rank Wkst'!FA12,'Rank Wkst'!EI12)","v":""},{"$f":"IF($Z$5=\"x\", 'Rank Wkst'!FB12,'Rank Wkst'!EJ12)","v":""},{"$f":"IF($Z$5=\"x\", 'Rank Wkst'!FC12,'Rank Wkst'!EK12)","v":""},{"$f":"IF($Z$5=\"x\", 'Rank Wkst'!FD12,'Rank Wkst'!EL12)","v":""},{"$f":"IF($Z$5=\"x\", 'Rank Wkst'!FE12,'Rank Wkst'!EM12)","v":""},{"$f":"IF($Z$5=\"x\", 'Rank Wkst'!FG12,'Rank Wkst'!EN12)","v":""},{"$f":"IF($Z$5=\"x\", 'Rank Wkst'!FG12,'Rank Wkst'!EO12)","v":""},{"$f":"IF($Z$5=\"x\", 'Rank Wkst'!FH12,'Rank Wkst'!EP12)","v":""},{"$f":"IF($Z$5=\"x\", 'Rank Wkst'!FI12,'Rank Wkst'!EQ12)","v":""},{"$f":"IF($Z$5=\"x\", 'Rank Wkst'!FJ12,'Rank Wkst'!ER12)","v":""},"/",{"$f":"IF($Z$5=\"x\", 'Rank Wkst'!FK12,'Rank Wkst'!ES12)","v":""},{"$f":"'Rank Wkst'!ET12","v":""},{"$f":"IF($Z$5=\"x\", 'Rank Wkst'!EV12, 'Rank Wkst'!EC12)","v":""},{"$f":"IF($Z$5=\"x\", 'Rank Wkst'!DI12, 'Rank Wkst'!ED12)","v":""},null,null,{"$f":"IF(E16=\"\",\" \",'Rank Wkst'!HI12)","v":" "}]
[{"$f":"IF($Z$5=\"x\", 'Rank Wkst'!EV13, 'Rank Wkst'!EC13)","v":""},{"$f":"IF($Z$5=\"x\", 'Rank Wkst'!DI13, 'Rank Wkst'!ED13)","v":""},{"$f":"IF($Z$5=\"x\", 'Rank Wkst'!EW13, 'Rank Wkst'!EE13)","v":""},null,{"$f":"IF($Z$5=\"x\", 'Rank Wkst'!EX13,'Rank Wkst'!EF13)","v":""},{"$f":"IF($Z$5=\"x\", 'Rank Wkst'!EY13,'Rank Wkst'!EG13)","v":""},{"$f":"IF($Z$5=\"x\", 'Rank Wkst'!EZ13,'Rank Wkst'!EH13)","v":""},{"$f":"IF($Z$5=\"x\", 'Rank Wkst'!FA13,'Rank Wkst'!EI13)","v":""},{"$f":"IF($Z$5=\"x\", 'Rank Wkst'!FB13,'Rank Wkst'!EJ13)","v":""},{"$f":"IF($Z$5=\"x\", 'Rank Wkst'!FC13,'Rank Wkst'!EK13)","v":""},{"$f":"IF($Z$5=\"x\", 'Rank Wkst'!FD13,'Rank Wkst'!EL13)","v":""},{"$f":"IF($Z$5=\"x\", 'Rank Wkst'!FE13,'Rank Wkst'!EM13)","v":""},{"$f":"IF($Z$5=\"x\", 'Rank Wkst'!FG13,'Rank Wkst'!EN13)","v":""},{"$f":"IF($Z$5=\"x\", 'Rank Wkst'!FG13,'Rank Wkst'!EO13)","v":""},{"$f":"IF($Z$5=\"x\", 'Rank Wkst'!FH13,'Rank Wkst'!EP13)","v":""},{"$f":"IF($Z$5=\"x\", 'Rank Wkst'!FI13,'Rank Wkst'!EQ13)","v":""},{"$f":"IF($Z$5=\"x\", 'Rank Wkst'!FJ13,'Rank Wkst'!ER13)","v":""},"/",{"$f":"IF($Z$5=\"x\", 'Rank Wkst'!FK13,'Rank Wkst'!ES13)","v":""},{"$f":"'Rank Wkst'!ET13","v":""},{"$f":"IF($Z$5=\"x\", 'Rank Wkst'!EV13, 'Rank Wkst'!EC13)","v":""},{"$f":"IF($Z$5=\"x\", 'Rank Wkst'!DI13, 'Rank Wkst'!ED13)","v":""},null,null,{"$f":"IF(E17=\"\",\" \",'Rank Wkst'!HI13)","v":" "}]
[{"$f":"IF($Z$5=\"x\", 'Rank Wkst'!EV14, 'Rank Wkst'!EC14)","v":""},{"$f":"IF($Z$5=\"x\", 'Rank Wkst'!DI14, 'Rank Wkst'!ED14)","v":""},{"$f":"IF($Z$5=\"x\", 'Rank Wkst'!EW14, 'Rank Wkst'!EE14)","v":""},null,{"$f":"IF($Z$5=\"x\", 'Rank Wkst'!EX14,'Rank Wkst'!EF14)","v":""},{"$f":"IF($Z$5=\"x\", 'Rank Wkst'!EY14,'Rank Wkst'!EG14)","v":""},{"$f":"IF($Z$5=\"x\", 'Rank Wkst'!EZ14,'Rank Wkst'!EH14)","v":""},{"$f":"IF($Z$5=\"x\", 'Rank Wkst'!FA14,'Rank Wkst'!EI14)","v":""},{"$f":"IF($Z$5=\"x\", 'Rank Wkst'!FB14,'Rank Wkst'!EJ14)","v":""},{"$f":"IF($Z$5=\"x\", 'Rank Wkst'!FC14,'Rank Wkst'!EK14)","v":""},{"$f":"IF($Z$5=\"x\", 'Rank Wkst'!FD14,'Rank Wkst'!EL14)","v":""},{"$f":"IF($Z$5=\"x\", 'Rank Wkst'!FE14,'Rank Wkst'!EM14)","v":""},{"$f":"IF($Z$5=\"x\", 'Rank Wkst'!FG14,'Rank Wkst'!EN14)","v":""},{"$f":"IF($Z$5=\"x\", 'Rank Wkst'!FG14,'Rank Wkst'!EO14)","v":""},{"$f":"IF($Z$5=\"x\", 'Rank Wkst'!FH14,'Rank Wkst'!EP14)","v":""},{"$f":"IF($Z$5=\"x\", 'Rank Wkst'!FI14,'Rank Wkst'!EQ14)","v":""},{"$f":"IF($Z$5=\"x\", 'Rank Wkst'!FJ14,'Rank Wkst'!ER14)","v":""},"/",{"$f":"IF($Z$5=\"x\", 'Rank Wkst'!FK14,'Rank Wkst'!ES14)","v":""},{"$f":"'Rank Wkst'!ET14","v":""},{"$f":"IF($Z$5=\"x\", 'Rank Wkst'!EV14, 'Rank Wkst'!EC14)","v":""},{"$f":"IF($Z$5=\"x\", 'Rank Wkst'!DI14, 'Rank Wkst'!ED14)","v":""},null,null,{"$f":"IF(E18=\"\",\" \",'Rank Wkst'!HI14)","v":" "}]
[{"$f":"IF($Z$5=\"x\", 'Rank Wkst'!EV15, 'Rank Wkst'!EC15)","v":""},{"$f":"IF($Z$5=\"x\", 'Rank Wkst'!DI15, 'Rank Wkst'!ED15)","v":""},{"$f":"IF($Z$5=\"x\", 'Rank Wkst'!EW15, 'Rank Wkst'!EE15)","v":""},null,{"$f":"IF($Z$5=\"x\", 'Rank Wkst'!EX15,'Rank Wkst'!EF15)","v":""},{"$f":"IF($Z$5=\"x\", 'Rank Wkst'!EY15,'Rank Wkst'!EG15)","v":""},{"$f":"IF($Z$5=\"x\", 'Rank Wkst'!EZ15,'Rank Wkst'!EH15)","v":""},{"$f":"IF($Z$5=\"x\", 'Rank Wkst'!FA15,'Rank Wkst'!EI15)","v":""},{"$f":"IF($Z$5=\"x\", 'Rank Wkst'!FB15,'Rank Wkst'!EJ15)","v":""},{"$f":"IF($Z$5=\"x\", 'Rank Wkst'!FC15,'Rank Wkst'!EK15)","v":""},{"$f":"IF($Z$5=\"x\", 'Rank Wkst'!FD15,'Rank Wkst'!EL15)","v":""},{"$f":"IF($Z$5=\"x\", 'Rank Wkst'!FE15,'Rank Wkst'!EM15)","v":""},{"$f":"IF($Z$5=\"x\", 'Rank Wkst'!FG15,'Rank Wkst'!EN15)","v":""},{"$f":"IF($Z$5=\"x\", 'Rank Wkst'!FG15,'Rank Wkst'!EO15)","v":""},{"$f":"IF($Z$5=\"x\", 'Rank Wkst'!FH15,'Rank Wkst'!EP15)","v":""},{"$f":"IF($Z$5=\"x\", 'Rank Wkst'!FI15,'Rank Wkst'!EQ15)","v":""},{"$f":"IF($Z$5=\"x\", 'Rank Wkst'!FJ15,'Rank Wkst'!ER15)","v":""},"/",{"$f":"IF($Z$5=\"x\", 'Rank Wkst'!FK15,'Rank Wkst'!ES15)","v":""},{"$f":"'Rank Wkst'!ET15","v":""},{"$f":"IF($Z$5=\"x\", 'Rank Wkst'!EV15, 'Rank Wkst'!EC15)","v":""},{"$f":"IF($Z$5=\"x\", 'Rank Wkst'!DI15, 'Rank Wkst'!ED15)","v":""},null,null,{"$f":"IF(E19=\"\",\" \",'Rank Wkst'!HI15)","v":" "}]
[{"$f":"IF($Z$5=\"x\", 'Rank Wkst'!EV16, 'Rank Wkst'!EC16)","v":""},{"$f":"IF($Z$5=\"x\", 'Rank Wkst'!DI16, 'Rank Wkst'!ED16)","v":""},{"$f":"IF($Z$5=\"x\", 'Rank Wkst'!EW16, 'Rank Wkst'!EE16)","v":""},null,{"$f":"IF($Z$5=\"x\", 'Rank Wkst'!EX16,'Rank Wkst'!EF16)","v":""},{"$f":"IF($Z$5=\"x\", 'Rank Wkst'!EY16,'Rank Wkst'!EG16)","v":""},{"$f":"IF($Z$5=\"x\", 'Rank Wkst'!EZ16,'Rank Wkst'!EH16)","v":""},{"$f":"IF($Z$5=\"x\", 'Rank Wkst'!FA16,'Rank Wkst'!EI16)","v":""},{"$f":"IF($Z$5=\"x\", 'Rank Wkst'!FB16,'Rank Wkst'!EJ16)","v":""},{"$f":"IF($Z$5=\"x\", 'Rank Wkst'!FC16,'Rank Wkst'!EK16)","v":""},{"$f":"IF($Z$5=\"x\", 'Rank Wkst'!FD16,'Rank Wkst'!EL16)","v":""},{"$f":"IF($Z$5=\"x\", 'Rank Wkst'!FE16,'Rank Wkst'!EM16)","v":""},{"$f":"IF($Z$5=\"x\", 'Rank Wkst'!FG16,'Rank Wkst'!EN16)","v":""},{"$f":"IF($Z$5=\"x\", 'Rank Wkst'!FG16,'Rank Wkst'!EO16)","v":""},{"$f":"IF($Z$5=\"x\", 'Rank Wkst'!FH16,'Rank Wkst'!EP16)","v":""},{"$f":"IF($Z$5=\"x\", 'Rank Wkst'!FI16,'Rank Wkst'!EQ16)","v":""},{"$f":"IF($Z$5=\"x\", 'Rank Wkst'!FJ16,'Rank Wkst'!ER16)","v":""},"/",{"$f":"IF($Z$5=\"x\", 'Rank Wkst'!FK16,'Rank Wkst'!ES16)","v":""},{"$f":"'Rank Wkst'!ET16","v":""},{"$f":"IF($Z$5=\"x\", 'Rank Wkst'!EV16, 'Rank Wkst'!EC16)","v":""},{"$f":"IF($Z$5=\"x\", 'Rank Wkst'!DI16, 'Rank Wkst'!ED16)","v":""},null,null,{"$f":"IF(E20=\"\",\" \",'Rank Wkst'!HI16)","v":" "}]
[{"$f":"IF($Z$5=\"x\", 'Rank Wkst'!EV17, 'Rank Wkst'!EC17)","v":""},{"$f":"IF($Z$5=\"x\", 'Rank Wkst'!DI17, 'Rank Wkst'!ED17)","v":""},{"$f":"IF($Z$5=\"x\", 'Rank Wkst'!EW17, 'Rank Wkst'!EE17)","v":""},null,{"$f":"IF($Z$5=\"x\", 'Rank Wkst'!EX17,'Rank Wkst'!EF17)","v":""},{"$f":"IF($Z$5=\"x\", 'Rank Wkst'!EY17,'Rank Wkst'!EG17)","v":""},{"$f":"IF($Z$5=\"x\", 'Rank Wkst'!EZ17,'Rank Wkst'!EH17)","v":""},{"$f":"IF($Z$5=\"x\", 'Rank Wkst'!FA17,'Rank Wkst'!EI17)","v":""},{"$f":"IF($Z$5=\"x\", 'Rank Wkst'!FB17,'Rank Wkst'!EJ17)","v":""},{"$f":"IF($Z$5=\"x\", 'Rank Wkst'!FC17,'Rank Wkst'!EK17)","v":""},{"$f":"IF($Z$5=\"x\", 'Rank Wkst'!FD17,'Rank Wkst'!EL17)","v":""},{"$f":"IF($Z$5=\"x\", 'Rank Wkst'!FE17,'Rank Wkst'!EM17)","v":""},{"$f":"IF($Z$5=\"x\", 'Rank Wkst'!FG17,'Rank Wkst'!EN17)","v":""},{"$f":"IF($Z$5=\"x\", 'Rank Wkst'!FG17,'Rank Wkst'!EO17)","v":""},{"$f":"IF($Z$5=\"x\", 'Rank Wkst'!FH17,'Rank Wkst'!EP17)","v":""},{"$f":"IF($Z$5=\"x\", 'Rank Wkst'!FI17,'Rank Wkst'!EQ17)","v":""},{"$f":"IF($Z$5=\"x\", 'Rank Wkst'!FJ17,'Rank Wkst'!ER17)","v":""},"/",{"$f":"IF($Z$5=\"x\", 'Rank Wkst'!FK17,'Rank Wkst'!ES17)","v":""},{"$f":"'Rank Wkst'!ET17","v":""},{"$f":"IF($Z$5=\"x\", 'Rank Wkst'!EV17, 'Rank Wkst'!EC17)","v":""},{"$f":"IF($Z$5=\"x\", 'Rank Wkst'!DI17, 'Rank Wkst'!ED17)","v":""},null,null,{"$f":"IF(E21=\"\",\" \",'Rank Wkst'!HI17)","v":" "}]
[{"$f":"IF($Z$5=\"x\", 'Rank Wkst'!EV18, 'Rank Wkst'!EC18)","v":""},{"$f":"IF($Z$5=\"x\", 'Rank Wkst'!DI18, 'Rank Wkst'!ED18)","v":""},{"$f":"IF($Z$5=\"x\", 'Rank Wkst'!EW18, 'Rank Wkst'!EE18)","v":""},null,{"$f":"IF($Z$5=\"x\", 'Rank Wkst'!EX18,'Rank Wkst'!EF18)","v":""},{"$f":"IF($Z$5=\"x\", 'Rank Wkst'!EY18,'Rank Wkst'!EG18)","v":""},{"$f":"IF($Z$5=\"x\", 'Rank Wkst'!EZ18,'Rank Wkst'!EH18)","v":""},{"$f":"IF($Z$5=\"x\", 'Rank Wkst'!FA18,'Rank Wkst'!EI18)","v":""},{"$f":"IF($Z$5=\"x\", 'Rank Wkst'!FB18,'Rank Wkst'!EJ18)","v":""},{"$f":"IF($Z$5=\"x\", 'Rank Wkst'!FC18,'Rank Wkst'!EK18)","v":""},{"$f":"IF($Z$5=\"x\", 'Rank Wkst'!FD18,'Rank Wkst'!EL18)","v":""},{"$f":"IF($Z$5=\"x\", 'Rank Wkst'!FE18,'Rank Wkst'!EM18)","v":""},{"$f":"IF($Z$5=\"x\", 'Rank Wkst'!FG18,'Rank Wkst'!EN18)","v":""},{"$f":"IF($Z$5=\"x\", 'Rank Wkst'!FG18,'Rank Wkst'!EO18)","v":""},{"$f":"IF($Z$5=\"x\", 'Rank Wkst'!FH18,'Rank Wkst'!EP18)","v":""},{"$f":"IF($Z$5=\"x\", 'Rank Wkst'!FI18,'Rank Wkst'!EQ18)","v":""},{"$f":"IF($Z$5=\"x\", 'Rank Wkst'!FJ18,'Rank Wkst'!ER18)","v":""},"/",{"$f":"IF($Z$5=\"x\", 'Rank Wkst'!FK18,'Rank Wkst'!ES18)","v":""},{"$f":"'Rank Wkst'!ET18","v":""},{"$f":"IF($Z$5=\"x\", 'Rank Wkst'!EV18, 'Rank Wkst'!EC18)","v":""},{"$f":"IF($Z$5=\"x\", 'Rank Wkst'!DI18, 'Rank Wkst'!ED18)","v":""},null,null,{"$f":"IF(E22=\"\",\" \",'Rank Wkst'!HI18)","v":" "}]
[{"$f":"IF($Z$5=\"x\", 'Rank Wkst'!EV19, 'Rank Wkst'!EC19)","v":""},{"$f":"IF($Z$5=\"x\", 'Rank Wkst'!DI19, 'Rank Wkst'!ED19)","v":""},{"$f":"IF($Z$5=\"x\", 'Rank Wkst'!EW19, 'Rank Wkst'!EE19)","v":""},null,{"$f":"IF($Z$5=\"x\", 'Rank Wkst'!EX19,'Rank Wkst'!EF19)","v":""},{"$f":"IF($Z$5=\"x\", 'Rank Wkst'!EY19,'Rank Wkst'!EG19)","v":""},{"$f":"IF($Z$5=\"x\", 'Rank Wkst'!EZ19,'Rank Wkst'!EH19)","v":""},{"$f":"IF($Z$5=\"x\", 'Rank Wkst'!FA19,'Rank Wkst'!EI19)","v":""},{"$f":"IF($Z$5=\"x\", 'Rank Wkst'!FB19,'Rank Wkst'!EJ19)","v":""},{"$f":"IF($Z$5=\"x\", 'Rank Wkst'!FC19,'Rank Wkst'!EK19)","v":""},{"$f":"IF($Z$5=\"x\", 'Rank Wkst'!FD19,'Rank Wkst'!EL19)","v":""},{"$f":"IF($Z$5=\"x\", 'Rank Wkst'!FE19,'Rank Wkst'!EM19)","v":""},{"$f":"IF($Z$5=\"x\", 'Rank Wkst'!FG19,'Rank Wkst'!EN19)","v":""},{"$f":"IF($Z$5=\"x\", 'Rank Wkst'!FG19,'Rank Wkst'!EO19)","v":""},{"$f":"IF($Z$5=\"x\", 'Rank Wkst'!FH19,'Rank Wkst'!EP19)","v":""},{"$f":"IF($Z$5=\"x\", 'Rank Wkst'!FI19,'Rank Wkst'!EQ19)","v":""},{"$f":"IF($Z$5=\"x\", 'Rank Wkst'!FJ19,'Rank Wkst'!ER19)","v":""},"/",{"$f":"IF($Z$5=\"x\", 'Rank Wkst'!FK19,'Rank Wkst'!ES19)","v":""},{"$f":"'Rank Wkst'!ET19","v":""},{"$f":"IF($Z$5=\"x\", 'Rank Wkst'!EV19, 'Rank Wkst'!EC19)","v":""},{"$f":"IF($Z$5=\"x\", 'Rank Wkst'!DI19, 'Rank Wkst'!ED19)","v":""},null,null,{"$f":"IF(E23=\"\",\" \",'Rank Wkst'!HI19)","v":" "}]
[{"$f":"IF($Z$5=\"x\", 'Rank Wkst'!EV20, 'Rank Wkst'!EC20)","v":""},{"$f":"IF($Z$5=\"x\", 'Rank Wkst'!DI20, 'Rank Wkst'!ED20)","v":""},{"$f":"IF($Z$5=\"x\", 'Rank Wkst'!EW20, 'Rank Wkst'!EE20)","v":""},null,{"$f":"IF($Z$5=\"x\", 'Rank Wkst'!EX20,'Rank Wkst'!EF20)","v":""},{"$f":"IF($Z$5=\"x\", 'Rank Wkst'!EY20,'Rank Wkst'!EG20)","v":""},{"$f":"IF($Z$5=\"x\", 'Rank Wkst'!EZ20,'Rank Wkst'!EH20)","v":""},{"$f":"IF($Z$5=\"x\", 'Rank Wkst'!FA20,'Rank Wkst'!EI20)","v":""},{"$f":"IF($Z$5=\"x\", 'Rank Wkst'!FB20,'Rank Wkst'!EJ20)","v":""},{"$f":"IF($Z$5=\"x\", 'Rank Wkst'!FC20,'Rank Wkst'!EK20)","v":""},{"$f":"IF($Z$5=\"x\", 'Rank Wkst'!FD20,'Rank Wkst'!EL20)","v":""},{"$f":"IF($Z$5=\"x\", 'Rank Wkst'!FE20,'Rank Wkst'!EM20)","v":""},{"$f":"IF($Z$5=\"x\", 'Rank Wkst'!FG20,'Rank Wkst'!EN20)","v":""},{"$f":"IF($Z$5=\"x\", 'Rank Wkst'!FG20,'Rank Wkst'!EO20)","v":""},{"$f":"IF($Z$5=\"x\", 'Rank Wkst'!FH20,'Rank Wkst'!EP20)","v":""},{"$f":"IF($Z$5=\"x\", 'Rank Wkst'!FI20,'Rank Wkst'!EQ20)","v":""},{"$f":"IF($Z$5=\"x\", 'Rank Wkst'!FJ20,'Rank Wkst'!ER20)","v":""},"/",{"$f":"IF($Z$5=\"x\", 'Rank Wkst'!FK20,'Rank Wkst'!ES20)","v":""},{"$f":"'Rank Wkst'!ET20","v":""},{"$f":"IF($Z$5=\"x\", 'Rank Wkst'!EV20, 'Rank Wkst'!EC20)","v":""},{"$f":"IF($Z$5=\"x\", 'Rank Wkst'!DI20, 'Rank Wkst'!ED20)","v":""},null,null,{"$f":"IF(E24=\"\",\" \",'Rank Wkst'!HI20)","v":" "}]
[{"$f":"IF($Z$5=\"x\", 'Rank Wkst'!EV21, 'Rank Wkst'!EC21)","v":""},{"$f":"IF($Z$5=\"x\", 'Rank Wkst'!DI21, 'Rank Wkst'!ED21)","v":""},{"$f":"IF($Z$5=\"x\", 'Rank Wkst'!EW21, 'Rank Wkst'!EE21)","v":""},null,{"$f":"IF($Z$5=\"x\", 'Rank Wkst'!EX21,'Rank Wkst'!EF21)","v":""},{"$f":"IF($Z$5=\"x\", 'Rank Wkst'!EY21,'Rank Wkst'!EG21)","v":""},{"$f":"IF($Z$5=\"x\", 'Rank Wkst'!EZ21,'Rank Wkst'!EH21)","v":""},{"$f":"IF($Z$5=\"x\", 'Rank Wkst'!FA21,'Rank Wkst'!EI21)","v":""},{"$f":"IF($Z$5=\"x\", 'Rank Wkst'!FB21,'Rank Wkst'!EJ21)","v":""},{"$f":"IF($Z$5=\"x\", 'Rank Wkst'!FC21,'Rank Wkst'!EK21)","v":""},{"$f":"IF($Z$5=\"x\", 'Rank Wkst'!FD21,'Rank Wkst'!EL21)","v":""},{"$f":"IF($Z$5=\"x\", 'Rank Wkst'!FE21,'Rank Wkst'!EM21)","v":""},{"$f":"IF($Z$5=\"x\", 'Rank Wkst'!FG21,'Rank Wkst'!EN21)","v":""},{"$f":"IF($Z$5=\"x\", 'Rank Wkst'!FG21,'Rank Wkst'!EO21)","v":""},{"$f":"IF($Z$5=\"x\", 'Rank Wkst'!FH21,'Rank Wkst'!EP21)","v":""},{"$f":"IF($Z$5=\"x\", 'Rank Wkst'!FI21,'Rank Wkst'!EQ21)","v":""},{"$f":"IF($Z$5=\"x\", 'Rank Wkst'!FJ21,'Rank Wkst'!ER21)","v":""},"/",{"$f":"IF($Z$5=\"x\", 'Rank Wkst'!FK21,'Rank Wkst'!ES21)","v":""},{"$f":"'Rank Wkst'!ET21","v":""},{"$f":"IF($Z$5=\"x\", 'Rank Wkst'!EV21, 'Rank Wkst'!EC21)","v":""},{"$f":"IF($Z$5=\"x\", 'Rank Wkst'!DI21, 'Rank Wkst'!ED21)","v":""},null,null,{"$f":"IF(E25=\"\",\" \",'Rank Wkst'!HI21)","v":" "}]
[{"$f":"IF($Z$5=\"x\", 'Rank Wkst'!EV22, 'Rank Wkst'!EC22)","v":""},{"$f":"IF($Z$5=\"x\", 'Rank Wkst'!DI22, 'Rank Wkst'!ED22)","v":""},{"$f":"IF($Z$5=\"x\", 'Rank Wkst'!EW22, 'Rank Wkst'!EE22)","v":""},null,{"$f":"IF($Z$5=\"x\", 'Rank Wkst'!EX22,'Rank Wkst'!EF22)","v":""},{"$f":"IF($Z$5=\"x\", 'Rank Wkst'!EY22,'Rank Wkst'!EG22)","v":""},{"$f":"IF($Z$5=\"x\", 'Rank Wkst'!EZ22,'Rank Wkst'!EH22)","v":""},{"$f":"IF($Z$5=\"x\", 'Rank Wkst'!FA22,'Rank Wkst'!EI22)","v":""},{"$f":"IF($Z$5=\"x\", 'Rank Wkst'!FB22,'Rank Wkst'!EJ22)","v":""},{"$f":"IF($Z$5=\"x\", 'Rank Wkst'!FC22,'Rank Wkst'!EK22)","v":""},{"$f":"IF($Z$5=\"x\", 'Rank Wkst'!FD22,'Rank Wkst'!EL22)","v":""},{"$f":"IF($Z$5=\"x\", 'Rank Wkst'!FE22,'Rank Wkst'!EM22)","v":""},{"$f":"IF($Z$5=\"x\", 'Rank Wkst'!FG22,'Rank Wkst'!EN22)","v":""},{"$f":"IF($Z$5=\"x\", 'Rank Wkst'!FG22,'Rank Wkst'!EO22)","v":""},{"$f":"IF($Z$5=\"x\", 'Rank Wkst'!FH22,'Rank Wkst'!EP22)","v":""},{"$f":"IF($Z$5=\"x\", 'Rank Wkst'!FI22,'Rank Wkst'!EQ22)","v":""},{"$f":"IF($Z$5=\"x\", 'Rank Wkst'!FJ22,'Rank Wkst'!ER22)","v":""},"/",{"$f":"IF($Z$5=\"x\", 'Rank Wkst'!FK22,'Rank Wkst'!ES22)","v":""},{"$f":"'Rank Wkst'!ET22","v":""},{"$f":"IF($Z$5=\"x\", 'Rank Wkst'!EV22, 'Rank Wkst'!EC22)","v":""},{"$f":"IF($Z$5=\"x\", 'Rank Wkst'!DI22, 'Rank Wkst'!ED22)","v":""},null,null,{"$f":"IF(E26=\"\",\" \",'Rank Wkst'!HI22)","v":" "}]
[{"$f":"IF($Z$5=\"x\", 'Rank Wkst'!EV23, 'Rank Wkst'!EC23)","v":""},{"$f":"IF($Z$5=\"x\", 'Rank Wkst'!DI23, 'Rank Wkst'!ED23)","v":""},{"$f":"IF($Z$5=\"x\", 'Rank Wkst'!EW23, 'Rank Wkst'!EE23)","v":""},null,{"$f":"IF($Z$5=\"x\", 'Rank Wkst'!EX23,'Rank Wkst'!EF23)","v":""},{"$f":"IF($Z$5=\"x\", 'Rank Wkst'!EY23,'Rank Wkst'!EG23)","v":""},{"$f":"IF($Z$5=\"x\", 'Rank Wkst'!EZ23,'Rank Wkst'!EH23)","v":""},{"$f":"IF($Z$5=\"x\", 'Rank Wkst'!FA23,'Rank Wkst'!EI23)","v":""},{"$f":"IF($Z$5=\"x\", 'Rank Wkst'!FB23,'Rank Wkst'!EJ23)","v":""},{"$f":"IF($Z$5=\"x\", 'Rank Wkst'!FC23,'Rank Wkst'!EK23)","v":""},{"$f":"IF($Z$5=\"x\", 'Rank Wkst'!FD23,'Rank Wkst'!EL23)","v":""},{"$f":"IF($Z$5=\"x\", 'Rank Wkst'!FE23,'Rank Wkst'!EM23)","v":""},{"$f":"IF($Z$5=\"x\", 'Rank Wkst'!FG23,'Rank Wkst'!EN23)","v":""},{"$f":"IF($Z$5=\"x\", 'Rank Wkst'!FG23,'Rank Wkst'!EO23)","v":""},{"$f":"IF($Z$5=\"x\", 'Rank Wkst'!FH23,'Rank Wkst'!EP23)","v":""},{"$f":"IF($Z$5=\"x\", 'Rank Wkst'!FI23,'Rank Wkst'!EQ23)","v":""},{"$f":"IF($Z$5=\"x\", 'Rank Wkst'!FJ23,'Rank Wkst'!ER23)","v":""},"/",{"$f":"IF($Z$5=\"x\", 'Rank Wkst'!FK23,'Rank Wkst'!ES23)","v":""},{"$f":"'Rank Wkst'!ET23","v":""},{"$f":"IF($Z$5=\"x\", 'Rank Wkst'!EV23, 'Rank Wkst'!EC23)","v":""},{"$f":"IF($Z$5=\"x\", 'Rank Wkst'!DI23, 'Rank Wkst'!ED23)","v":""},null,null,{"$f":"IF(E27=\"\",\" \",'Rank Wkst'!HI23)","v":" "}]
[{"$f":"IF($Z$5=\"x\", 'Rank Wkst'!EV24, 'Rank Wkst'!EC24)","v":""},{"$f":"IF($Z$5=\"x\", 'Rank Wkst'!DI24, 'Rank Wkst'!ED24)","v":""},{"$f":"IF($Z$5=\"x\", 'Rank Wkst'!EW24, 'Rank Wkst'!EE24)","v":""},null,{"$f":"IF($Z$5=\"x\", 'Rank Wkst'!EX24,'Rank Wkst'!EF24)","v":""},{"$f":"IF($Z$5=\"x\", 'Rank Wkst'!EY24,'Rank Wkst'!EG24)","v":""},{"$f":"IF($Z$5=\"x\", 'Rank Wkst'!EZ24,'Rank Wkst'!EH24)","v":""},{"$f":"IF($Z$5=\"x\", 'Rank Wkst'!FA24,'Rank Wkst'!EI24)","v":""},{"$f":"IF($Z$5=\"x\", 'Rank Wkst'!FB24,'Rank Wkst'!EJ24)","v":""},{"$f":"IF($Z$5=\"x\", 'Rank Wkst'!FC24,'Rank Wkst'!EK24)","v":""},{"$f":"IF($Z$5=\"x\", 'Rank Wkst'!FD24,'Rank Wkst'!EL24)","v":""},{"$f":"IF($Z$5=\"x\", 'Rank Wkst'!FE24,'Rank Wkst'!EM24)","v":""},{"$f":"IF($Z$5=\"x\", 'Rank Wkst'!FG24,'Rank Wkst'!EN24)","v":""},{"$f":"IF($Z$5=\"x\", 'Rank Wkst'!FG24,'Rank Wkst'!EO24)","v":""},{"$f":"IF($Z$5=\"x\", 'Rank Wkst'!FH24,'Rank Wkst'!EP24)","v":""},{"$f":"IF($Z$5=\"x\", 'Rank Wkst'!FI24,'Rank Wkst'!EQ24)","v":""},{"$f":"IF($Z$5=\"x\", 'Rank Wkst'!FJ24,'Rank Wkst'!ER24)","v":""},"/",{"$f":"IF($Z$5=\"x\", 'Rank Wkst'!FK24,'Rank Wkst'!ES24)","v":""},{"$f":"'Rank Wkst'!ET24","v":""},{"$f":"IF($Z$5=\"x\", 'Rank Wkst'!EV24, 'Rank Wkst'!EC24)","v":""},{"$f":"IF($Z$5=\"x\", 'Rank Wkst'!DI24, 'Rank Wkst'!ED24)","v":""},null,null,{"$f":"IF(E28=\"\",\" \",'Rank Wkst'!HI24)","v":" "}]
[{"$f":"IF($Z$5=\"x\", 'Rank Wkst'!EV25, 'Rank Wkst'!EC25)","v":""},{"$f":"IF($Z$5=\"x\", 'Rank Wkst'!DI25, 'Rank Wkst'!ED25)","v":""},{"$f":"IF($Z$5=\"x\", 'Rank Wkst'!EW25, 'Rank Wkst'!EE25)","v":""},null,{"$f":"IF($Z$5=\"x\", 'Rank Wkst'!EX25,'Rank Wkst'!EF25)","v":""},{"$f":"IF($Z$5=\"x\", 'Rank Wkst'!EY25,'Rank Wkst'!EG25)","v":""},{"$f":"IF($Z$5=\"x\", 'Rank Wkst'!EZ25,'Rank Wkst'!EH25)","v":""},{"$f":"IF($Z$5=\"x\", 'Rank Wkst'!FA25,'Rank Wkst'!EI25)","v":""},{"$f":"IF($Z$5=\"x\", 'Rank Wkst'!FB25,'Rank Wkst'!EJ25)","v":""},{"$f":"IF($Z$5=\"x\", 'Rank Wkst'!FC25,'Rank Wkst'!EK25)","v":""},{"$f":"IF($Z$5=\"x\", 'Rank Wkst'!FD25,'Rank Wkst'!EL25)","v":""},{"$f":"IF($Z$5=\"x\", 'Rank Wkst'!FE25,'Rank Wkst'!EM25)","v":""},{"$f":"IF($Z$5=\"x\", 'Rank Wkst'!FG25,'Rank Wkst'!EN25)","v":""},{"$f":"IF($Z$5=\"x\", 'Rank Wkst'!FG25,'Rank Wkst'!EO25)","v":""},{"$f":"IF($Z$5=\"x\", 'Rank Wkst'!FH25,'Rank Wkst'!EP25)","v":""},{"$f":"IF($Z$5=\"x\", 'Rank Wkst'!FI25,'Rank Wkst'!EQ25)","v":""},{"$f":"IF($Z$5=\"x\", 'Rank Wkst'!FJ25,'Rank Wkst'!ER25)","v":""},"/",{"$f":"IF($Z$5=\"x\", 'Rank Wkst'!FK25,'Rank Wkst'!ES25)","v":""},{"$f":"'Rank Wkst'!ET25","v":""},{"$f":"IF($Z$5=\"x\", 'Rank Wkst'!EV25, 'Rank Wkst'!EC25)","v":""},{"$f":"IF($Z$5=\"x\", 'Rank Wkst'!DI25, 'Rank Wkst'!ED25)","v":""},null,null,{"$f":"IF(E29=\"\",\" \",'Rank Wkst'!HI25)","v":" "}]
[{"$f":"IF($Z$5=\"x\", 'Rank Wkst'!EV26, 'Rank Wkst'!EC26)","v":""},{"$f":"IF($Z$5=\"x\", 'Rank Wkst'!DI26, 'Rank Wkst'!ED26)","v":""},{"$f":"IF($Z$5=\"x\", 'Rank Wkst'!EW26, 'Rank Wkst'!EE26)","v":""},null,{"$f":"IF($Z$5=\"x\", 'Rank Wkst'!EX26,'Rank Wkst'!EF26)","v":""},{"$f":"IF($Z$5=\"x\", 'Rank Wkst'!EY26,'Rank Wkst'!EG26)","v":""},{"$f":"IF($Z$5=\"x\", 'Rank Wkst'!EZ26,'Rank Wkst'!EH26)","v":""},{"$f":"IF($Z$5=\"x\", 'Rank Wkst'!FA26,'Rank Wkst'!EI26)","v":""},{"$f":"IF($Z$5=\"x\", 'Rank Wkst'!FB26,'Rank Wkst'!EJ26)","v":""},{"$f":"IF($Z$5=\"x\", 'Rank Wkst'!FC26,'Rank Wkst'!EK26)","v":""},{"$f":"IF($Z$5=\"x\", 'Rank Wkst'!FD26,'Rank Wkst'!EL26)","v":""},{"$f":"IF($Z$5=\"x\", 'Rank Wkst'!FE26,'Rank Wkst'!EM26)","v":""},{"$f":"IF($Z$5=\"x\", 'Rank Wkst'!FG26,'Rank Wkst'!EN26)","v":""},{"$f":"IF($Z$5=\"x\", 'Rank Wkst'!FG26,'Rank Wkst'!EO26)","v":""},{"$f":"IF($Z$5=\"x\", 'Rank Wkst'!FH26,'Rank Wkst'!EP26)","v":""},{"$f":"IF($Z$5=\"x\", 'Rank Wkst'!FI26,'Rank Wkst'!EQ26)","v":""},{"$f":"IF($Z$5=\"x\", 'Rank Wkst'!FJ26,'Rank Wkst'!ER26)","v":""},"/",{"$f":"IF($Z$5=\"x\", 'Rank Wkst'!FK26,'Rank Wkst'!ES26)","v":""},{"$f":"'Rank Wkst'!ET26","v":""},{"$f":"IF($Z$5=\"x\", 'Rank Wkst'!EV26, 'Rank Wkst'!EC26)","v":""},{"$f":"IF($Z$5=\"x\", 'Rank Wkst'!DI26, 'Rank Wkst'!ED26)","v":""},null,null,{"$f":"IF(E30=\"\",\" \",'Rank Wkst'!HI26)","v":" "}]
[{"$f":"IF($Z$5=\"x\", 'Rank Wkst'!EV27, 'Rank Wkst'!EC27)","v":""},{"$f":"IF($Z$5=\"x\", 'Rank Wkst'!DI27, 'Rank Wkst'!ED27)","v":""},{"$f":"IF($Z$5=\"x\", 'Rank Wkst'!EW27, 'Rank Wkst'!EE27)","v":""},null,{"$f":"IF($Z$5=\"x\", 'Rank Wkst'!EX27,'Rank Wkst'!EF27)","v":""},{"$f":"IF($Z$5=\"x\", 'Rank Wkst'!EY27,'Rank Wkst'!EG27)","v":""},{"$f":"IF($Z$5=\"x\", 'Rank Wkst'!EZ27,'Rank Wkst'!EH27)","v":""},{"$f":"IF($Z$5=\"x\", 'Rank Wkst'!FA27,'Rank Wkst'!EI27)","v":""},{"$f":"IF($Z$5=\"x\", 'Rank Wkst'!FB27,'Rank Wkst'!EJ27)","v":""},{"$f":"IF($Z$5=\"x\", 'Rank Wkst'!FC27,'Rank Wkst'!EK27)","v":""},{"$f":"IF($Z$5=\"x\", 'Rank Wkst'!FD27,'Rank Wkst'!EL27)","v":""},{"$f":"IF($Z$5=\"x\", 'Rank Wkst'!FE27,'Rank Wkst'!EM27)","v":""},{"$f":"IF($Z$5=\"x\", 'Rank Wkst'!FG27,'Rank Wkst'!EN27)","v":""},{"$f":"IF($Z$5=\"x\", 'Rank Wkst'!FG27,'Rank Wkst'!EO27)","v":""},{"$f":"IF($Z$5=\"x\", 'Rank Wkst'!FH27,'Rank Wkst'!EP27)","v":""},{"$f":"IF($Z$5=\"x\", 'Rank Wkst'!FI27,'Rank Wkst'!EQ27)","v":""},{"$f":"IF($Z$5=\"x\", 'Rank Wkst'!FJ27,'Rank Wkst'!ER27)","v":""},"/",{"$f":"IF($Z$5=\"x\", 'Rank Wkst'!FK27,'Rank Wkst'!ES27)","v":""},{"$f":"'Rank Wkst'!ET27","v":""},{"$f":"IF($Z$5=\"x\", 'Rank Wkst'!EV27, 'Rank Wkst'!EC27)","v":""},{"$f":"IF($Z$5=\"x\", 'Rank Wkst'!DI27, 'Rank Wkst'!ED27)","v":""},null,null,{"$f":"IF(E31=\"\",\" \",'Rank Wkst'!HI27)","v":" "}]
[{"$f":"IF($Z$5=\"x\", 'Rank Wkst'!EV28, 'Rank Wkst'!EC28)","v":""},{"$f":"IF($Z$5=\"x\", 'Rank Wkst'!DI28, 'Rank Wkst'!ED28)","v":""},{"$f":"IF($Z$5=\"x\", 'Rank Wkst'!EW28, 'Rank Wkst'!EE28)","v":""},null,{"$f":"IF($Z$5=\"x\", 'Rank Wkst'!EX28,'Rank Wkst'!EF28)","v":""},{"$f":"IF($Z$5=\"x\", 'Rank Wkst'!EY28,'Rank Wkst'!EG28)","v":""},{"$f":"IF($Z$5=\"x\", 'Rank Wkst'!EZ28,'Rank Wkst'!EH28)","v":""},{"$f":"IF($Z$5=\"x\", 'Rank Wkst'!FA28,'Rank Wkst'!EI28)","v":""},{"$f":"IF($Z$5=\"x\", 'Rank Wkst'!FB28,'Rank Wkst'!EJ28)","v":""},{"$f":"IF($Z$5=\"x\", 'Rank Wkst'!FC28,'Rank Wkst'!EK28)","v":""},{"$f":"IF($Z$5=\"x\", 'Rank Wkst'!FD28,'Rank Wkst'!EL28)","v":""},{"$f":"IF($Z$5=\"x\", 'Rank Wkst'!FE28,'Rank Wkst'!EM28)","v":""},{"$f":"IF($Z$5=\"x\", 'Rank Wkst'!FG28,'Rank Wkst'!EN28)","v":""},{"$f":"IF($Z$5=\"x\", 'Rank Wkst'!FG28,'Rank Wkst'!EO28)","v":""},{"$f":"IF($Z$5=\"x\", 'Rank Wkst'!FH28,'Rank Wkst'!EP28)","v":""},{"$f":"IF($Z$5=\"x\", 'Rank Wkst'!FI28,'Rank Wkst'!EQ28)","v":""},{"$f":"IF($Z$5=\"x\", 'Rank Wkst'!FJ28,'Rank Wkst'!ER28)","v":""},"/",{"$f":"IF($Z$5=\"x\", 'Rank Wkst'!FK28,'Rank Wkst'!ES28)","v":""},{"$f":"'Rank Wkst'!ET28","v":""},{"$f":"IF($Z$5=\"x\", 'Rank Wkst'!EV28, 'Rank Wkst'!EC28)","v":""},{"$f":"IF($Z$5=\"x\", 'Rank Wkst'!DI28, 'Rank Wkst'!ED28)","v":""},null,null,{"$f":"IF(E32=\"\",\" \",'Rank Wkst'!HI28)","v":" "}]
[{"$f":"IF($Z$5=\"x\", 'Rank Wkst'!EV29, 'Rank Wkst'!EC29)","v":""},{"$f":"IF($Z$5=\"x\", 'Rank Wkst'!DI29, 'Rank Wkst'!ED29)","v":""},{"$f":"IF($Z$5=\"x\", 'Rank Wkst'!EW29, 'Rank Wkst'!EE29)","v":""},null,{"$f":"IF($Z$5=\"x\", 'Rank Wkst'!EX29,'Rank Wkst'!EF29)","v":""},{"$f":"IF($Z$5=\"x\", 'Rank Wkst'!EY29,'Rank Wkst'!EG29)","v":""},{"$f":"IF($Z$5=\"x\", 'Rank Wkst'!EZ29,'Rank Wkst'!EH29)","v":""},{"$f":"IF($Z$5=\"x\", 'Rank Wkst'!FA29,'Rank Wkst'!EI29)","v":""},{"$f":"IF($Z$5=\"x\", 'Rank Wkst'!FB29,'Rank Wkst'!EJ29)","v":""},{"$f":"IF($Z$5=\"x\", 'Rank Wkst'!FC29,'Rank Wkst'!EK29)","v":""},{"$f":"IF($Z$5=\"x\", 'Rank Wkst'!FD29,'Rank Wkst'!EL29)","v":""},{"$f":"IF($Z$5=\"x\", 'Rank Wkst'!FE29,'Rank Wkst'!EM29)","v":""},{"$f":"IF($Z$5=\"x\", 'Rank Wkst'!FG29,'Rank Wkst'!EN29)","v":""},{"$f":"IF($Z$5=\"x\", 'Rank Wkst'!FG29,'Rank Wkst'!EO29)","v":""},{"$f":"IF($Z$5=\"x\", 'Rank Wkst'!FH29,'Rank Wkst'!EP29)","v":""},{"$f":"IF($Z$5=\"x\", 'Rank Wkst'!FI29,'Rank Wkst'!EQ29)","v":""},{"$f":"IF($Z$5=\"x\", 'Rank Wkst'!FJ29,'Rank Wkst'!ER29)","v":""},"/",{"$f":"IF($Z$5=\"x\", 'Rank Wkst'!FK29,'Rank Wkst'!ES29)","v":""},{"$f":"'Rank Wkst'!ET29","v":""},{"$f":"IF($Z$5=\"x\", 'Rank Wkst'!EV29, 'Rank Wkst'!EC29)","v":""},{"$f":"IF($Z$5=\"x\", 'Rank Wkst'!DI29, 'Rank Wkst'!ED29)","v":""},null,null,{"$f":"IF(E33=\"\",\" \",'Rank Wkst'!HI29)","v":" "}]
[{"$f":"IF($Z$5=\"x\", 'Rank Wkst'!EV30, 'Rank Wkst'!EC30)","v":""},{"$f":"IF($Z$5=\"x\", 'Rank Wkst'!DI30, 'Rank Wkst'!ED30)","v":""},{"$f":"IF($Z$5=\"x\", 'Rank Wkst'!EW30, 'Rank Wkst'!EE30)","v":""},null,{"$f":"IF($Z$5=\"x\", 'Rank Wkst'!EX30,'Rank Wkst'!EF30)","v":""},{"$f":"IF($Z$5=\"x\", 'Rank Wkst'!EY30,'Rank Wkst'!EG30)","v":""},{"$f":"IF($Z$5=\"x\", 'Rank Wkst'!EZ30,'Rank Wkst'!EH30)","v":""},{"$f":"IF($Z$5=\"x\", 'Rank Wkst'!FA30,'Rank Wkst'!EI30)","v":""},{"$f":"IF($Z$5=\"x\", 'Rank Wkst'!FB30,'Rank Wkst'!EJ30)","v":""},{"$f":"IF($Z$5=\"x\", 'Rank Wkst'!FC30,'Rank Wkst'!EK30)","v":""},{"$f":"IF($Z$5=\"x\", 'Rank Wkst'!FD30,'Rank Wkst'!EL30)","v":""},{"$f":"IF($Z$5=\"x\", 'Rank Wkst'!FE30,'Rank Wkst'!EM30)","v":""},{"$f":"IF($Z$5=\"x\", 'Rank Wkst'!FG30,'Rank Wkst'!EN30)","v":""},{"$f":"IF($Z$5=\"x\", 'Rank Wkst'!FG30,'Rank Wkst'!EO30)","v":""},{"$f":"IF($Z$5=\"x\", 'Rank Wkst'!FH30,'Rank Wkst'!EP30)","v":""},{"$f":"IF($Z$5=\"x\", 'Rank Wkst'!FI30,'Rank Wkst'!EQ30)","v":""},{"$f":"IF($Z$5=\"x\", 'Rank Wkst'!FJ30,'Rank Wkst'!ER30)","v":""},"/",{"$f":"IF($Z$5=\"x\", 'Rank Wkst'!FK30,'Rank Wkst'!ES30)","v":""},{"$f":"'Rank Wkst'!ET30","v":""},{"$f":"IF($Z$5=\"x\", 'Rank Wkst'!EV30, 'Rank Wkst'!EC30)","v":""},{"$f":"IF($Z$5=\"x\", 'Rank Wkst'!DI30, 'Rank Wkst'!ED30)","v":""},null,null,{"$f":"IF(E34=\"\",\" \",'Rank Wkst'!HI30)","v":" "}]
[{"$f":"IF($Z$5=\"x\", 'Rank Wkst'!EV31, 'Rank Wkst'!EC31)","v":""},{"$f":"IF($Z$5=\"x\", 'Rank Wkst'!DI31, 'Rank Wkst'!ED31)","v":""},{"$f":"IF($Z$5=\"x\", 'Rank Wkst'!EW31, 'Rank Wkst'!EE31)","v":""},null,{"$f":"IF($Z$5=\"x\", 'Rank Wkst'!EX31,'Rank Wkst'!EF31)","v":""},{"$f":"IF($Z$5=\"x\", 'Rank Wkst'!EY31,'Rank Wkst'!EG31)","v":""},{"$f":"IF($Z$5=\"x\", 'Rank Wkst'!EZ31,'Rank Wkst'!EH31)","v":""},{"$f":"IF($Z$5=\"x\", 'Rank Wkst'!FA31,'Rank Wkst'!EI31)","v":""},{"$f":"IF($Z$5=\"x\", 'Rank Wkst'!FB31,'Rank Wkst'!EJ31)","v":""},{"$f":"IF($Z$5=\"x\", 'Rank Wkst'!FC31,'Rank Wkst'!EK31)","v":""},{"$f":"IF($Z$5=\"x\", 'Rank Wkst'!FD31,'Rank Wkst'!EL31)","v":""},{"$f":"IF($Z$5=\"x\", 'Rank Wkst'!FE31,'Rank Wkst'!EM31)","v":""},{"$f":"IF($Z$5=\"x\", 'Rank Wkst'!FG31,'Rank Wkst'!EN31)","v":""},{"$f":"IF($Z$5=\"x\", 'Rank Wkst'!FG31,'Rank Wkst'!EO31)","v":""},{"$f":"IF($Z$5=\"x\", 'Rank Wkst'!FH31,'Rank Wkst'!EP31)","v":""},{"$f":"IF($Z$5=\"x\", 'Rank Wkst'!FI31,'Rank Wkst'!EQ31)","v":""},{"$f":"IF($Z$5=\"x\", 'Rank Wkst'!FJ31,'Rank Wkst'!ER31)","v":""},"/",{"$f":"IF($Z$5=\"x\", 'Rank Wkst'!FK31,'Rank Wkst'!ES31)","v":""},{"$f":"'Rank Wkst'!ET31","v":""},{"$f":"IF($Z$5=\"x\", 'Rank Wkst'!EV31, 'Rank Wkst'!EC31)","v":""},{"$f":"IF($Z$5=\"x\", 'Rank Wkst'!DI31, 'Rank Wkst'!ED31)","v":""},null,null,{"$f":"IF(E35=\"\",\" \",'Rank Wkst'!HI31)","v":" "}]
[]
[null,null,null,null,null,null,null,null,null,null,null,null,null,null,null,null,null,null,null,null,null,null,null,null,null,null,null,null,null,null,null,null,null,null,{"$f":"'Rank Wkst'!AH36","v":0},{"$f":"'Rank Wkst'!AI36","v":0}]
[null,null,null,null,null,null,null,null,null,null,null,null,null,null,null,null,null,null,null,null,null,null,null,null,null,null,null,null,null,null,null,null,null,null,{"$f":"'Rank Wkst'!AH37","v":0},{"$f":"'Rank Wkst'!AI37","v":0}]
[null,null,null,null,null,null,null,null,null,null,null,null,null,null,null,null,null,null,null,null,null,null,null,null,null,null,null,null,null,null,null,null,null,null,{"$f":"'Rank Wkst'!AH38","v":0},{"$f":"'Rank Wkst'!AI38","v":0}]
[null,null,null,null,null,null,null,null,null,null,null,null,null,null,null,null,null,null,null,null,null,null,null,null,null,null,null,null,null,null,null,null,null,null,{"$f":"'Rank Wkst'!AH39","v":0},{"$f":"'Rank Wkst'!AI39","v":0}]
[null,null,null,null,null,null,null,null,null,null,null,null,null,null,null,null,null,null,null,null,null,null,null,null,null,null,null,null,null,null,null,null,null,null,{"$f":"'Rank Wkst'!AH40","v":0},{"$f":"'Rank Wkst'!AI40","v":0}]

{"sheet":"Team1","index":5,"n_rows":25,"n_cols":15,"rows_kept":25,"cut":false,"hidden":false,"merged":[[22,3,22,4],[22,8,22,9],[23,3,23,4],[23,8,23,9],[24,3,24,4],[24,8,24,9],[20,1,20,2],[14,1,14,2],[9,1,9,2],[19,1,19,2],[17,1,17,2],[15,1,15,2],[15,0,16,0],[6,12,7,12],[6,13,7,14],[6,9,7,9],[6,10,7,11],[16,1,16,2],[10,1,10,2],[11,1,11,2],[12,1,12,2],[6,0,6,2],[7,0,7,2],[8,1,8,2],[13,1,13,2],[8,0,9,0],[10,0,11,0],[12,0,14,0],[0,0,0,14],[1,0,1,14],[3,8,3,9],[3,10,3,14],[4,8,4,9],[4,10,4,14],[4,2,4,7],[3,2,3,7]]}
["Minnesota State High School League Dance Team Competition"]
["High Kick Judges Recap Sheet"]
[]
[null,"School:",{"$f":"IF('Ranking Sheet'!B12=0, \"\", 'Ranking Sheet'!B12)","v":""},null,null,null,null,null,"Class:",null,{"$f":"IF(Class=0, \"\", Class)","v":""}]
[null,"Meet Site:",{"$f":"IF(Site=0, \"\", Site)","v":""},null,null,null,null,null,"Meet Date:",null,{"$f":"IF(DATE=0, \"\", DATE)","v":""}]
[]
["Judge's Initials → ",null,null,{"$f":"IF('Ranking Sheet'!D10=0, \"\", 'Ranking Sheet'!D10)","v":""},{"$f":"IF('Ranking Sheet'!F10=0, \"\", 'Ranking Sheet'!F10)","v":""},{"$f":"IF('Ranking Sheet'!H10=0, \"\", 'Ranking Sheet'!H10)","v":""},{"$f":"IF('Ranking Sheet'!J10=0, \"\", 'Ranking Sheet'!J10)","v":""},{"$f":"IF('Ranking Sheet'!L10=0, \"\", 'Ranking Sheet'!L10)","v":""},{"$f":"IF('Ranking Sheet'!N10=0, \"\", 'Ranking Sheet'!N10)","v":""},"Category Total Points","Total Points Possible",null,"Subtotal Points","Subtotal Points Possible"]
["Category",null,null,1,2,3,4,5,6]
["KICKS","Technique of Kicks",null,null,null,null,null,null,null,{"$f":"IF(D9=0, \"\", SUM(D9:I9))","v":""},"/",{"$f":"IF(D9=\"\", \"\", IF(I9=0, 50, 60))","v":""}]
[null,"Kick Height",null,null,null,null,null,null,null,"","/","",{"$f":"IF(D9=0, \"\", SUM(D9:I10))","v":""},"/",{"$f":"IF(D9=\"\", \"\", IF(I9=0, 100, 120))","v":""}]
["CHOREOGRAPHY","Creativity",null,null,null,null,null,null,null,"","/",""]
[null,"Visual Effectiveness",null,null,null,null,null,null,null,"","/","",{"$f":"IF(D11=0, \"\", SUM(D11:I12))","v":""},"/",{"$f":"IF(D11=\"\", \"\", IF(I11=0, 100, 120))","v":""}]
["DIFFICULTY","Diffuculty of Routine Choreography",null,null,null,null,null,null,null,"","/",""]
[null,"Difficulty of Formations and Transitions",null,null,null,null,null,null,null,"","/",""]
[null,"Difficulty of Kicks",null,null,null,null,null,null,null,"","/","",{"$f":"IF(D13=0, \"\", SUM(D13:I15))","v":""},"/",{"$f":"IF(D13=\"\", \"\", IF(I13=0,150, 180))","v":""}]
["EXECUTION","Placement & Control",null,null,null,null,null,null,null,"","/",""]
[null,"Degree of Accuracy",null,null,null,null,null,null,null,"","/","",{"$f":"IF(D16=0, \"\", SUM(D16:I17))","v":""},"/",{"$f":"IF(D16=\"\", \"\", IF(I16=0, 100, 120))","v":""}]
["R.E.","Routine Effectiveness",null,null,null,null,null,null,null,"","/","",{"$f":"IF(D18=0, \"\", SUM(D18:I18))","v":""},"/",{"$f":"IF(D18=\"\", \"\", IF(I18=0, 50, 60))","v":""}]
[null,"SUB TOTALS",null,{"$f":"D9+D10+D11+D12+D13+D14+D15+D16+D17+D18","v":0},0,0,0,0,0,{"$f":"IF(D9=0, \"\", SUM(D19:I19))","v":""},"/",{"$f":"IF(D9=\"\", \"\", SUM(L9:L18))","v":""},{"$f":"IF(D9=0, \"\", SUM(M9:M18))","v":""},"/",{"$f":"IF(D9=\"\", \"\", SUM(O9:O18))","v":""}]
[null,"DEDUCTIONS \nEnter as a negative number i.e. -3 or DQ",null,null,null,null,null,null,null,{"$f":"IF(D20=\"\", \"\", IF(D20=\"DQ\",\"DQ\",SUM(D20:I20)))","v":""},null,null,{"$f":"IF(D20=\"\", \"\", IF(D20=\"DQ\",\"DQ\",SUM(D20:I20)))","v":""}]
[null,"TOTALS",null,{"$f":"IF(D20=\"DQ\", \"DQ\",SUM(D19+D20))","v":0},0,0,0,0,0,{"$f":"IF(D9=0, \"\", IF(D20=\"DQ\",\"DQ\",SUM(D21:I21)))","v":""},"/",{"$f":"IF(D9=\"\", \"\", SUM(L9:L18))","v":""},{"$f":"IF(D9=0, \"\", IF(D20=\"DQ\",\"DQ\",SUM(M19:M20)))","v":""},"/",{"$f":"IF(D9=\"\", \"\", SUM(O9:O18))","v":""}]
[]
[null,"KC/T #1","Time:",null,null,null,"Kick Count:",null,null,null,null,null,"# Comp:"]
[null,"KC/T #2","Time:",null,null,null,"Kick Count:",null,null,null,null,null,"# Comp:"]
[null,"KC/T #3","Time:",null,null,null,"Kick Count:",null,null,null,null,null,"# Comp:"]

{"sheet":"Team2","index":6,"n_rows":25,"n_cols":15,"rows_kept":25,"cut":false,"hidden":false,"merged":[[22,3,22,4],[23,3,23,4],[22,8,22,9],[23,8,23,9],[24,8,24,9],[24,3,24,4],[0,0,0,14],[1,0,1,14],[3,2,3,7],[3,8,3,9],[3,10,3,14],[4,2,4,7],[4,8,4,9],[4,10,4,14],[6,0,6,2],[6,9,7,9],[6,10,7,11],[6,12,7,12],[6,13,7,14],[7,0,7,2],[8,0,9,0],[8,1,8,2],[9,1,9,2],[10,0,11,0],[10,1,10,2],[11,1,11,2],[17,1,17,2],[19,1,19,2],[20,1,20,2],[12,0,14,0],[12,1,12,2],[13,1,13,2],[14,1,14,2],[15,0,16,0],[15,1,15,2],[16,1,16,2]]}
["Minnesota State High School League Dance Team Competition"]
["High Kick Judges Recap Sheet"]
[]
[null,"School:",{"$f":"IF('Ranking Sheet'!B13=0, \"\", 'Ranking Sheet'!B13)","v":""},null,null,null,null,null,"Class:",null,{"$f":"IF(Class=0, \"\", Class)","v":""}]
[null,"Meet Site:",{"$f":"IF(Site=0, \"\", Site)","v":""},null,null,null,null,null,"Meet Date:",null,{"$f":"IF(DATE=0, \"\", DATE)","v":""}]
[]
["Judge's Initials → ",null,null,{"$f":"IF('Ranking Sheet'!D10=0, \"\", 'Ranking Sheet'!D10)","v":""},{"$f":"IF('Ranking Sheet'!F10=0, \"\", 'Ranking Sheet'!F10)","v":""},{"$f":"IF('Ranking Sheet'!H10=0, \"\", 'Ranking Sheet'!H10)","v":""},{"$f":"IF('Ranking Sheet'!J10=0, \"\", 'Ranking Sheet'!J10)","v":""},{"$f":"IF('Ranking Sheet'!L10=0, \"\", 'Ranking Sheet'!L10)","v":""},{"$f":"IF('Ranking Sheet'!N10=0, \"\", 'Ranking Sheet'!N10)","v":""},"Category Total Points","Total Points Possible",null,"Subtotal Points","Subtotal Points Possible"]
["Category",null,null,1,2,3,4,5,6]
["KICKS","Technique of Kicks",null,null,null,null,null,null,null,{"$f":"IF(D9=0, \"\", SUM(D9:I9))","v":""},"/",{"$f":"IF(D9=\"\", \"\", IF(I9=0, 50, 60))","v":""}]
[null,"Kick Height",null,null,null,null,null,null,null,"","/","",{"$f":"IF(D9=0, \"\", SUM(D9:I10))","v":""},"/",{"$f":"IF(D9=\"\", \"\", IF(I9=0, 100, 120))","v":""}]
["CHOREOGRAPHY","Creativity",null,null,null,null,null,null,null,"","/",""]
[null,"Visual Effectiveness",null,null,null,null,null,null,null,"","/","",{"$f":"IF(D11=0, \"\", SUM(D11:I12))","v":""},"/",{"$f":"IF(D11=\"\", \"\", IF(I11=0, 100, 120))","v":""}]
["DIFFICULTY","Diffuculty of Routine Choreography",null,null,null,null,null,null,null,"","/",""]
[null,"Difficulty of Formations and Transitions",null,null,null,null,null,null,null,"","/",""]
[null,"Difficulty of Kicks",null,null,null,null,null,null,null,"","/","",{"$f":"IF(D13=0, \"\", SUM(D13:I15))","v":""},"/",{"$f":"IF(D13=\"\", \"\", IF(I13=0,150, 180))","v":""}]
["EXECUTION","Placement & Control",null,null,null,null,null,null,null,"","/",""]
[null,"Degree of Accuracy",null,null,null,null,null,null,null,"","/","",{"$f":"IF(D16=0, \"\", SUM(D16:I17))","v":""},"/",{"$f":"IF(D16=\"\", \"\", IF(I16=0, 100, 120))","v":""}]
["R.E.","Routine Effectiveness",null,null,null,null,null,null,null,"","/","",{"$f":"IF(D18=0, \"\", SUM(D18:I18))","v":""},"/",{"$f":"IF(D18=\"\", \"\", IF(I18=0, 50, 60))","v":""}]
[null,"SUB TOTALS",null,{"$f":"D9+D10+D11+D12+D13+D14+D15+D16+D17+D18","v":0},0,0,0,0,0,{"$f":"IF(D9=0, \"\", SUM(D19:I19))","v":""},"/",{"$f":"IF(D9=\"\", \"\", SUM(L9:L18))","v":""},{"$f":"IF(D9=0, \"\", SUM(M9:M18))","v":""},"/",{"$f":"IF(D9=\"\", \"\", SUM(O9:O18))","v":""}]
[null,"DEDUCTIONS \nEnter as a negative number i.e. -3 or DQ",null,null,null,null,null,null,null,{"$f":"IF(D20=\"\", \"\", IF(D20=\"DQ\",\"DQ\",SUM(D20:I20)))","v":""},null,null,{"$f":"IF(D20=\"\", \"\", IF(D20=\"DQ\",\"DQ\",SUM(D20:I20)))","v":""}]
[null,"TOTALS",null,{"$f":"IF(D20=\"DQ\", \"DQ\",SUM(D19+D20))","v":0},0,0,0,0,0,{"$f":"IF(D9=0, \"\", IF(D20=\"DQ\",\"DQ\",SUM(D21:I21)))","v":""},"/",{"$f":"IF(D9=\"\", \"\", SUM(L9:L18))","v":""},{"$f":"IF(D9=0, \"\", IF(D20=\"DQ\",\"DQ\",SUM(M19:M20)))","v":""},"/",{"$f":"IF(D9=\"\", \"\", SUM(O9:O18))","v":""}]
[]
[null,"KC/T #1","Time:",null,null,null,"Kick Count:",null,null,null,null,null,"# Comp:"]
[null,"KC/T #2","Time:",null,null,null,"Kick Count:",null,null,null,null,null,"# Comp:"]
[null,"KC/T #3","Time:",null,null,null,"Kick Count:",null,null,null,null,null,"# Comp:"]

{"sheet":"Team3","index":7,"n_rows":25,"n_cols":15,"rows_kept":25,"cut":false,"hidden":false,"merged":[[19,1,19,2],[20,1,20,2],[13,1,13,2],[14,1,14,2],[15,0,16,0],[15,1,15,2],[16,1,16,2],[17,1,17,2],[6,0,6,2],[6,9,7,9],[6,10,7,11],[6,12,7,12],[6,13,7,14],[7,0,7,2],[0,0,0,14],[1,0,1,14],[3,2,3,7],[3,8,3,9],[3,10,3,14],[4,2,4,7],[4,8,4,9],[4,10,4,14],[10,0,11,0],[10,1,10,2],[11,1,11,2],[12,0,14,0],[8,0,9,0],[8,1,8,2],[9,1,9,2],[12,1,12,2],[22,3,22,4],[22,8,22,9],[23,3,23,4],[23,8,23,9],[24,3,24,4],[24,8,24,9]]}
["Minnesota State High School League Dance Team Competition"]
["High Kick Judges Recap Sheet"]
[]
[null,"School:",{"$f":"IF('Ranking Sheet'!B14=0, \"\", 'Ranking Sheet'!B14)","v":""},null,null,null,null,null,"Class:",null,{"$f":"IF(Class=0, \"\", Class)","v":""}]
[null,"Meet Site:",{"$f":"IF(Site=0, \"\", Site)","v":""},null,null,null,null,null,"Meet Date:",null,{"$f":"IF(DATE=0, \"\", DATE)","v":""}]
[]
["Judge's Initials → ",null,null,{"$f":"IF('Ranking Sheet'!D10=0, \"\", 'Ranking Sheet'!D10)","v":""},{"$f":"IF('Ranking Sheet'!F10=0, \"\", 'Ranking Sheet'!F10)","v":""},{"$f":"IF('Ranking Sheet'!H10=0, \"\", 'Ranking Sheet'!H10)","v":""},{"$f":"IF('Ranking Sheet'!J10=0, \"\", 'Ranking Sheet'!J10)","v":""},{"$f":"IF('Ranking Sheet'!L10=0, \"\", 'Ranking Sheet'!L10)","v":""},{"$f":"IF('Ranking Sheet'!N10=0, \"\", 'Ranking Sheet'!N10)","v":""},"Category Total Points","Total Points Possible",null,"Subtotal Points","Subtotal Points Possible"]
["Category",null,null,1,2,3,4,5,6]
["KICKS","Technique of Kicks",null,null,null,null,null,null,null,{"$f":"IF(D9=0, \"\", SUM(D9:I9))","v":""},"/",{"$f":"IF(D9=\"\", \"\", IF(I9=0, 50, 60))","v":""}]
[null,"Kick Height",null,null,null,null,null,null,null,"","/","",{"$f":"IF(D9=0, \"\", SUM(D9:I10))","v":""},"/",{"$f":"IF(D9=\"\", \"\", IF(I9=0, 100, 120))","v":""}]
["CHOREOGRAPHY","Creativity",null,null,null,null,null,null,null,"","/",""]
[null,"Visual Effectiveness",null,null,null,null,null,null,null,"","/","",{"$f":"IF(D11=0, \"\", SUM(D11:I12))","v":""},"/",{"$f":"IF(D11=\"\", \"\", IF(I11=0, 100, 120))","v":""}]
["DIFFICULTY","Diffuculty of Routine Choreography",null,null,null,null,null,null,null,"","/",""]
[null,"Difficulty of Formations and Transitions",null,null,null,null,null,null,null,"","/",""]
[null,"Difficulty of Kicks",null,null,null,null,null,null,null,"","/","",{"$f":"IF(D13=0, \"\", SUM(D13:I15))","v":""},"/",{"$f":"IF(D13=\"\", \"\", IF(I13=0,150, 180))","v":""}]
["EXECUTION","Placement & Control",null,null,null,null,null,null,null,"","/",""]
[null,"Degree of Accuracy",null,null,null,null,null,null,null,"","/","",{"$f":"IF(D16=0, \"\", SUM(D16:I17))","v":""},"/",{"$f":"IF(D16=\"\", \"\", IF(I16=0, 100, 120))","v":""}]
["R.E.","Routine Effectiveness",null,null,null,null,null,null,null,"","/","",{"$f":"IF(D18=0, \"\", SUM(D18:I18))","v":""},"/",{"$f":"IF(D18=\"\", \"\", IF(I18=0, 50, 60))","v":""}]
[null,"SUB TOTALS",null,{"$f":"D9+D10+D11+D12+D13+D14+D15+D16+D17+D18","v":0},0,0,0,0,0,{"$f":"IF(D9=0, \"\", SUM(D19:I19))","v":""},"/",{"$f":"IF(D9=\"\", \"\", SUM(L9:L18))","v":""},{"$f":"IF(D9=0, \"\", SUM(M9:M18))","v":""},"/",{"$f":"IF(D9=\"\", \"\", SUM(O9:O18))","v":""}]
[null,"DEDUCTIONS \nEnter as a negative number i.e. -3 or DQ",null,null,null,null,null,null,null,{"$f":"IF(D20=\"\", \"\", IF(D20=\"DQ\",\"DQ\",SUM(D20:I20)))","v":""},null,null,{"$f":"IF(D20=\"\", \"\", IF(D20=\"DQ\",\"DQ\",SUM(D20:I20)))","v":""}]
[null,"TOTALS",null,{"$f":"IF(D20=\"DQ\", \"DQ\",SUM(D19+D20))","v":0},0,0,0,0,0,{"$f":"IF(D9=0, \"\", IF(D20=\"DQ\",\"DQ\",SUM(D21:I21)))","v":""},"/",{"$f":"IF(D9=\"\", \"\", SUM(L9:L18))","v":""},{"$f":"IF(D9=0, \"\", IF(D20=\"DQ\",\"DQ\",SUM(M19:M20)))","v":""},"/",{"$f":"IF(D9=\"\", \"\", SUM(O9:O18))","v":""}]
[]
[null,"KC/T #1","Time:",null,null,null,"Kick Count:",null,null,null,null,null,"# Comp:"]
[null,"KC/T #2","Time:",null,null,null,"Kick Count:",null,null,null,null,null,"# Comp:"]
[null,"KC/T #3","Time:",null,null,null,"Kick Count:",null,null,null,null,null,"# Comp:"]

{"sheet":"Team4","index":8,"n_rows":25,"n_cols":15,"rows_kept":25,"cut":false,"hidden":false,"merged":[[19,1,19,2],[20,1,20,2],[13,1,13,2],[14,1,14,2],[15,0,16,0],[15,1,15,2],[16,1,16,2],[17,1,17,2],[6,0,6,2],[6,9,7,9],[6,10,7,11],[6,12,7,12],[6,13,7,14],[7,0,7,2],[0,0,0,14],[1,0,1,14],[3,2,3,7],[3,8,3,9],[3,10,3,14],[4,2,4,7],[4,8,4,9],[4,10,4,14],[10,0,11,0],[10,1,10,2],[11,1,11,2],[12,0,14,0],[8,0,9,0],[8,1,8,2],[9,1,9,2],[12,1,12,2],[22,3,22,4],[22,8,22,9],[23,3,23,4],[23,8,23,9],[24,3,24,4],[24,8,24,9]]}
["Minnesota State High School League Dance Team Competition"]
["High Kick Judges Recap Sheet"]
[]
[null,"School:",{"$f":"IF('Ranking Sheet'!B15=0, \"\", 'Ranking Sheet'!B15)","v":""},null,null,null,null,null,"Class:",null,{"$f":"IF(Class=0, \"\", Class)","v":""}]
[null,"Meet Site:",{"$f":"IF(Site=0, \"\", Site)","v":""},null,null,null,null,null,"Meet Date:",null,{"$f":"IF(DATE=0, \"\", DATE)","v":""}]
[]
["Judge's Initials → ",null,null,{"$f":"IF('Ranking Sheet'!D10=0, \"\", 'Ranking Sheet'!D10)","v":""},{"$f":"IF('Ranking Sheet'!F10=0, \"\", 'Ranking Sheet'!F10)","v":""},{"$f":"IF('Ranking Sheet'!H10=0, \"\", 'Ranking Sheet'!H10)","v":""},{"$f":"IF('Ranking Sheet'!J10=0, \"\", 'Ranking Sheet'!J10)","v":""},{"$f":"IF('Ranking Sheet'!L10=0, \"\", 'Ranking Sheet'!L10)","v":""},{"$f":"IF('Ranking Sheet'!N10=0, \"\", 'Ranking Sheet'!N10)","v":""},"Category Total Points","Total Points Possible",null,"Subtotal Points","Subtotal Points Possible"]
["Category",null,null,1,2,3,4,5,6]
["KICKS","Technique of Kicks",null,null,null,null,null,null,null,{"$f":"IF(D9=0, \"\", SUM(D9:I9))","v":""},"/",{"$f":"IF(D9=\"\", \"\", IF(I9=0, 50, 60))","v":""}]
[null,"Kick Height",null,null,null,null,null,null,null,"","/","",{"$f":"IF(D9=0, \"\", SUM(D9:I10))","v":""},"/",{"$f":"IF(D9=\"\", \"\", IF(I9=0, 100, 120))","v":""}]
["CHOREOGRAPHY","Creativity",null,null,null,null,null,null,null,"","/",""]
[null,"Visual Effectiveness",null,null,null,null,null,null,null,"","/","",{"$f":"IF(D11=0, \"\", SUM(D11:I12))","v":""},"/",{"$f":"IF(D11=\"\", \"\", IF(I11=0, 100, 120))","v":""}]
["DIFFICULTY","Diffuculty of Routine Choreography",null,null,null,null,null,null,null,"","/",""]
[null,"Difficulty of Formations and Transitions",null,null,null,null,null,null,null,"","/",""]
[null,"Difficulty of Kicks",null,null,null,null,null,null,null,"","/","",{"$f":"IF(D13=0, \"\", SUM(D13:I15))","v":""},"/",{"$f":"IF(D13=\"\", \"\", IF(I13=0,150, 180))","v":""}]
["EXECUTION","Placement & Control",null,null,null,null,null,null,null,"","/",""]
[null,"Degree of Accuracy",null,null,null,null,null,null,null,"","/","",{"$f":"IF(D16=0, \"\", SUM(D16:I17))","v":""},"/",{"$f":"IF(D16=\"\", \"\", IF(I16=0, 100, 120))","v":""}]
["R.E.","Routine Effectiveness",null,null,null,null,null,null,null,"","/","",{"$f":"IF(D18=0, \"\", SUM(D18:I18))","v":""},"/",{"$f":"IF(D18=\"\", \"\", IF(I18=0, 50, 60))","v":""}]
[null,"SUB TOTALS",null,{"$f":"D9+D10+D11+D12+D13+D14+D15+D16+D17+D18","v":0},0,0,0,0,0,{"$f":"IF(D9=0, \"\", SUM(D19:I19))","v":""},"/",{"$f":"IF(D9=\"\", \"\", SUM(L9:L18))","v":""},{"$f":"IF(D9=0, \"\", SUM(M9:M18))","v":""},"/",{"$f":"IF(D9=\"\", \"\", SUM(O9:O18))","v":""}]
[null,"DEDUCTIONS \nEnter as a negative number i.e. -3 or DQ",null,null,null,null,null,null,null,{"$f":"IF(D20=\"\", \"\", IF(D20=\"DQ\",\"DQ\",SUM(D20:I20)))","v":""},null,null,{"$f":"IF(D20=\"\", \"\", IF(D20=\"DQ\",\"DQ\",SUM(D20:I20)))","v":""}]
[null,"TOTALS",null,{"$f":"IF(D20=\"DQ\", \"DQ\",SUM(D19+D20))","v":0},0,0,0,0,0,{"$f":"IF(D9=0, \"\", IF(D20=\"DQ\",\"DQ\",SUM(D21:I21)))","v":""},"/",{"$f":"IF(D9=\"\", \"\", SUM(L9:L18))","v":""},{"$f":"IF(D9=0, \"\", IF(D20=\"DQ\",\"DQ\",SUM(M19:M20)))","v":""},"/",{"$f":"IF(D9=\"\", \"\", SUM(O9:O18))","v":""}]
[]
[null,"KC/T #1","Time:",null,null,null,"Kick Count:",null,null,null,null,null,"# Comp:"]
[null,"KC/T #2","Time:",null,null,null,"Kick Count:",null,null,null,null,null,"# Comp:"]
[null,"KC/T #3","Time:",null,null,null,"Kick Count:",null,null,null,null,null,"# Comp:"]

{"sheet":"Team5","index":9,"n_rows":25,"n_cols":15,"rows_kept":25,"cut":false,"hidden":false,"merged":[[19,1,19,2],[20,1,20,2],[13,1,13,2],[14,1,14,2],[15,0,16,0],[15,1,15,2],[16,1,16,2],[17,1,17,2],[6,0,6,2],[6,9,7,9],[6,10,7,11],[6,12,7,12],[6,13,7,14],[7,0,7,2],[0,0,0,14],[1,0,1,14],[3,2,3,7],[3,8,3,9],[3,10,3,14],[4,2,4,7],[4,8,4,9],[4,10,4,14],[10,0,11,0],[10,1,10,2],[11,1,11,2],[12,0,14,0],[8,0,9,0],[8,1,8,2],[9,1,9,2],[12,1,12,2],[22,3,22,4],[22,8,22,9],[23,3,23,4],[23,8,23,9],[24,3,24,4],[24,8,24,9]]}
["Minnesota State High School League Dance Team Competition"]
["High Kick Judges Recap Sheet"]
[]
[null,"School:",{"$f":"IF('Ranking Sheet'!B16=0, \"\", 'Ranking Sheet'!B16)","v":""},null,null,null,null,null,"Class:",null,{"$f":"IF(Class=0, \"\", Class)","v":""}]
[null,"Meet Site:",{"$f":"IF(Site=0, \"\", Site)","v":""},null,null,null,null,null,"Meet Date:",null,{"$f":"IF(DATE=0, \"\", DATE)","v":""}]
[]
["Judge's Initials → ",null,null,{"$f":"IF('Ranking Sheet'!D10=0, \"\", 'Ranking Sheet'!D10)","v":""},{"$f":"IF('Ranking Sheet'!F10=0, \"\", 'Ranking Sheet'!F10)","v":""},{"$f":"IF('Ranking Sheet'!H10=0, \"\", 'Ranking Sheet'!H10)","v":""},{"$f":"IF('Ranking Sheet'!J10=0, \"\", 'Ranking Sheet'!J10)","v":""},{"$f":"IF('Ranking Sheet'!L10=0, \"\", 'Ranking Sheet'!L10)","v":""},{"$f":"IF('Ranking Sheet'!N10=0, \"\", 'Ranking Sheet'!N10)","v":""},"Category Total Points","Total Points Possible",null,"Subtotal Points","Subtotal Points Possible"]
["Category",null,null,1,2,3,4,5,6]
["KICKS","Technique of Kicks",null,null,null,null,null,null,null,{"$f":"IF(D9=0, \"\", SUM(D9:I9))","v":""},"/",{"$f":"IF(D9=\"\", \"\", IF(I9=0, 50, 60))","v":""}]
[null,"Kick Height",null,null,null,null,null,null,null,"","/","",{"$f":"IF(D9=0, \"\", SUM(D9:I10))","v":""},"/",{"$f":"IF(D9=\"\", \"\", IF(I9=0, 100, 120))","v":""}]
["CHOREOGRAPHY","Creativity",null,null,null,null,null,null,null,"","/",""]
[null,"Visual Effectiveness",null,null,null,null,null,null,null,"","/","",{"$f":"IF(D11=0, \"\", SUM(D11:I12))","v":""},"/",{"$f":"IF(D11=\"\", \"\", IF(I11=0, 100, 120))","v":""}]
["DIFFICULTY","Diffuculty of Routine Choreography",null,null,null,null,null,null,null,"","/",""]
[null,"Difficulty of Formations and Transitions",null,null,null,null,null,null,null,"","/",""]
[null,"Difficulty of Kicks",null,null,null,null,null,null,null,"","/","",{"$f":"IF(D13=0, \"\", SUM(D13:I15))","v":""},"/",{"$f":"IF(D13=\"\", \"\", IF(I13=0,150, 180))","v":""}]
["EXECUTION","Placement & Control",null,null,null,null,null,null,null,"","/",""]
[null,"Degree of Accuracy",null,null,null,null,null,null,null,"","/","",{"$f":"IF(D16=0, \"\", SUM(D16:I17))","v":""},"/",{"$f":"IF(D16=\"\", \"\", IF(I16=0, 100, 120))","v":""}]
["R.E.","Routine Effectiveness",null,null,null,null,null,null,null,"","/","",{"$f":"IF(D18=0, \"\", SUM(D18:I18))","v":""},"/",{"$f":"IF(D18=\"\", \"\", IF(I18=0, 50, 60))","v":""}]
[null,"SUB TOTALS",null,{"$f":"D9+D10+D11+D12+D13+D14+D15+D16+D17+D18","v":0},0,0,0,0,0,{"$f":"IF(D9=0, \"\", SUM(D19:I19))","v":""},"/",{"$f":"IF(D9=\"\", \"\", SUM(L9:L18))","v":""},{"$f":"IF(D9=0, \"\", SUM(M9:M18))","v":""},"/",{"$f":"IF(D9=\"\", \"\", SUM(O9:O18))","v":""}]
[null,"DEDUCTIONS \nEnter as a negative number i.e. -3 or DQ",null,null,null,null,null,null,null,{"$f":"IF(D20=\"\", \"\", IF(D20=\"DQ\",\"DQ\",SUM(D20:I20)))","v":""},null,null,{"$f":"IF(D20=\"\", \"\", IF(D20=\"DQ\",\"DQ\",SUM(D20:I20)))","v":""}]
[null,"TOTALS",null,{"$f":"IF(D20=\"DQ\", \"DQ\",SUM(D19+D20))","v":0},0,0,0,0,0,{"$f":"IF(D9=0, \"\", IF(D20=\"DQ\",\"DQ\",SUM(D21:I21)))","v":""},"/",{"$f":"IF(D9=\"\", \"\", SUM(L9:L18))","v":""},{"$f":"IF(D9=0, \"\", IF(D20=\"DQ\",\"DQ\",SUM(M19:M20)))","v":""},"/",{"$f":"IF(D9=\"\", \"\", SUM(O9:O18))","v":""}]
[]
[null,"KC/T #1","Time:",null,null,null,"Kick Count:",null,null,null,null,null,"# Comp:"]
[null,"KC/T #2","Time:",null,null,null,"Kick Count:",null,null,null,null,null,"# Comp:"]
[null,"KC/T #3","Time:",null,null,null,"Kick Count:",null,null,null,null,null,"# Comp:"]

{"sheet":"Team6","index":10,"n_rows":25,"n_cols":15,"rows_kept":25,"cut":false,"hidden":false,"merged":[[19,1,19,2],[20,1,20,2],[13,1,13,2],[14,1,14,2],[15,0,16,0],[15,1,15,2],[16,1,16,2],[17,1,17,2],[6,0,6,2],[6,9,7,9],[6,10,7,11],[6,12,7,12],[6,13,7,14],[7,0,7,2],[0,0,0,14],[1,0,1,14],[3,2,3,7],[3,8,3,9],[3,10,3,14],[4,2,4,7],[4,8,4,9],[4,10,4,14],[10,0,11,0],[10,1,10,2],[11,1,11,2],[12,0,14,0],[8,0,9,0],[8,1,8,2],[9,1,9,2],[12,1,12,2],[24,3,24,4],[24,8,24,9],[22,3,22,4],[22,8,22,9],[23,3,23,4],[23,8,23,9]]}
["Minnesota State High School League Dance Team Competition"]
["High Kick Judges Recap Sheet"]
[]
[null,"School:",{"$f":"IF('Ranking Sheet'!B17=0, \"\", 'Ranking Sheet'!B17)","v":""},null,null,null,null,null,"Class:",null,{"$f":"IF(Class=0, \"\", Class)","v":""}]
[null,"Meet Site:",{"$f":"IF(Site=0, \"\", Site)","v":""},null,null,null,null,null,"Meet Date:",null,{"$f":"IF(DATE=0, \"\", DATE)","v":""}]
[]
["Judge's Initials → ",null,null,{"$f":"IF('Ranking Sheet'!D10=0, \"\", 'Ranking Sheet'!D10)","v":""},{"$f":"IF('Ranking Sheet'!F10=0, \"\", 'Ranking Sheet'!F10)","v":""},{"$f":"IF('Ranking Sheet'!H10=0, \"\", 'Ranking Sheet'!H10)","v":""},{"$f":"IF('Ranking Sheet'!J10=0, \"\", 'Ranking Sheet'!J10)","v":""},{"$f":"IF('Ranking Sheet'!L10=0, \"\", 'Ranking Sheet'!L10)","v":""},{"$f":"IF('Ranking Sheet'!N10=0, \"\", 'Ranking Sheet'!N10)","v":""},"Category Total Points","Total Points Possible",null,"Subtotal Points","Subtotal Points Possible"]
["Category",null,null,1,2,3,4,5,6]
["KICKS","Technique of Kicks",null,null,null,null,null,null,null,{"$f":"IF(D9=0, \"\", SUM(D9:I9))","v":""},"/",{"$f":"IF(D9=\"\", \"\", IF(I9=0, 50, 60))","v":""}]
[null,"Kick Height",null,null,null,null,null,null,null,"","/","",{"$f":"IF(D9=0, \"\", SUM(D9:I10))","v":""},"/",{"$f":"IF(D9=\"\", \"\", IF(I9=0, 100, 120))","v":""}]
["CHOREOGRAPHY","Creativity",null,null,null,null,null,null,null,"","/",""]
[null,"Visual Effectiveness",null,null,null,null,null,null,null,"","/","",{"$f":"IF(D11=0, \"\", SUM(D11:I12))","v":""},"/",{"$f":"IF(D11=\"\", \"\", IF(I11=0, 100, 120))","v":""}]
["DIFFICULTY","Diffuculty of Routine Choreography",null,null,null,null,null,null,null,"","/",""]
[null,"Difficulty of Formations and Transitions",null,null,null,null,null,null,null,"","/",""]
[null,"Difficulty of Kicks",null,null,null,null,null,null,null,"","/","",{"$f":"IF(D13=0, \"\", SUM(D13:I15))","v":""},"/",{"$f":"IF(D13=\"\", \"\", IF(I13=0,150, 180))","v":""}]
["EXECUTION","Placement & Control",null,null,null,null,null,null,null,"","/",""]
[null,"Degree of Accuracy",null,null,null,null,null,null,null,"","/","",{"$f":"IF(D16=0, \"\", SUM(D16:I17))","v":""},"/",{"$f":"IF(D16=\"\", \"\", IF(I16=0, 100, 120))","v":""}]
["R.E.","Routine Effectiveness",null,null,null,null,null,null,null,"","/","",{"$f":"IF(D18=0, \"\", SUM(D18:I18))","v":""},"/",{"$f":"IF(D18=\"\", \"\", IF(I18=0, 50, 60))","v":""}]
[null,"SUB TOTALS",null,{"$f":"D9+D10+D11+D12+D13+D14+D15+D16+D17+D18","v":0},0,0,0,0,0,{"$f":"IF(D9=0, \"\", SUM(D19:I19))","v":""},"/",{"$f":"IF(D9=\"\", \"\", SUM(L9:L18))","v":""},{"$f":"IF(D9=0, \"\", SUM(M9:M18))","v":""},"/",{"$f":"IF(D9=\"\", \"\", SUM(O9:O18))","v":""}]
[null,"DEDUCTIONS \nEnter as a negative number i.e. -3 or DQ",null,null,null,null,null,null,null,{"$f":"IF(D20=\"\", \"\", IF(D20=\"DQ\",\"DQ\",SUM(D20:I20)))","v":""},null,null,{"$f":"IF(D20=\"\", \"\", IF(D20=\"DQ\",\"DQ\",SUM(D20:I20)))","v":""}]
[null,"TOTALS",null,{"$f":"IF(D20=\"DQ\", \"DQ\",SUM(D19+D20))","v":0},0,0,0,0,0,{"$f":"IF(D9=0, \"\", IF(D20=\"DQ\",\"DQ\",SUM(D21:I21)))","v":""},"/",{"$f":"IF(D9=\"\", \"\", SUM(L9:L18))","v":""},{"$f":"IF(D9=0, \"\", IF(D20=\"DQ\",\"DQ\",SUM(M19:M20)))","v":""},"/",{"$f":"IF(D9=\"\", \"\", SUM(O9:O18))","v":""}]
[]
[null,"KC/T #1","Time:",null,null,null,"Kick Count:",null,null,null,null,null,"# Comp:"]
[null,"KC/T #2","Time:",null,null,null,"Kick Count:",null,null,null,null,null,"# Comp:"]
[null,"KC/T #3","Time:",null,null,null,"Kick Count:",null,null,null,null,null,"# Comp:"]

{"sheet":"Team7","index":11,"n_rows":25,"n_cols":15,"rows_kept":25,"cut":false,"hidden":false,"merged":[[19,1,19,2],[20,1,20,2],[13,1,13,2],[14,1,14,2],[15,0,16,0],[15,1,15,2],[16,1,16,2],[17,1,17,2],[6,0,6,2],[6,9,7,9],[6,10,7,11],[6,12,7,12],[6,13,7,14],[7,0,7,2],[0,0,0,14],[1,0,1,14],[3,2,3,7],[3,8,3,9],[3,10,3,14],[4,2,4,7],[4,8,4,9],[4,10,4,14],[10,0,11,0],[10,1,10,2],[11,1,11,2],[12,0,14,0],[8,0,9,0],[8,1,8,2],[9,1,9,2],[12,1,12,2],[22,3,22,4],[22,8,22,9],[23,3,23,4],[23,8,23,9],[24,3,24,4],[24,8,24,9]]}
["Minnesota State High School League Dance Team Competition"]
["High Kick Judges Recap Sheet"]
[]
[null,"School:",{"$f":"IF('Ranking Sheet'!B18=0, \"\", 'Ranking Sheet'!B18)","v":""},null,null,null,null,null,"Class:",null,{"$f":"IF(Class=0, \"\", Class)","v":""}]
[null,"Meet Site:",{"$f":"IF(Site=0, \"\", Site)","v":""},null,null,null,null,null,"Meet Date:",null,{"$f":"IF(DATE=0, \"\", DATE)","v":""}]
[]
["Judge's Initials → ",null,null,{"$f":"IF('Ranking Sheet'!D10=0, \"\", 'Ranking Sheet'!D10)","v":""},{"$f":"IF('Ranking Sheet'!F10=0, \"\", 'Ranking Sheet'!F10)","v":""},{"$f":"IF('Ranking Sheet'!H10=0, \"\", 'Ranking Sheet'!H10)","v":""},{"$f":"IF('Ranking Sheet'!J10=0, \"\", 'Ranking Sheet'!J10)","v":""},{"$f":"IF('Ranking Sheet'!L10=0, \"\", 'Ranking Sheet'!L10)","v":""},{"$f":"IF('Ranking Sheet'!N10=0, \"\", 'Ranking Sheet'!N10)","v":""},"Category Total Points","Total Points Possible",null,"Subtotal Points","Subtotal Points Possible"]
["Category",null,null,1,2,3,4,5,6]
["KICKS","Technique of Kicks",null,null,null,null,null,null,null,{"$f":"IF(D9=0, \"\", SUM(D9:I9))","v":""},"/",{"$f":"IF(D9=\"\", \"\", IF(I9=0, 50, 60))","v":""}]
[null,"Kick Height",null,null,null,null,null,null,null,"","/","",{"$f":"IF(D9=0, \"\", SUM(D9:I10))","v":""},"/",{"$f":"IF(D9=\"\", \"\", IF(I9=0, 100, 120))","v":""}]
["CHOREOGRAPHY","Creativity",null,null,null,null,null,null,null,"","/",""]
[null,"Visual Effectiveness",null,null,null,null,null,null,null,"","/","",{"$f":"IF(D11=0, \"\", SUM(D11:I12))","v":""},"/",{"$f":"IF(D11=\"\", \"\", IF(I11=0, 100, 120))","v":""}]
["DIFFICULTY","Diffuculty of Routine Choreography",null,null,null,null,null,null,null,"","/",""]
[null,"Difficulty of Formations and Transitions",null,null,null,null,null,null,null,"","/",""]
[null,"Difficulty of Kicks",null,null,null,null,null,null,null,"","/","",{"$f":"IF(D13=0, \"\", SUM(D13:I15))","v":""},"/",{"$f":"IF(D13=\"\", \"\", IF(I13=0,150, 180))","v":""}]
["EXECUTION","Placement & Control",null,null,null,null,null,null,null,"","/",""]
[null,"Degree of Accuracy",null,null,null,null,null,null,null,"","/","",{"$f":"IF(D16=0, \"\", SUM(D16:I17))","v":""},"/",{"$f":"IF(D16=\"\", \"\", IF(I16=0, 100, 120))","v":""}]
["R.E.","Routine Effectiveness",null,null,null,null,null,null,null,"","/","",{"$f":"IF(D18=0, \"\", SUM(D18:I18))","v":""},"/",{"$f":"IF(D18=\"\", \"\", IF(I18=0, 50, 60))","v":""}]
[null,"SUB TOTALS",null,{"$f":"D9+D10+D11+D12+D13+D14+D15+D16+D17+D18","v":0},0,0,0,0,0,{"$f":"IF(D9=0, \"\", SUM(D19:I19))","v":""},"/",{"$f":"IF(D9=\"\", \"\", SUM(L9:L18))","v":""},{"$f":"IF(D9=0, \"\", SUM(M9:M18))","v":""},"/",{"$f":"IF(D9=\"\", \"\", SUM(O9:O18))","v":""}]
[null,"DEDUCTIONS \nEnter as a negative number i.e. -3 or DQ",null,null,null,null,null,null,null,{"$f":"IF(D20=\"\", \"\", IF(D20=\"DQ\",\"DQ\",SUM(D20:I20)))","v":""},null,null,{"$f":"IF(D20=\"\", \"\", IF(D20=\"DQ\",\"DQ\",SUM(D20:I20)))","v":""}]
[null,"TOTALS",null,{"$f":"IF(D20=\"DQ\", \"DQ\",SUM(D19+D20))","v":0},0,0,0,0,0,{"$f":"IF(D9=0, \"\", IF(D20=\"DQ\",\"DQ\",SUM(D21:I21)))","v":""},"/",{"$f":"IF(D9=\"\", \"\", SUM(L9:L18))","v":""},{"$f":"IF(D9=0, \"\", IF(D20=\"DQ\",\"DQ\",SUM(M19:M20)))","v":""},"/",{"$f":"IF(D9=\"\", \"\", SUM(O9:O18))","v":""}]
[]
[null,"KC/T #1","Time:",null,null,null,"Kick Count:",null,null,null,null,null,"# Comp:"]
[null,"KC/T #2","Time:",null,null,null,"Kick Count:",null,null,null,null,null,"# Comp:"]
[null,"KC/T #3","Time:",null,null,null,"Kick Count:",null,null,null,null,null,"# Comp:"]

{"sheet":"Team8","index":12,"n_rows":25,"n_cols":15,"rows_kept":25,"cut":false,"hidden":false,"merged":[[19,1,19,2],[20,1,20,2],[13,1,13,2],[14,1,14,2],[15,0,16,0],[15,1,15,2],[16,1,16,2],[17,1,17,2],[6,0,6,2],[6,9,7,9],[6,10,7,11],[6,12,7,12],[6,13,7,14],[7,0,7,2],[0,0,0,14],[1,0,1,14],[3,2,3,7],[3,8,3,9],[3,10,3,14],[4,2,4,7],[4,8,4,9],[4,10,4,14],[10,0,11,0],[10,1,10,2],[11,1,11,2],[12,0,14,0],[8,0,9,0],[8,1,8,2],[9,1,9,2],[12,1,12,2],[22,3,22,4],[22,8,22,9],[23,3,23,4],[23,8,23,9],[24,3,24,4],[24,8,24,9]]}
["Minnesota State High School League Dance Team Competition"]
["High Kick Judges Recap Sheet"]
[]
[null,"School:",{"$f":"IF('Ranking Sheet'!B19=0, \"\", 'Ranking Sheet'!B19)","v":""},null,null,null,null,null,"Class:",null,{"$f":"IF(Class=0, \"\", Class)","v":""}]
[null,"Meet Site:",{"$f":"IF(Site=0, \"\", Site)","v":""},null,null,null,null,null,"Meet Date:",null,{"$f":"IF(DATE=0, \"\", DATE)","v":""}]
[]
["Judge's Initials → ",null,null,{"$f":"IF('Ranking Sheet'!D10=0, \"\", 'Ranking Sheet'!D10)","v":""},{"$f":"IF('Ranking Sheet'!F10=0, \"\", 'Ranking Sheet'!F10)","v":""},{"$f":"IF('Ranking Sheet'!H10=0, \"\", 'Ranking Sheet'!H10)","v":""},{"$f":"IF('Ranking Sheet'!J10=0, \"\", 'Ranking Sheet'!J10)","v":""},{"$f":"IF('Ranking Sheet'!L10=0, \"\", 'Ranking Sheet'!L10)","v":""},{"$f":"IF('Ranking Sheet'!N10=0, \"\", 'Ranking Sheet'!N10)","v":""},"Category Total Points","Total Points Possible",null,"Subtotal Points","Subtotal Points Possible"]
["Category",null,null,1,2,3,4,5,6]
["KICKS","Technique of Kicks",null,null,null,null,null,null,null,{"$f":"IF(D9=0, \"\", SUM(D9:I9))","v":""},"/",{"$f":"IF(D9=\"\", \"\", IF(I9=0, 50, 60))","v":""}]
[null,"Kick Height",null,null,null,null,null,null,null,"","/","",{"$f":"IF(D9=0, \"\", SUM(D9:I10))","v":""},"/",{"$f":"IF(D9=\"\", \"\", IF(I9=0, 100, 120))","v":""}]
["CHOREOGRAPHY","Creativity",null,null,null,null,null,null,null,"","/",""]
[null,"Visual Effectiveness",null,null,null,null,null,null,null,"","/","",{"$f":"IF(D11=0, \"\", SUM(D11:I12))","v":""},"/",{"$f":"IF(D11=\"\", \"\", IF(I11=0, 100, 120))","v":""}]
["DIFFICULTY","Diffuculty of Routine Choreography",null,null,null,null,null,null,null,"","/",""]
[null,"Difficulty of Formations and Transitions",null,null,null,null,null,null,null,"","/",""]
[null,"Difficulty of Kicks",null,null,null,null,null,null,null,"","/","",{"$f":"IF(D13=0, \"\", SUM(D13:I15))","v":""},"/",{"$f":"IF(D13=\"\", \"\", IF(I13=0,150, 180))","v":""}]
["EXECUTION","Placement & Control",null,null,null,null,null,null,null,"","/",""]
[null,"Degree of Accuracy",null,null,null,null,null,null,null,"","/","",{"$f":"IF(D16=0, \"\", SUM(D16:I17))","v":""},"/",{"$f":"IF(D16=\"\", \"\", IF(I16=0, 100, 120))","v":""}]
["R.E.","Routine Effectiveness",null,null,null,null,null,null,null,"","/","",{"$f":"IF(D18=0, \"\", SUM(D18:I18))","v":""},"/",{"$f":"IF(D18=\"\", \"\", IF(I18=0, 50, 60))","v":""}]
[null,"SUB TOTALS",null,{"$f":"D9+D10+D11+D12+D13+D14+D15+D16+D17+D18","v":0},0,0,0,0,0,{"$f":"IF(D9=0, \"\", SUM(D19:I19))","v":""},"/",{"$f":"IF(D9=\"\", \"\", SUM(L9:L18))","v":""},{"$f":"IF(D9=0, \"\", SUM(M9:M18))","v":""},"/",{"$f":"IF(D9=\"\", \"\", SUM(O9:O18))","v":""}]
[null,"DEDUCTIONS \nEnter as a negative number i.e. -3 or DQ",null,null,null,null,null,null,null,{"$f":"IF(D20=\"\", \"\", IF(D20=\"DQ\",\"DQ\",SUM(D20:I20)))","v":""},null,null,{"$f":"IF(D20=\"\", \"\", IF(D20=\"DQ\",\"DQ\",SUM(D20:I20)))","v":""}]
[null,"TOTALS",null,{"$f":"IF(D20=\"DQ\", \"DQ\",SUM(D19+D20))","v":0},0,0,0,0,0,{"$f":"IF(D9=0, \"\", IF(D20=\"DQ\",\"DQ\",SUM(D21:I21)))","v":""},"/",{"$f":"IF(D9=\"\", \"\", SUM(L9:L18))","v":""},{"$f":"IF(D9=0, \"\", IF(D20=\"DQ\",\"DQ\",SUM(M19:M20)))","v":""},"/",{"$f":"IF(D9=\"\", \"\", SUM(O9:O18))","v":""}]
[]
[null,"KC/T #1","Time:",null,null,null,"Kick Count:",null,null,null,null,null,"# Comp:"]
[null,"KC/T #2","Time:",null,null,null,"Kick Count:",null,null,null,null,null,"# Comp:"]
[null,"KC/T #3","Time:",null,null,null,"Kick Count:",null,null,null,null,null,"# Comp:"]

{"sheet":"Team9","index":13,"n_rows":25,"n_cols":15,"rows_kept":25,"cut":false,"hidden":false,"merged":[[19,1,19,2],[20,1,20,2],[13,1,13,2],[14,1,14,2],[15,0,16,0],[15,1,15,2],[16,1,16,2],[17,1,17,2],[6,0,6,2],[6,9,7,9],[6,10,7,11],[6,12,7,12],[6,13,7,14],[7,0,7,2],[0,0,0,14],[1,0,1,14],[3,2,3,7],[3,8,3,9],[3,10,3,14],[4,2,4,7],[4,8,4,9],[4,10,4,14],[10,0,11,0],[10,1,10,2],[11,1,11,2],[12,0,14,0],[8,0,9,0],[8,1,8,2],[9,1,9,2],[12,1,12,2],[22,3,22,4],[22,8,22,9],[23,3,23,4],[23,8,23,9],[24,3,24,4],[24,8,24,9]]}
["Minnesota State High School League Dance Team Competition"]
["High Kick Judges Recap Sheet"]
[]
[null,"School:",{"$f":"IF('Ranking Sheet'!B20=0, \"\", 'Ranking Sheet'!B20)","v":""},null,null,null,null,null,"Class:",null,{"$f":"IF(Class=0, \"\", Class)","v":""}]
[null,"Meet Site:",{"$f":"IF(Site=0, \"\", Site)","v":""},null,null,null,null,null,"Meet Date:",null,{"$f":"IF(DATE=0, \"\", DATE)","v":""}]
[]
["Judge's Initials → ",null,null,{"$f":"IF('Ranking Sheet'!D10=0, \"\", 'Ranking Sheet'!D10)","v":""},{"$f":"IF('Ranking Sheet'!F10=0, \"\", 'Ranking Sheet'!F10)","v":""},{"$f":"IF('Ranking Sheet'!H10=0, \"\", 'Ranking Sheet'!H10)","v":""},{"$f":"IF('Ranking Sheet'!J10=0, \"\", 'Ranking Sheet'!J10)","v":""},{"$f":"IF('Ranking Sheet'!L10=0, \"\", 'Ranking Sheet'!L10)","v":""},{"$f":"IF('Ranking Sheet'!N10=0, \"\", 'Ranking Sheet'!N10)","v":""},"Category Total Points","Total Points Possible",null,"Subtotal Points","Subtotal Points Possible"]
["Category",null,null,1,2,3,4,5,6]
["KICKS","Technique of Kicks",null,null,null,null,null,null,null,{"$f":"IF(D9=0, \"\", SUM(D9:I9))","v":""},"/",{"$f":"IF(D9=\"\", \"\", IF(I9=0, 50, 60))","v":""}]
[null,"Kick Height",null,null,null,null,null,null,null,"","/","",{"$f":"IF(D9=0, \"\", SUM(D9:I10))","v":""},"/",{"$f":"IF(D9=\"\", \"\", IF(I9=0, 100, 120))","v":""}]
["CHOREOGRAPHY","Creativity",null,null,null,null,null,null,null,"","/",""]
[null,"Visual Effectiveness",null,null,null,null,null,null,null,"","/","",{"$f":"IF(D11=0, \"\", SUM(D11:I12))","v":""},"/",{"$f":"IF(D11=\"\", \"\", IF(I11=0, 100, 120))","v":""}]
["DIFFICULTY","Diffuculty of Routine Choreography",null,null,null,null,null,null,null,"","/",""]
[null,"Difficulty of Formations and Transitions",null,null,null,null,null,null,null,"","/",""]
[null,"Difficulty of Kicks",null,null,null,null,null,null,null,"","/","",{"$f":"IF(D13=0, \"\", SUM(D13:I15))","v":""},"/",{"$f":"IF(D13=\"\", \"\", IF(I13=0,150, 180))","v":""}]
["EXECUTION","Placement & Control",null,null,null,null,null,null,null,"","/",""]
[null,"Degree of Accuracy",null,null,null,null,null,null,null,"","/","",{"$f":"IF(D16=0, \"\", SUM(D16:I17))","v":""},"/",{"$f":"IF(D16=\"\", \"\", IF(I16=0, 100, 120))","v":""}]
["R.E.","Routine Effectiveness",null,null,null,null,null,null,null,"","/","",{"$f":"IF(D18=0, \"\", SUM(D18:I18))","v":""},"/",{"$f":"IF(D18=\"\", \"\", IF(I18=0, 50, 60))","v":""}]
[null,"SUB TOTALS",null,{"$f":"D9+D10+D11+D12+D13+D14+D15+D16+D17+D18","v":0},0,0,0,0,0,{"$f":"IF(D9=0, \"\", SUM(D19:I19))","v":""},"/",{"$f":"IF(D9=\"\", \"\", SUM(L9:L18))","v":""},{"$f":"IF(D9=0, \"\", SUM(M9:M18))","v":""},"/",{"$f":"IF(D9=\"\", \"\", SUM(O9:O18))","v":""}]
[null,"DEDUCTIONS \nEnter as a negative number i.e. -3 or DQ",null,null,null,null,null,null,null,{"$f":"IF(D20=\"\", \"\", IF(D20=\"DQ\",\"DQ\",SUM(D20:I20)))","v":""},null,null,{"$f":"IF(D20=\"\", \"\", IF(D20=\"DQ\",\"DQ\",SUM(D20:I20)))","v":""}]
[null,"TOTALS",null,{"$f":"IF(D20=\"DQ\", \"DQ\",SUM(D19+D20))","v":0},0,0,0,0,0,{"$f":"IF(D9=0, \"\", IF(D20=\"DQ\",\"DQ\",SUM(D21:I21)))","v":""},"/",{"$f":"IF(D9=\"\", \"\", SUM(L9:L18))","v":""},{"$f":"IF(D9=0, \"\", IF(D20=\"DQ\",\"DQ\",SUM(M19:M20)))","v":""},"/",{"$f":"IF(D9=\"\", \"\", SUM(O9:O18))","v":""}]
[]
[null,"KC/T #1","Time:",null,null,null,"Kick Count:",null,null,null,null,null,"# Comp:"]
[null,"KC/T #2","Time:",null,null,null,"Kick Count:",null,null,null,null,null,"# Comp:"]
[null,"KC/T #3","Time:",null,null,null,"Kick Count:",null,null,null,null,null,"# Comp:"]

{"sheet":"Team10","index":14,"n_rows":25,"n_cols":15,"rows_kept":25,"cut":false,"hidden":false,"merged":[[19,1,19,2],[20,1,20,2],[13,1,13,2],[14,1,14,2],[15,0,16,0],[15,1,15,2],[16,1,16,2],[17,1,17,2],[6,0,6,2],[6,9,7,9],[6,10,7,11],[6,12,7,12],[6,13,7,14],[7,0,7,2],[0,0,0,14],[1,0,1,14],[3,2,3,7],[3,8,3,9],[3,10,3,14],[4,2,4,7],[4,8,4,9],[4,10,4,14],[10,0,11,0],[10,1,10,2],[11,1,11,2],[12,0,14,0],[8,0,9,0],[8,1,8,2],[9,1,9,2],[12,1,12,2],[22,3,22,4],[22,8,22,9],[23,3,23,4],[23,8,23,9],[24,3,24,4],[24,8,24,9]]}
["Minnesota State High School League Dance Team Competition"]
["High Kick Judges Recap Sheet"]
[]
[null,"School:",{"$f":"IF('Ranking Sheet'!B21=0, \"\", 'Ranking Sheet'!B21)","v":""},null,null,null,null,null,"Class:",null,{"$f":"IF(Class=0, \"\", Class)","v":""}]
[null,"Meet Site:",{"$f":"IF(Site=0, \"\", Site)","v":""},null,null,null,null,null,"Meet Date:",null,{"$f":"IF(DATE=0, \"\", DATE)","v":""}]
[]
["Judge's Initials → ",null,null,{"$f":"IF('Ranking Sheet'!D10=0, \"\", 'Ranking Sheet'!D10)","v":""},{"$f":"IF('Ranking Sheet'!F10=0, \"\", 'Ranking Sheet'!F10)","v":""},{"$f":"IF('Ranking Sheet'!H10=0, \"\", 'Ranking Sheet'!H10)","v":""},{"$f":"IF('Ranking Sheet'!J10=0, \"\", 'Ranking Sheet'!J10)","v":""},{"$f":"IF('Ranking Sheet'!L10=0, \"\", 'Ranking Sheet'!L10)","v":""},{"$f":"IF('Ranking Sheet'!N10=0, \"\", 'Ranking Sheet'!N10)","v":""},"Category Total Points","Total Points Possible",null,"Subtotal Points","Subtotal Points Possible"]
["Category",null,null,1,2,3,4,5,6]
["KICKS","Technique of Kicks",null,null,null,null,null,null,null,{"$f":"IF(D9=0, \"\", SUM(D9:I9))","v":""},"/",{"$f":"IF(D9=\"\", \"\", IF(I9=0, 50, 60))","v":""}]
[null,"Kick Height",null,null,null,null,null,null,null,"","/","",{"$f":"IF(D9=0, \"\", SUM(D9:I10))","v":""},"/",{"$f":"IF(D9=\"\", \"\", IF(I9=0, 100, 120))","v":""}]
["CHOREOGRAPHY","Creativity",null,null,null,null,null,null,null,"","/",""]
[null,"Visual Effectiveness",null,null,null,null,null,null,null,"","/","",{"$f":"IF(D11=0, \"\", SUM(D11:I12))","v":""},"/",{"$f":"IF(D11=\"\", \"\", IF(I11=0, 100, 120))","v":""}]
["DIFFICULTY","Diffuculty of Routine Choreography",null,null,null,null,null,null,null,"","/",""]
[null,"Difficulty of Formations and Transitions",null,null,null,null,null,null,null,"","/",""]
[null,"Difficulty of Kicks",null,null,null,null,null,null,null,"","/","",{"$f":"IF(D13=0, \"\", SUM(D13:I15))","v":""},"/",{"$f":"IF(D13=\"\", \"\", IF(I13=0,150, 180))","v":""}]
["EXECUTION","Placement & Control",null,null,null,null,null,null,null,"","/",""]
[null,"Degree of Accuracy",null,null,null,null,null,null,null,"","/","",{"$f":"IF(D16=0, \"\", SUM(D16:I17))","v":""},"/",{"$f":"IF(D16=\"\", \"\", IF(I16=0, 100, 120))","v":""}]
["R.E.","Routine Effectiveness",null,null,null,null,null,null,null,"","/","",{"$f":"IF(D18=0, \"\", SUM(D18:I18))","v":""},"/",{"$f":"IF(D18=\"\", \"\", IF(I18=0, 50, 60))","v":""}]
[null,"SUB TOTALS",null,{"$f":"D9+D10+D11+D12+D13+D14+D15+D16+D17+D18","v":0},0,0,0,0,0,{"$f":"IF(D9=0, \"\", SUM(D19:I19))","v":""},"/",{"$f":"IF(D9=\"\", \"\", SUM(L9:L18))","v":""},{"$f":"IF(D9=0, \"\", SUM(M9:M18))","v":""},"/",{"$f":"IF(D9=\"\", \"\", SUM(O9:O18))","v":""}]
[null,"DEDUCTIONS \nEnter as a negative number i.e. -3 or DQ",null,null,null,null,null,null,null,{"$f":"IF(D20=\"\", \"\", IF(D20=\"DQ\",\"DQ\",SUM(D20:I20)))","v":""},null,null,{"$f":"IF(D20=\"\", \"\", IF(D20=\"DQ\",\"DQ\",SUM(D20:I20)))","v":""}]
[null,"TOTALS",null,{"$f":"IF(D20=\"DQ\", \"DQ\",SUM(D19+D20))","v":0},0,0,0,0,0,{"$f":"IF(D9=0, \"\", IF(D20=\"DQ\",\"DQ\",SUM(D21:I21)))","v":""},"/",{"$f":"IF(D9=\"\", \"\", SUM(L9:L18))","v":""},{"$f":"IF(D9=0, \"\", IF(D20=\"DQ\",\"DQ\",SUM(M19:M20)))","v":""},"/",{"$f":"IF(D9=\"\", \"\", SUM(O9:O18))","v":""}]
[]
[null,"KC/T #1","Time:",null,null,null,"Kick Count:",null,null,null,null,null,"# Comp:"]
[null,"KC/T #2","Time:",null,null,null,"Kick Count:",null,null,null,null,null,"# Comp:"]
[null,"KC/T #3","Time:",null,null,null,"Kick Count:",null,null,null,null,null,"# Comp:"]

{"sheet":"Team11","index":15,"n_rows":25,"n_cols":15,"rows_kept":25,"cut":false,"hidden":false,"merged":[[19,1,19,2],[20,1,20,2],[13,1,13,2],[14,1,14,2],[15,0,16,0],[15,1,15,2],[16,1,16,2],[17,1,17,2],[6,0,6,2],[6,9,7,9],[6,10,7,11],[6,12,7,12],[6,13,7,14],[7,0,7,2],[0,0,0,14],[1,0,1,14],[3,2,3,7],[3,8,3,9],[3,10,3,14],[4,2,4,7],[4,8,4,9],[4,10,4,14],[10,0,11,0],[10,1,10,2],[11,1,11,2],[12,0,14,0],[8,0,9,0],[8,1,8,2],[9,1,9,2],[12,1,12,2],[22,3,22,4],[22,8,22,9],[23,3,23,4],[23,8,23,9],[24,3,24,4],[24,8,24,9]]}
["Minnesota State High School League Dance Team Competition"]
["High Kick Judges Recap Sheet"]
[]
[null,"School:",{"$f":"IF('Ranking Sheet'!B22=0, \"\", 'Ranking Sheet'!B22)","v":""},null,null,null,null,null,"Class:",null,{"$f":"IF(Class=0, \"\", Class)","v":""}]
[null,"Meet Site:",{"$f":"IF(Site=0, \"\", Site)","v":""},null,null,null,null,null,"Meet Date:",null,{"$f":"IF(DATE=0, \"\", DATE)","v":""}]
[]
["Judge's Initials → ",null,null,{"$f":"IF('Ranking Sheet'!D10=0, \"\", 'Ranking Sheet'!D10)","v":""},{"$f":"IF('Ranking Sheet'!F10=0, \"\", 'Ranking Sheet'!F10)","v":""},{"$f":"IF('Ranking Sheet'!H10=0, \"\", 'Ranking Sheet'!H10)","v":""},{"$f":"IF('Ranking Sheet'!J10=0, \"\", 'Ranking Sheet'!J10)","v":""},{"$f":"IF('Ranking Sheet'!L10=0, \"\", 'Ranking Sheet'!L10)","v":""},{"$f":"IF('Ranking Sheet'!N10=0, \"\", 'Ranking Sheet'!N10)","v":""},"Category Total Points","Total Points Possible",null,"Subtotal Points","Subtotal Points Possible"]
["Category",null,null,1,2,3,4,5,6]
["KICKS","Technique of Kicks",null,null,null,null,null,null,null,{"$f":"IF(D9=0, \"\", SUM(D9:I9))","v":""},"/",{"$f":"IF(D9=\"\", \"\", IF(I9=0, 50, 60))","v":""}]
[null,"Kick Height",null,null,null,null,null,null,null,"","/","",{"$f":"IF(D9=0, \"\", SUM(D9:I10))","v":""},"/",{"$f":"IF(D9=\"\", \"\", IF(I9=0, 100, 120))","v":""}]
["CHOREOGRAPHY","Creativity",null,null,null,null,null,null,null,"","/",""]
[null,"Visual Effectiveness",null,null,null,null,null,null,null,"","/","",{"$f":"IF(D11=0, \"\", SUM(D11:I12))","v":""},"/",{"$f":"IF(D11=\"\", \"\", IF(I11=0, 100, 120))","v":""}]
["DIFFICULTY","Diffuculty of Routine Choreography",null,null,null,null,null,null,null,"","/",""]
[null,"Difficulty of Formations and Transitions",null,null,null,null,null,null,null,"","/",""]
[null,"Difficulty of Kicks",null,null,null,null,null,null,null,"","/","",{"$f":"IF(D13=0, \"\", SUM(D13:I15))","v":""},"/",{"$f":"IF(D13=\"\", \"\", IF(I13=0,150, 180))","v":""}]
["EXECUTION","Placement & Control",null,null,null,null,null,null,null,"","/",""]
[null,"Degree of Accuracy",null,null,null,null,null,null,null,"","/","",{"$f":"IF(D16=0, \"\", SUM(D16:I17))","v":""},"/",{"$f":"IF(D16=\"\", \"\", IF(I16=0, 100, 120))","v":""}]
["R.E.","Routine Effectiveness",null,null,null,null,null,null,null,"","/","",{"$f":"IF(D18=0, \"\", SUM(D18:I18))","v":""},"/",{"$f":"IF(D18=\"\", \"\", IF(I18=0, 50, 60))","v":""}]
[null,"SUB TOTALS",null,{"$f":"D9+D10+D11+D12+D13+D14+D15+D16+D17+D18","v":0},0,0,0,0,0,{"$f":"IF(D9=0, \"\", SUM(D19:I19))","v":""},"/",{"$f":"IF(D9=\"\", \"\", SUM(L9:L18))","v":""},{"$f":"IF(D9=0, \"\", SUM(M9:M18))","v":""},"/",{"$f":"IF(D9=\"\", \"\", SUM(O9:O18))","v":""}]
[null,"DEDUCTIONS \nEnter as a negative number i.e. -3 or DQ",null,null,null,null,null,null,null,{"$f":"IF(D20=\"\", \"\", IF(D20=\"DQ\",\"DQ\",SUM(D20:I20)))","v":""},null,null,{"$f":"IF(D20=\"\", \"\", IF(D20=\"DQ\",\"DQ\",SUM(D20:I20)))","v":""}]
[null,"TOTALS",null,{"$f":"IF(D20=\"DQ\", \"DQ\",SUM(D19+D20))","v":0},0,0,0,0,0,{"$f":"IF(D9=0, \"\", IF(D20=\"DQ\",\"DQ\",SUM(D21:I21)))","v":""},"/",{"$f":"IF(D9=\"\", \"\", SUM(L9:L18))","v":""},{"$f":"IF(D9=0, \"\", IF(D20=\"DQ\",\"DQ\",SUM(M19:M20)))","v":""},"/",{"$f":"IF(D9=\"\", \"\", SUM(O9:O18))","v":""}]
[]
[null,"KC/T #1","Time:",null,null,null,"Kick Count:",null,null,null,null,null,"# Comp:"]
[null,"KC/T #2","Time:",null,null,null,"Kick Count:",null,null,null,null,null,"# Comp:"]
[null,"KC/T #3","Time:",null,null,null,"Kick Count:",null,null,null,null,null,"# Comp:"]

{"sheet":"Team12","index":16,"n_rows":25,"n_cols":15,"rows_kept":25,"cut":false,"hidden":false,"merged":[[17,1,17,2],[19,1,19,2],[20,1,20,2],[12,0,14,0],[12,1,12,2],[13,1,13,2],[14,1,14,2],[15,0,16,0],[15,1,15,2],[16,1,16,2],[8,0,9,0],[8,1,8,2],[9,1,9,2],[10,0,11,0],[10,1,10,2],[11,1,11,2],[6,0,6,2],[6,9,7,9],[6,10,7,11],[6,12,7,12],[6,13,7,14],[7,0,7,2],[0,0,0,14],[1,0,1,14],[3,2,3,7],[3,8,3,9],[3,10,3,14],[4,2,4,7],[4,8,4,9],[4,10,4,14],[22,3,22,4],[22,8,22,9],[23,3,23,4],[23,8,23,9],[24,3,24,4],[24,8,24,9]]}
["Minnesota State High School League Dance Team Competition"]
["High Kick Judges Recap Sheet"]
[]
[null,"School:",{"$f":"IF('Ranking Sheet'!B23=0, \"\", 'Ranking Sheet'!B23)","v":""},null,null,null,null,null,"Class:",null,{"$f":"IF(Class=0, \"\", Class)","v":""}]
[null,"Meet Site:",{"$f":"IF(Site=0, \"\", Site)","v":""},null,null,null,null,null,"Meet Date:",null,{"$f":"IF(DATE=0, \"\", DATE)","v":""}]
[]
["Judge's Initials → ",null,null,{"$f":"IF('Ranking Sheet'!D10=0, \"\", 'Ranking Sheet'!D10)","v":""},{"$f":"IF('Ranking Sheet'!F10=0, \"\", 'Ranking Sheet'!F10)","v":""},{"$f":"IF('Ranking Sheet'!H10=0, \"\", 'Ranking Sheet'!H10)","v":""},{"$f":"IF('Ranking Sheet'!J10=0, \"\", 'Ranking Sheet'!J10)","v":""},{"$f":"IF('Ranking Sheet'!L10=0, \"\", 'Ranking Sheet'!L10)","v":""},{"$f":"IF('Ranking Sheet'!N10=0, \"\", 'Ranking Sheet'!N10)","v":""},"Category Total Points","Total Points Possible",null,"Subtotal Points","Subtotal Points Possible"]
["Category",null,null,1,2,3,4,5,6]
["KICKS","Technique of Kicks",null,null,null,null,null,null,null,{"$f":"IF(D9=0, \"\", SUM(D9:I9))","v":""},"/",{"$f":"IF(D9=\"\", \"\", IF(I9=0, 50, 60))","v":""}]
[null,"Kick Height",null,null,null,null,null,null,null,"","/","",{"$f":"IF(D9=0, \"\", SUM(D9:I10))","v":""},"/",{"$f":"IF(D9=\"\", \"\", IF(I9=0, 100, 120))","v":""}]
["CHOREOGRAPHY","Creativity",null,null,null,null,null,null,null,"","/",""]
[null,"Visual Effectiveness",null,null,null,null,null,null,null,"","/","",{"$f":"IF(D11=0, \"\", SUM(D11:I12))","v":""},"/",{"$f":"IF(D11=\"\", \"\", IF(I11=0, 100, 120))","v":""}]
["DIFFICULTY","Diffuculty of Routine Choreography",null,null,null,null,null,null,null,"","/",""]
[null,"Difficulty of Formations and Transitions",null,null,null,null,null,null,null,"","/",""]
[null,"Difficulty of Kicks",null,null,null,null,null,null,null,"","/","",{"$f":"IF(D13=0, \"\", SUM(D13:I15))","v":""},"/",{"$f":"IF(D13=\"\", \"\", IF(I13=0,150, 180))","v":""}]
["EXECUTION","Placement & Control",null,null,null,null,null,null,null,"","/",""]
[null,"Degree of Accuracy",null,null,null,null,null,null,null,"","/","",{"$f":"IF(D16=0, \"\", SUM(D16:I17))","v":""},"/",{"$f":"IF(D16=\"\", \"\", IF(I16=0, 100, 120))","v":""}]
["R.E.","Routine Effectiveness",null,null,null,null,null,null,null,"","/","",{"$f":"IF(D18=0, \"\", SUM(D18:I18))","v":""},"/",{"$f":"IF(D18=\"\", \"\", IF(I18=0, 50, 60))","v":""}]
[null,"SUB TOTALS",null,{"$f":"D9+D10+D11+D12+D13+D14+D15+D16+D17+D18","v":0},0,0,0,0,0,{"$f":"IF(D9=0, \"\", SUM(D19:I19))","v":""},"/",{"$f":"IF(D9=\"\", \"\", SUM(L9:L18))","v":""},{"$f":"IF(D9=0, \"\", SUM(M9:M18))","v":""},"/",{"$f":"IF(D9=\"\", \"\", SUM(O9:O18))","v":""}]
[null,"DEDUCTIONS \nEnter as a negative number i.e. -3 or DQ",null,null,null,null,null,null,null,{"$f":"IF(D20=\"\", \"\", IF(D20=\"DQ\",\"DQ\",SUM(D20:I20)))","v":""},null,null,{"$f":"IF(D20=\"\", \"\", IF(D20=\"DQ\",\"DQ\",SUM(D20:I20)))","v":""}]
[null,"TOTALS",null,{"$f":"IF(D20=\"DQ\", \"DQ\",SUM(D19+D20))","v":0},0,0,0,0,0,{"$f":"IF(D9=0, \"\", IF(D20=\"DQ\",\"DQ\",SUM(D21:I21)))","v":""},"/",{"$f":"IF(D9=\"\", \"\", SUM(L9:L18))","v":""},{"$f":"IF(D9=0, \"\", IF(D20=\"DQ\",\"DQ\",SUM(M19:M20)))","v":""},"/",{"$f":"IF(D9=\"\", \"\", SUM(O9:O18))","v":""}]
[]
[null,"KC/T #1","Time:",null,null,null,"Kick Count:",null,null,null,null,null,"# Comp:"]
[null,"KC/T #2","Time:",null,null,null,"Kick Count:",null,null,null,null,null,"# Comp:"]
[null,"KC/T #3","Time:",null,null,null,"Kick Count:",null,null,null,null,null,"# Comp:"]

{"sheet":"Team13","index":17,"n_rows":25,"n_cols":15,"rows_kept":25,"cut":false,"hidden":false,"merged":[[17,1,17,2],[19,1,19,2],[20,1,20,2],[12,0,14,0],[12,1,12,2],[13,1,13,2],[14,1,14,2],[15,0,16,0],[15,1,15,2],[16,1,16,2],[8,0,9,0],[8,1,8,2],[9,1,9,2],[10,0,11,0],[10,1,10,2],[11,1,11,2],[6,0,6,2],[6,9,7,9],[6,10,7,11],[6,12,7,12],[6,13,7,14],[7,0,7,2],[0,0,0,14],[1,0,1,14],[3,2,3,7],[3,8,3,9],[3,10,3,14],[4,2,4,7],[4,8,4,9],[4,10,4,14],[22,3,22,4],[22,8,22,9],[23,3,23,4],[23,8,23,9],[24,3,24,4],[24,8,24,9]]}
["Minnesota State High School League Dance Team Competition"]
["High Kick Judges Recap Sheet"]
[]
[null,"School:",{"$f":"IF('Ranking Sheet'!B24=0, \"\", 'Ranking Sheet'!B24)","v":""},null,null,null,null,null,"Class:",null,{"$f":"IF(Class=0, \"\", Class)","v":""}]
[null,"Meet Site:",{"$f":"IF(Site=0, \"\", Site)","v":""},null,null,null,null,null,"Meet Date:",null,{"$f":"IF(DATE=0, \"\", DATE)","v":""}]
[]
["Judge's Initials → ",null,null,{"$f":"IF('Ranking Sheet'!D10=0, \"\", 'Ranking Sheet'!D10)","v":""},{"$f":"IF('Ranking Sheet'!F10=0, \"\", 'Ranking Sheet'!F10)","v":""},{"$f":"IF('Ranking Sheet'!H10=0, \"\", 'Ranking Sheet'!H10)","v":""},{"$f":"IF('Ranking Sheet'!J10=0, \"\", 'Ranking Sheet'!J10)","v":""},{"$f":"IF('Ranking Sheet'!L10=0, \"\", 'Ranking Sheet'!L10)","v":""},{"$f":"IF('Ranking Sheet'!N10=0, \"\", 'Ranking Sheet'!N10)","v":""},"Category Total Points","Total Points Possible",null,"Subtotal Points","Subtotal Points Possible"]
["Category",null,null,1,2,3,4,5,6]
["KICKS","Technique of Kicks",null,null,null,null,null,null,null,{"$f":"IF(D9=0, \"\", SUM(D9:I9))","v":""},"/",{"$f":"IF(D9=\"\", \"\", IF(I9=0, 50, 60))","v":""}]
[null,"Kick Height",null,null,null,null,null,null,null,"","/","",{"$f":"IF(D9=0, \"\", SUM(D9:I10))","v":""},"/",{"$f":"IF(D9=\"\", \"\", IF(I9=0, 100, 120))","v":""}]
["CHOREOGRAPHY","Creativity",null,null,null,null,null,null,null,"","/",""]
[null,"Visual Effectiveness",null,null,null,null,null,null,null,"","/","",{"$f":"IF(D11=0, \"\", SUM(D11:I12))","v":""},"/",{"$f":"IF(D11=\"\", \"\", IF(I11=0, 100, 120))","v":""}]
["DIFFICULTY","Diffuculty of Routine Choreography",null,null,null,null,null,null,null,"","/",""]
[null,"Difficulty of Formations and Transitions",null,null,null,null,null,null,null,"","/",""]
[null,"Difficulty of Kicks",null,null,null,null,null,null,null,"","/","",{"$f":"IF(D13=0, \"\", SUM(D13:I15))","v":""},"/",{"$f":"IF(D13=\"\", \"\", IF(I13=0,150, 180))","v":""}]
["EXECUTION","Placement & Control",null,null,null,null,null,null,null,"","/",""]
[null,"Degree of Accuracy",null,null,null,null,null,null,null,"","/","",{"$f":"IF(D16=0, \"\", SUM(D16:I17))","v":""},"/",{"$f":"IF(D16=\"\", \"\", IF(I16=0, 100, 120))","v":""}]
["R.E.","Routine Effectiveness",null,null,null,null,null,null,null,"","/","",{"$f":"IF(D18=0, \"\", SUM(D18:I18))","v":""},"/",{"$f":"IF(D18=\"\", \"\", IF(I18=0, 50, 60))","v":""}]
[null,"SUB TOTALS",null,{"$f":"D9+D10+D11+D12+D13+D14+D15+D16+D17+D18","v":0},0,0,0,0,0,{"$f":"IF(D9=0, \"\", SUM(D19:I19))","v":""},"/",{"$f":"IF(D9=\"\", \"\", SUM(L9:L18))","v":""},{"$f":"IF(D9=0, \"\", SUM(M9:M18))","v":""},"/",{"$f":"IF(D9=\"\", \"\", SUM(O9:O18))","v":""}]
[null,"DEDUCTIONS \nEnter as a negative number i.e. -3 or DQ",null,null,null,null,null,null,null,{"$f":"IF(D20=\"\", \"\", IF(D20=\"DQ\",\"DQ\",SUM(D20:I20)))","v":""},null,null,{"$f":"IF(D20=\"\", \"\", IF(D20=\"DQ\",\"DQ\",SUM(D20:I20)))","v":""}]
[null,"TOTALS",null,{"$f":"IF(D20=\"DQ\", \"DQ\",SUM(D19+D20))","v":0},0,0,0,0,0,{"$f":"IF(D9=0, \"\", IF(D20=\"DQ\",\"DQ\",SUM(D21:I21)))","v":""},"/",{"$f":"IF(D9=\"\", \"\", SUM(L9:L18))","v":""},{"$f":"IF(D9=0, \"\", IF(D20=\"DQ\",\"DQ\",SUM(M19:M20)))","v":""},"/",{"$f":"IF(D9=\"\", \"\", SUM(O9:O18))","v":""}]
[]
[null,"KC/T #1","Time:",null,null,null,"Kick Count:",null,null,null,null,null,"# Comp:"]
[null,"KC/T #2","Time:",null,null,null,"Kick Count:",null,null,null,null,null,"# Comp:"]
[null,"KC/T #3","Time:",null,null,null,"Kick Count:",null,null,null,null,null,"# Comp:"]

{"sheet":"Team14","index":18,"n_rows":25,"n_cols":15,"rows_kept":25,"cut":false,"hidden":false,"merged":[[17,1,17,2],[19,1,19,2],[20,1,20,2],[12,0,14,0],[12,1,12,2],[13,1,13,2],[14,1,14,2],[15,0,16,0],[15,1,15,2],[16,1,16,2],[8,0,9,0],[8,1,8,2],[9,1,9,2],[10,0,11,0],[10,1,10,2],[11,1,11,2],[6,0,6,2],[6,9,7,9],[6,10,7,11],[6,12,7,12],[6,13,7,14],[7,0,7,2],[0,0,0,14],[1,0,1,14],[3,2,3,7],[3,8,3,9],[3,10,3,14],[4,2,4,7],[4,8,4,9],[4,10,4,14],[22,3,22,4],[22,8,22,9],[23,3,23,4],[23,8,23,9],[24,3,24,4],[24,8,24,9]]}
["Minnesota State High School League Dance Team Competition"]
["High Kick Judges Recap Sheet"]
[]
[null,"School:",{"$f":"IF('Ranking Sheet'!B25=0, \"\", 'Ranking Sheet'!B25)","v":""},null,null,null,null,null,"Class:",null,{"$f":"IF(Class=0, \"\", Class)","v":""}]
[null,"Meet Site:",{"$f":"IF(Site=0, \"\", Site)","v":""},null,null,null,null,null,"Meet Date:",null,{"$f":"IF(DATE=0, \"\", DATE)","v":""}]
[]
["Judge's Initials → ",null,null,{"$f":"IF('Ranking Sheet'!D10=0, \"\", 'Ranking Sheet'!D10)","v":""},{"$f":"IF('Ranking Sheet'!F10=0, \"\", 'Ranking Sheet'!F10)","v":""},{"$f":"IF('Ranking Sheet'!H10=0, \"\", 'Ranking Sheet'!H10)","v":""},{"$f":"IF('Ranking Sheet'!J10=0, \"\", 'Ranking Sheet'!J10)","v":""},{"$f":"IF('Ranking Sheet'!L10=0, \"\", 'Ranking Sheet'!L10)","v":""},{"$f":"IF('Ranking Sheet'!N10=0, \"\", 'Ranking Sheet'!N10)","v":""},"Category Total Points","Total Points Possible",null,"Subtotal Points","Subtotal Points Possible"]
["Category",null,null,1,2,3,4,5,6]
["KICKS","Technique of Kicks",null,null,null,null,null,null,null,{"$f":"IF(D9=0, \"\", SUM(D9:I9))","v":""},"/",{"$f":"IF(D9=\"\", \"\", IF(I9=0, 50, 60))","v":""}]
[null,"Kick Height",null,null,null,null,null,null,null,"","/","",{"$f":"IF(D9=0, \"\", SUM(D9:I10))","v":""},"/",{"$f":"IF(D9=\"\", \"\", IF(I9=0, 100, 120))","v":""}]
["CHOREOGRAPHY","Creativity",null,null,null,null,null,null,null,"","/",""]
[null,"Visual Effectiveness",null,null,null,null,null,null,null,"","/","",{"$f":"IF(D11=0, \"\", SUM(D11:I12))","v":""},"/",{"$f":"IF(D11=\"\", \"\", IF(I11=0, 100, 120))","v":""}]
["DIFFICULTY","Diffuculty of Routine Choreography",null,null,null,null,null,null,null,"","/",""]
[null,"Difficulty of Formations and Transitions",null,null,null,null,null,null,null,"","/",""]
[null,"Difficulty of Kicks",null,null,null,null,null,null,null,"","/","",{"$f":"IF(D13=0, \"\", SUM(D13:I15))","v":""},"/",{"$f":"IF(D13=\"\", \"\", IF(I13=0,150, 180))","v":""}]
["EXECUTION","Placement & Control",null,null,null,null,null,null,null,"","/",""]
[null,"Degree of Accuracy",null,null,null,null,null,null,null,"","/","",{"$f":"IF(D16=0, \"\", SUM(D16:I17))","v":""},"/",{"$f":"IF(D16=\"\", \"\", IF(I16=0, 100, 120))","v":""}]
["R.E.","Routine Effectiveness",null,null,null,null,null,null,null,"","/","",{"$f":"IF(D18=0, \"\", SUM(D18:I18))","v":""},"/",{"$f":"IF(D18=\"\", \"\", IF(I18=0, 50, 60))","v":""}]
[null,"SUB TOTALS",null,{"$f":"D9+D10+D11+D12+D13+D14+D15+D16+D17+D18","v":0},0,0,0,0,0,{"$f":"IF(D9=0, \"\", SUM(D19:I19))","v":""},"/",{"$f":"IF(D9=\"\", \"\", SUM(L9:L18))","v":""},{"$f":"IF(D9=0, \"\", SUM(M9:M18))","v":""},"/",{"$f":"IF(D9=\"\", \"\", SUM(O9:O18))","v":""}]
[null,"DEDUCTIONS \nEnter as a negative number i.e. -3 or DQ",null,null,null,null,null,null,null,{"$f":"IF(D20=\"\", \"\", IF(D20=\"DQ\",\"DQ\",SUM(D20:I20)))","v":""},null,null,{"$f":"IF(D20=\"\", \"\", IF(D20=\"DQ\",\"DQ\",SUM(D20:I20)))","v":""}]
[null,"TOTALS",null,{"$f":"IF(D20=\"DQ\", \"DQ\",SUM(D19+D20))","v":0},0,0,0,0,0,{"$f":"IF(D9=0, \"\", IF(D20=\"DQ\",\"DQ\",SUM(D21:I21)))","v":""},"/",{"$f":"IF(D9=\"\", \"\", SUM(L9:L18))","v":""},{"$f":"IF(D9=0, \"\", IF(D20=\"DQ\",\"DQ\",SUM(M19:M20)))","v":""},"/",{"$f":"IF(D9=\"\", \"\", SUM(O9:O18))","v":""}]
[]
[null,"KC/T #1","Time:",null,null,null,"Kick Count:",null,null,null,null,null,"# Comp:"]
[null,"KC/T #2","Time:",null,null,null,"Kick Count:",null,null,null,null,null,"# Comp:"]
[null,"KC/T #3","Time:",null,null,null,"Kick Count:",null,null,null,null,null,"# Comp:"]

{"sheet":"Team15","index":19,"n_rows":25,"n_cols":15,"rows_kept":25,"cut":false,"hidden":false,"merged":[[17,1,17,2],[19,1,19,2],[20,1,20,2],[12,0,14,0],[12,1,12,2],[13,1,13,2],[14,1,14,2],[15,0,16,0],[15,1,15,2],[16,1,16,2],[8,0,9,0],[8,1,8,2],[9,1,9,2],[10,0,11,0],[10,1,10,2],[11,1,11,2],[6,0,6,2],[6,9,7,9],[6,10,7,11],[6,12,7,12],[6,13,7,14],[7,0,7,2],[0,0,0,14],[1,0,1,14],[3,2,3,7],[3,8,3,9],[3,10,3,14],[4,2,4,7],[4,8,4,9],[4,10,4,14],[22,3,22,4],[22,8,22,9],[23,3,23,4],[23,8,23,9],[24,3,24,4],[24,8,24,9]]}
["Minnesota State High School League Dance Team Competition"]
["High Kick Judges Recap Sheet"]
[]
[null,"School:",{"$f":"IF('Ranking Sheet'!B26=0, \"\", 'Ranking Sheet'!B26)","v":""},null,null,null,null,null,"Class:",null,{"$f":"IF(Class=0, \"\", Class)","v":""}]
[null,"Meet Site:",{"$f":"IF(Site=0, \"\", Site)","v":""},null,null,null,null,null,"Meet Date:",null,{"$f":"IF(DATE=0, \"\", DATE)","v":""}]
[]
["Judge's Initials → ",null,null,{"$f":"IF('Ranking Sheet'!D10=0, \"\", 'Ranking Sheet'!D10)","v":""},{"$f":"IF('Ranking Sheet'!F10=0, \"\", 'Ranking Sheet'!F10)","v":""},{"$f":"IF('Ranking Sheet'!H10=0, \"\", 'Ranking Sheet'!H10)","v":""},{"$f":"IF('Ranking Sheet'!J10=0, \"\", 'Ranking Sheet'!J10)","v":""},{"$f":"IF('Ranking Sheet'!L10=0, \"\", 'Ranking Sheet'!L10)","v":""},{"$f":"IF('Ranking Sheet'!N10=0, \"\", 'Ranking Sheet'!N10)","v":""},"Category Total Points","Total Points Possible",null,"Subtotal Points","Subtotal Points Possible"]
["Category",null,null,1,2,3,4,5,6]
["KICKS","Technique of Kicks",null,null,null,null,null,null,null,{"$f":"IF(D9=0, \"\", SUM(D9:I9))","v":""},"/",{"$f":"IF(D9=\"\", \"\", IF(I9=0, 50, 60))","v":""}]
[null,"Kick Height",null,null,null,null,null,null,null,"","/","",{"$f":"IF(D9=0, \"\", SUM(D9:I10))","v":""},"/",{"$f":"IF(D9=\"\", \"\", IF(I9=0, 100, 120))","v":""}]
["CHOREOGRAPHY","Creativity",null,null,null,null,null,null,null,"","/",""]
[null,"Visual Effectiveness",null,null,null,null,null,null,null,"","/","",{"$f":"IF(D11=0, \"\", SUM(D11:I12))","v":""},"/",{"$f":"IF(D11=\"\", \"\", IF(I11=0, 100, 120))","v":""}]
["DIFFICULTY","Diffuculty of Routine Choreography",null,null,null,null,null,null,null,"","/",""]
[null,"Difficulty of Formations and Transitions",null,null,null,null,null,null,null,"","/",""]
[null,"Difficulty of Kicks",null,null,null,null,null,null,null,"","/","",{"$f":"IF(D13=0, \"\", SUM(D13:I15))","v":""},"/",{"$f":"IF(D13=\"\", \"\", IF(I13=0,150, 180))","v":""}]
["EXECUTION","Placement & Control",null,null,null,null,null,null,null,"","/",""]
[null,"Degree of Accuracy",null,null,null,null,null,null,null,"","/","",{"$f":"IF(D16=0, \"\", SUM(D16:I17))","v":""},"/",{"$f":"IF(D16=\"\", \"\", IF(I16=0, 100, 120))","v":""}]
["R.E.","Routine Effectiveness",null,null,null,null,null,null,null,"","/","",{"$f":"IF(D18=0, \"\", SUM(D18:I18))","v":""},"/",{"$f":"IF(D18=\"\", \"\", IF(I18=0, 50, 60))","v":""}]
[null,"SUB TOTALS",null,{"$f":"D9+D10+D11+D12+D13+D14+D15+D16+D17+D18","v":0},0,0,0,0,0,{"$f":"IF(D9=0, \"\", SUM(D19:I19))","v":""},"/",{"$f":"IF(D9=\"\", \"\", SUM(L9:L18))","v":""},{"$f":"IF(D9=0, \"\", SUM(M9:M18))","v":""},"/",{"$f":"IF(D9=\"\", \"\", SUM(O9:O18))","v":""}]
[null,"DEDUCTIONS \nEnter as a negative number i.e. -3 or DQ",null,null,null,null,null,null,null,{"$f":"IF(D20=\"\", \"\", IF(D20=\"DQ\",\"DQ\",SUM(D20:I20)))","v":""},null,null,{"$f":"IF(D20=\"\", \"\", IF(D20=\"DQ\",\"DQ\",SUM(D20:I20)))","v":""}]
[null,"TOTALS",null,{"$f":"IF(D20=\"DQ\", \"DQ\",SUM(D19+D20))","v":0},0,0,0,0,0,{"$f":"IF(D9=0, \"\", IF(D20=\"DQ\",\"DQ\",SUM(D21:I21)))","v":""},"/",{"$f":"IF(D9=\"\", \"\", SUM(L9:L18))","v":""},{"$f":"IF(D9=0, \"\", IF(D20=\"DQ\",\"DQ\",SUM(M19:M20)))","v":""},"/",{"$f":"IF(D9=\"\", \"\", SUM(O9:O18))","v":""}]
[]
[null,"KC/T #1","Time:",null,null,null,"Kick Count:",null,null,null,null,null,"# Comp:"]
[null,"KC/T #2","Time:",null,null,null,"Kick Count:",null,null,null,null,null,"# Comp:"]
[null,"KC/T #3","Time:",null,null,null,"Kick Count:",null,null,null,null,null,"# Comp:"]

{"sheet":"Team16","index":20,"n_rows":25,"n_cols":15,"rows_kept":25,"cut":false,"hidden":false,"merged":[[17,1,17,2],[19,1,19,2],[20,1,20,2],[12,0,14,0],[12,1,12,2],[13,1,13,2],[14,1,14,2],[15,0,16,0],[15,1,15,2],[16,1,16,2],[8,0,9,0],[8,1,8,2],[9,1,9,2],[10,0,11,0],[10,1,10,2],[11,1,11,2],[6,0,6,2],[6,9,7,9],[6,10,7,11],[6,12,7,12],[6,13,7,14],[7,0,7,2],[0,0,0,14],[1,0,1,14],[3,2,3,7],[3,8,3,9],[3,10,3,14],[4,2,4,7],[4,8,4,9],[4,10,4,14],[22,3,22,4],[22,8,22,9],[23,3,23,4],[23,8,23,9],[24,3,24,4],[24,8,24,9]]}
["Minnesota State High School League Dance Team Competition"]
["High Kick Judges Recap Sheet"]
[]
[null,"School:",{"$f":"IF('Ranking Sheet'!B27=0, \"\", 'Ranking Sheet'!B27)","v":""},null,null,null,null,null,"Class:",null,{"$f":"IF(Class=0, \"\", Class)","v":""}]
[null,"Meet Site:",{"$f":"IF(Site=0, \"\", Site)","v":""},null,null,null,null,null,"Meet Date:",null,{"$f":"IF(DATE=0, \"\", DATE)","v":""}]
[]
["Judge's Initials → ",null,null,{"$f":"IF('Ranking Sheet'!D10=0, \"\", 'Ranking Sheet'!D10)","v":""},{"$f":"IF('Ranking Sheet'!F10=0, \"\", 'Ranking Sheet'!F10)","v":""},{"$f":"IF('Ranking Sheet'!H10=0, \"\", 'Ranking Sheet'!H10)","v":""},{"$f":"IF('Ranking Sheet'!J10=0, \"\", 'Ranking Sheet'!J10)","v":""},{"$f":"IF('Ranking Sheet'!L10=0, \"\", 'Ranking Sheet'!L10)","v":""},{"$f":"IF('Ranking Sheet'!N10=0, \"\", 'Ranking Sheet'!N10)","v":""},"Category Total Points","Total Points Possible",null,"Subtotal Points","Subtotal Points Possible"]
["Category",null,null,1,2,3,4,5,6]
["KICKS","Technique of Kicks",null,null,null,null,null,null,null,{"$f":"IF(D9=0, \"\", SUM(D9:I9))","v":""},"/",{"$f":"IF(D9=\"\", \"\", IF(I9=0, 50, 60))","v":""}]
[null,"Kick Height",null,null,null,null,null,null,null,"","/","",{"$f":"IF(D9=0, \"\", SUM(D9:I10))","v":""},"/",{"$f":"IF(D9=\"\", \"\", IF(I9=0, 100, 120))","v":""}]
["CHOREOGRAPHY","Creativity",null,null,null,null,null,null,null,"","/",""]
[null,"Visual Effectiveness",null,null,null,null,null,null,null,"","/","",{"$f":"IF(D11=0, \"\", SUM(D11:I12))","v":""},"/",{"$f":"IF(D11=\"\", \"\", IF(I11=0, 100, 120))","v":""}]
["DIFFICULTY","Diffuculty of Routine Choreography",null,null,null,null,null,null,null,"","/",""]
[null,"Difficulty of Formations and Transitions",null,null,null,null,null,null,null,"","/",""]
[null,"Difficulty of Kicks",null,null,null,null,null,null,null,"","/","",{"$f":"IF(D13=0, \"\", SUM(D13:I15))","v":""},"/",{"$f":"IF(D13=\"\", \"\", IF(I13=0,150, 180))","v":""}]
["EXECUTION","Placement & Control",null,null,null,null,null,null,null,"","/",""]
[null,"Degree of Accuracy",null,null,null,null,null,null,null,"","/","",{"$f":"IF(D16=0, \"\", SUM(D16:I17))","v":""},"/",{"$f":"IF(D16=\"\", \"\", IF(I16=0, 100, 120))","v":""}]
["R.E.","Routine Effectiveness",null,null,null,null,null,null,null,"","/","",{"$f":"IF(D18=0, \"\", SUM(D18:I18))","v":""},"/",{"$f":"IF(D18=\"\", \"\", IF(I18=0, 50, 60))","v":""}]
[null,"SUB TOTALS",null,{"$f":"D9+D10+D11+D12+D13+D14+D15+D16+D17+D18","v":0},0,0,0,0,0,{"$f":"IF(D9=0, \"\", SUM(D19:I19))","v":""},"/",{"$f":"IF(D9=\"\", \"\", SUM(L9:L18))","v":""},{"$f":"IF(D9=0, \"\", SUM(M9:M18))","v":""},"/",{"$f":"IF(D9=\"\", \"\", SUM(O9:O18))","v":""}]
[null,"DEDUCTIONS \nEnter as a negative number i.e. -3 or DQ",null,null,null,null,null,null,null,{"$f":"IF(D20=\"\", \"\", IF(D20=\"DQ\",\"DQ\",SUM(D20:I20)))","v":""},null,null,{"$f":"IF(D20=\"\", \"\", IF(D20=\"DQ\",\"DQ\",SUM(D20:I20)))","v":""}]
[null,"TOTALS",null,{"$f":"IF(D20=\"DQ\", \"DQ\",SUM(D19+D20))","v":0},0,0,0,0,0,{"$f":"IF(D9=0, \"\", IF(D20=\"DQ\",\"DQ\",SUM(D21:I21)))","v":""},"/",{"$f":"IF(D9=\"\", \"\", SUM(L9:L18))","v":""},{"$f":"IF(D9=0, \"\", IF(D20=\"DQ\",\"DQ\",SUM(M19:M20)))","v":""},"/",{"$f":"IF(D9=\"\", \"\", SUM(O9:O18))","v":""}]
[]
[null,"KC/T #1","Time:",null,null,null,"Kick Count:",null,null,null,null,null,"# Comp:"]
[null,"KC/T #2","Time:",null,null,null,"Kick Count:",null,null,null,null,null,"# Comp:"]
[null,"KC/T #3","Time:",null,null,null,"Kick Count:",null,null,null,null,null,"# Comp:"]

{"sheet":"Team17","index":21,"n_rows":25,"n_cols":15,"rows_kept":25,"cut":false,"hidden":false,"merged":[[17,1,17,2],[19,1,19,2],[20,1,20,2],[12,0,14,0],[12,1,12,2],[13,1,13,2],[14,1,14,2],[15,0,16,0],[15,1,15,2],[16,1,16,2],[8,0,9,0],[8,1,8,2],[9,1,9,2],[10,0,11,0],[10,1,10,2],[11,1,11,2],[6,0,6,2],[6,9,7,9],[6,10,7,11],[6,12,7,12],[6,13,7,14],[7,0,7,2],[0,0,0,14],[1,0,1,14],[3,2,3,7],[3,8,3,9],[3,10,3,14],[4,2,4,7],[4,8,4,9],[4,10,4,14],[22,3,22,4],[22,8,22,9],[23,3,23,4],[23,8,23,9],[24,3,24,4],[24,8,24,9]]}
["Minnesota State High School League Dance Team Competition"]
["High Kick Judges Recap Sheet"]
[]
[null,"School:",{"$f":"IF('Ranking Sheet'!B28=0, \"\", 'Ranking Sheet'!B28)","v":""},null,null,null,null,null,"Class:",null,{"$f":"IF(Class=0, \"\", Class)","v":""}]
[null,"Meet Site:",{"$f":"IF(Site=0, \"\", Site)","v":""},null,null,null,null,null,"Meet Date:",null,{"$f":"IF(DATE=0, \"\", DATE)","v":""}]
[]
["Judge's Initials → ",null,null,{"$f":"IF('Ranking Sheet'!D10=0, \"\", 'Ranking Sheet'!D10)","v":""},{"$f":"IF('Ranking Sheet'!F10=0, \"\", 'Ranking Sheet'!F10)","v":""},{"$f":"IF('Ranking Sheet'!H10=0, \"\", 'Ranking Sheet'!H10)","v":""},{"$f":"IF('Ranking Sheet'!J10=0, \"\", 'Ranking Sheet'!J10)","v":""},{"$f":"IF('Ranking Sheet'!L10=0, \"\", 'Ranking Sheet'!L10)","v":""},{"$f":"IF('Ranking Sheet'!N10=0, \"\", 'Ranking Sheet'!N10)","v":""},"Category Total Points","Total Points Possible",null,"Subtotal Points","Subtotal Points Possible"]
["Category",null,null,1,2,3,4,5,6]
["KICKS","Technique of Kicks",null,null,null,null,null,null,null,{"$f":"IF(D9=0, \"\", SUM(D9:I9))","v":""},"/",{"$f":"IF(D9=\"\", \"\", IF(I9=0, 50, 60))","v":""}]
[null,"Kick Height",null,null,null,null,null,null,null,"","/","",{"$f":"IF(D9=0, \"\", SUM(D9:I10))","v":""},"/",{"$f":"IF(D9=\"\", \"\", IF(I9=0, 100, 120))","v":""}]
["CHOREOGRAPHY","Creativity",null,null,null,null,null,null,null,"","/",""]
[null,"Visual Effectiveness",null,null,null,null,null,null,null,"","/","",{"$f":"IF(D11=0, \"\", SUM(D11:I12))","v":""},"/",{"$f":"IF(D11=\"\", \"\", IF(I11=0, 100, 120))","v":""}]
["DIFFICULTY","Diffuculty of Routine Choreography",null,null,null,null,null,null,null,"","/",""]
[null,"Difficulty of Formations and Transitions",null,null,null,null,null,null,null,"","/",""]
[null,"Difficulty of Kicks",null,null,null,null,null,null,null,"","/","",{"$f":"IF(D13=0, \"\", SUM(D13:I15))","v":""},"/",{"$f":"IF(D13=\"\", \"\", IF(I13=0,150, 180))","v":""}]
["EXECUTION","Placement & Control",null,null,null,null,null,null,null,"","/",""]
[null,"Degree of Accuracy",null,null,null,null,null,null,null,"","/","",{"$f":"IF(D16=0, \"\", SUM(D16:I17))","v":""},"/",{"$f":"IF(D16=\"\", \"\", IF(I16=0, 100, 120))","v":""}]
["R.E.","Routine Effectiveness",null,null,null,null,null,null,null,"","/","",{"$f":"IF(D18=0, \"\", SUM(D18:I18))","v":""},"/",{"$f":"IF(D18=\"\", \"\", IF(I18=0, 50, 60))","v":""}]
[null,"SUB TOTALS",null,{"$f":"D9+D10+D11+D12+D13+D14+D15+D16+D17+D18","v":0},0,0,0,0,0,{"$f":"IF(D9=0, \"\", SUM(D19:I19))","v":""},"/",{"$f":"IF(D9=\"\", \"\", SUM(L9:L18))","v":""},{"$f":"IF(D9=0, \"\", SUM(M9:M18))","v":""},"/",{"$f":"IF(D9=\"\", \"\", SUM(O9:O18))","v":""}]
[null,"DEDUCTIONS \nEnter as a negative number i.e. -3 or DQ",null,null,null,null,null,null,null,{"$f":"IF(D20=\"\", \"\", IF(D20=\"DQ\",\"DQ\",SUM(D20:I20)))","v":""},null,null,{"$f":"IF(D20=\"\", \"\", IF(D20=\"DQ\",\"DQ\",SUM(D20:I20)))","v":""}]
[null,"TOTALS",null,{"$f":"IF(D20=\"DQ\", \"DQ\",SUM(D19+D20))","v":0},0,0,0,0,0,{"$f":"IF(D9=0, \"\", IF(D20=\"DQ\",\"DQ\",SUM(D21:I21)))","v":""},"/",{"$f":"IF(D9=\"\", \"\", SUM(L9:L18))","v":""},{"$f":"IF(D9=0, \"\", IF(D20=\"DQ\",\"DQ\",SUM(M19:M20)))","v":""},"/",{"$f":"IF(D9=\"\", \"\", SUM(O9:O18))","v":""}]
[]
[null,"KC/T #1","Time:",null,null,null,"Kick Count:",null,null,null,null,null,"# Comp:"]
[null,"KC/T #2","Time:",null,null,null,"Kick Count:",null,null,null,null,null,"# Comp:"]
[null,"KC/T #3","Time:",null,null,null,"Kick Count:",null,null,null,null,null,"# Comp:"]

{"sheet":"Team18","index":22,"n_rows":25,"n_cols":15,"rows_kept":25,"cut":false,"hidden":false,"merged":[[17,1,17,2],[19,1,19,2],[20,1,20,2],[12,0,14,0],[12,1,12,2],[13,1,13,2],[14,1,14,2],[15,0,16,0],[15,1,15,2],[16,1,16,2],[8,0,9,0],[8,1,8,2],[9,1,9,2],[10,0,11,0],[10,1,10,2],[11,1,11,2],[6,0,6,2],[6,9,7,9],[6,10,7,11],[6,12,7,12],[6,13,7,14],[7,0,7,2],[0,0,0,14],[1,0,1,14],[3,2,3,7],[3,8,3,9],[3,10,3,14],[4,2,4,7],[4,8,4,9],[4,10,4,14],[22,3,22,4],[22,8,22,9],[23,3,23,4],[23,8,23,9],[24,3,24,4],[24,8,24,9]]}
["Minnesota State High School League Dance Team Competition"]
["High Kick Judges Recap Sheet"]
[]
[null,"School:",{"$f":"IF('Ranking Sheet'!B29=0, \"\", 'Ranking Sheet'!B29)","v":""},null,null,null,null,null,"Class:",null,{"$f":"IF(Class=0, \"\", Class)","v":""}]
[null,"Meet Site:",{"$f":"IF(Site=0, \"\", Site)","v":""},null,null,null,null,null,"Meet Date:",null,{"$f":"IF(DATE=0, \"\", DATE)","v":""}]
[]
["Judge's Initials → ",null,null,{"$f":"IF('Ranking Sheet'!D10=0, \"\", 'Ranking Sheet'!D10)","v":""},{"$f":"IF('Ranking Sheet'!F10=0, \"\", 'Ranking Sheet'!F10)","v":""},{"$f":"IF('Ranking Sheet'!H10=0, \"\", 'Ranking Sheet'!H10)","v":""},{"$f":"IF('Ranking Sheet'!J10=0, \"\", 'Ranking Sheet'!J10)","v":""},{"$f":"IF('Ranking Sheet'!L10=0, \"\", 'Ranking Sheet'!L10)","v":""},{"$f":"IF('Ranking Sheet'!N10=0, \"\", 'Ranking Sheet'!N10)","v":""},"Category Total Points","Total Points Possible",null,"Subtotal Points","Subtotal Points Possible"]
["Category",null,null,1,2,3,4,5,6]
["KICKS","Technique of Kicks",null,null,null,null,null,null,null,{"$f":"IF(D9=0, \"\", SUM(D9:I9))","v":""},"/",{"$f":"IF(D9=\"\", \"\", IF(I9=0, 50, 60))","v":""}]
[null,"Kick Height",null,null,null,null,null,null,null,"","/","",{"$f":"IF(D9=0, \"\", SUM(D9:I10))","v":""},"/",{"$f":"IF(D9=\"\", \"\", IF(I9=0, 100, 120))","v":""}]
["CHOREOGRAPHY","Creativity",null,null,null,null,null,null,null,"","/",""]
[null,"Visual Effectiveness",null,null,null,null,null,null,null,"","/","",{"$f":"IF(D11=0, \"\", SUM(D11:I12))","v":""},"/",{"$f":"IF(D11=\"\", \"\", IF(I11=0, 100, 120))","v":""}]
["DIFFICULTY","Diffuculty of Routine Choreography",null,null,null,null,null,null,null,"","/",""]
[null,"Difficulty of Formations and Transitions",null,null,null,null,null,null,null,"","/",""]
[null,"Difficulty of Kicks",null,null,null,null,null,null,null,"","/","",{"$f":"IF(D13=0, \"\", SUM(D13:I15))","v":""},"/",{"$f":"IF(D13=\"\", \"\", IF(I13=0,150, 180))","v":""}]
["EXECUTION","Placement & Control",null,null,null,null,null,null,null,"","/",""]
[null,"Degree of Accuracy",null,null,null,null,null,null,null,"","/","",{"$f":"IF(D16=0, \"\", SUM(D16:I17))","v":""},"/",{"$f":"IF(D16=\"\", \"\", IF(I16=0, 100, 120))","v":""}]
["R.E.","Routine Effectiveness",null,null,null,null,null,null,null,"","/","",{"$f":"IF(D18=0, \"\", SUM(D18:I18))","v":""},"/",{"$f":"IF(D18=\"\", \"\", IF(I18=0, 50, 60))","v":""}]
[null,"SUB TOTALS",null,{"$f":"D9+D10+D11+D12+D13+D14+D15+D16+D17+D18","v":0},0,0,0,0,0,{"$f":"IF(D9=0, \"\", SUM(D19:I19))","v":""},"/",{"$f":"IF(D9=\"\", \"\", SUM(L9:L18))","v":""},{"$f":"IF(D9=0, \"\", SUM(M9:M18))","v":""},"/",{"$f":"IF(D9=\"\", \"\", SUM(O9:O18))","v":""}]
[null,"DEDUCTIONS \nEnter as a negative number i.e. -3 or DQ",null,null,null,null,null,null,null,{"$f":"IF(D20=\"\", \"\", IF(D20=\"DQ\",\"DQ\",SUM(D20:I20)))","v":""},null,null,{"$f":"IF(D20=\"\", \"\", IF(D20=\"DQ\",\"DQ\",SUM(D20:I20)))","v":""}]
[null,"TOTALS",null,{"$f":"IF(D20=\"DQ\", \"DQ\",SUM(D19+D20))","v":0},0,0,0,0,0,{"$f":"IF(D9=0, \"\", IF(D20=\"DQ\",\"DQ\",SUM(D21:I21)))","v":""},"/",{"$f":"IF(D9=\"\", \"\", SUM(L9:L18))","v":""},{"$f":"IF(D9=0, \"\", IF(D20=\"DQ\",\"DQ\",SUM(M19:M20)))","v":""},"/",{"$f":"IF(D9=\"\", \"\", SUM(O9:O18))","v":""}]
[]
[null,"KC/T #1","Time:",null,null,null,"Kick Count:",null,null,null,null,null,"# Comp:"]
[null,"KC/T #2","Time:",null,null,null,"Kick Count:",null,null,null,null,null,"# Comp:"]
[null,"KC/T #3","Time:",null,null,null,"Kick Count:",null,null,null,null,null,"# Comp:"]

{"sheet":"Team19","index":23,"n_rows":25,"n_cols":15,"rows_kept":25,"cut":false,"hidden":false,"merged":[[17,1,17,2],[19,1,19,2],[20,1,20,2],[12,0,14,0],[12,1,12,2],[13,1,13,2],[14,1,14,2],[15,0,16,0],[15,1,15,2],[16,1,16,2],[8,0,9,0],[8,1,8,2],[9,1,9,2],[10,0,11,0],[10,1,10,2],[11,1,11,2],[6,0,6,2],[6,9,7,9],[6,10,7,11],[6,12,7,12],[6,13,7,14],[7,0,7,2],[0,0,0,14],[1,0,1,14],[3,2,3,7],[3,8,3,9],[3,10,3,14],[4,2,4,7],[4,8,4,9],[4,10,4,14],[22,3,22,4],[22,8,22,9],[23,3,23,4],[23,8,23,9],[24,3,24,4],[24,8,24,9]]}
["Minnesota State High School League Dance Team Competition"]
["High Kick Judges Recap Sheet"]
[]
[null,"School:",{"$f":"IF('Ranking Sheet'!B30=0, \"\", 'Ranking Sheet'!B30)","v":""},null,null,null,null,null,"Class:",null,{"$f":"IF(Class=0, \"\", Class)","v":""}]
[null,"Meet Site:",{"$f":"IF(Site=0, \"\", Site)","v":""},null,null,null,null,null,"Meet Date:",null,{"$f":"IF(DATE=0, \"\", DATE)","v":""}]
[]
["Judge's Initials → ",null,null,{"$f":"IF('Ranking Sheet'!D10=0, \"\", 'Ranking Sheet'!D10)","v":""},{"$f":"IF('Ranking Sheet'!F10=0, \"\", 'Ranking Sheet'!F10)","v":""},{"$f":"IF('Ranking Sheet'!H10=0, \"\", 'Ranking Sheet'!H10)","v":""},{"$f":"IF('Ranking Sheet'!J10=0, \"\", 'Ranking Sheet'!J10)","v":""},{"$f":"IF('Ranking Sheet'!L10=0, \"\", 'Ranking Sheet'!L10)","v":""},{"$f":"IF('Ranking Sheet'!N10=0, \"\", 'Ranking Sheet'!N10)","v":""},"Category Total Points","Total Points Possible",null,"Subtotal Points","Subtotal Points Possible"]
["Category",null,null,1,2,3,4,5,6]
["KICKS","Technique of Kicks",null,null,null,null,null,null,null,{"$f":"IF(D9=0, \"\", SUM(D9:I9))","v":""},"/",{"$f":"IF(D9=\"\", \"\", IF(I9=0, 50, 60))","v":""}]
[null,"Kick Height",null,null,null,null,null,null,null,"","/","",{"$f":"IF(D9=0, \"\", SUM(D9:I10))","v":""},"/",{"$f":"IF(D9=\"\", \"\", IF(I9=0, 100, 120))","v":""}]
["CHOREOGRAPHY","Creativity",null,null,null,null,null,null,null,"","/",""]
[null,"Visual Effectiveness",null,null,null,null,null,null,null,"","/","",{"$f":"IF(D11=0, \"\", SUM(D11:I12))","v":""},"/",{"$f":"IF(D11=\"\", \"\", IF(I11=0, 100, 120))","v":""}]
["DIFFICULTY","Diffuculty of Routine Choreography",null,null,null,null,null,null,null,"","/",""]
[null,"Difficulty of Formations and Transitions",null,null,null,null,null,null,null,"","/",""]
[null,"Difficulty of Kicks",null,null,null,null,null,null,null,"","/","",{"$f":"IF(D13=0, \"\", SUM(D13:I15))","v":""},"/",{"$f":"IF(D13=\"\", \"\", IF(I13=0,150, 180))","v":""}]
["EXECUTION","Placement & Control",null,null,null,null,null,null,null,"","/",""]
[null,"Degree of Accuracy",null,null,null,null,null,null,null,"","/","",{"$f":"IF(D16=0, \"\", SUM(D16:I17))","v":""},"/",{"$f":"IF(D16=\"\", \"\", IF(I16=0, 100, 120))","v":""}]
["R.E.","Routine Effectiveness",null,null,null,null,null,null,null,"","/","",{"$f":"IF(D18=0, \"\", SUM(D18:I18))","v":""},"/",{"$f":"IF(D18=\"\", \"\", IF(I18=0, 50, 60))","v":""}]
[null,"SUB TOTALS",null,{"$f":"D9+D10+D11+D12+D13+D14+D15+D16+D17+D18","v":0},0,0,0,0,0,{"$f":"IF(D9=0, \"\", SUM(D19:I19))","v":""},"/",{"$f":"IF(D9=\"\", \"\", SUM(L9:L18))","v":""},{"$f":"IF(D9=0, \"\", SUM(M9:M18))","v":""},"/",{"$f":"IF(D9=\"\", \"\", SUM(O9:O18))","v":""}]
[null,"DEDUCTIONS \nEnter as a negative number i.e. -3 or DQ",null,null,null,null,null,null,null,{"$f":"IF(D20=\"\", \"\", IF(D20=\"DQ\",\"DQ\",SUM(D20:I20)))","v":""},null,null,{"$f":"IF(D20=\"\", \"\", IF(D20=\"DQ\",\"DQ\",SUM(D20:I20)))","v":""}]
[null,"TOTALS",null,{"$f":"IF(D20=\"DQ\", \"DQ\",SUM(D19+D20))","v":0},0,0,0,0,0,{"$f":"IF(D9=0, \"\", IF(D20=\"DQ\",\"DQ\",SUM(D21:I21)))","v":""},"/",{"$f":"IF(D9=\"\", \"\", SUM(L9:L18))","v":""},{"$f":"IF(D9=0, \"\", IF(D20=\"DQ\",\"DQ\",SUM(M19:M20)))","v":""},"/",{"$f":"IF(D9=\"\", \"\", SUM(O9:O18))","v":""}]
[]
[null,"KC/T #1","Time:",null,null,null,"Kick Count:",null,null,null,null,null,"# Comp:"]
[null,"KC/T #2","Time:",null,null,null,"Kick Count:",null,null,null,null,null,"# Comp:"]
[null,"KC/T #3","Time:",null,null,null,"Kick Count:",null,null,null,null,null,"# Comp:"]

{"sheet":"Team20","index":24,"n_rows":25,"n_cols":15,"rows_kept":25,"cut":false,"hidden":false,"merged":[[17,1,17,2],[19,1,19,2],[20,1,20,2],[12,0,14,0],[12,1,12,2],[13,1,13,2],[14,1,14,2],[15,0,16,0],[15,1,15,2],[16,1,16,2],[8,0,9,0],[8,1,8,2],[9,1,9,2],[10,0,11,0],[10,1,10,2],[11,1,11,2],[6,0,6,2],[6,9,7,9],[6,10,7,11],[6,12,7,12],[6,13,7,14],[7,0,7,2],[0,0,0,14],[1,0,1,14],[3,2,3,7],[3,8,3,9],[3,10,3,14],[4,2,4,7],[4,8,4,9],[4,10,4,14],[22,3,22,4],[22,8,22,9],[23,3,23,4],[23,8,23,9],[24,3,24,4],[24,8,24,9]]}
["Minnesota State High School League Dance Team Competition"]
["High Kick Judges Recap Sheet"]
[]
[null,"School:",{"$f":"IF('Ranking Sheet'!B31=0, \"\", 'Ranking Sheet'!B31)","v":""},null,null,null,null,null,"Class:",null,{"$f":"IF(Class=0, \"\", Class)","v":""}]
[null,"Meet Site:",{"$f":"IF(Site=0, \"\", Site)","v":""},null,null,null,null,null,"Meet Date:",null,{"$f":"IF(DATE=0, \"\", DATE)","v":""}]
[]
["Judge's Initials → ",null,null,{"$f":"IF('Ranking Sheet'!D10=0, \"\", 'Ranking Sheet'!D10)","v":""},{"$f":"IF('Ranking Sheet'!F10=0, \"\", 'Ranking Sheet'!F10)","v":""},{"$f":"IF('Ranking Sheet'!H10=0, \"\", 'Ranking Sheet'!H10)","v":""},{"$f":"IF('Ranking Sheet'!J10=0, \"\", 'Ranking Sheet'!J10)","v":""},{"$f":"IF('Ranking Sheet'!L10=0, \"\", 'Ranking Sheet'!L10)","v":""},{"$f":"IF('Ranking Sheet'!N10=0, \"\", 'Ranking Sheet'!N10)","v":""},"Category Total Points","Total Points Possible",null,"Subtotal Points","Subtotal Points Possible"]
["Category",null,null,1,2,3,4,5,6]
["KICKS","Technique of Kicks",null,null,null,null,null,null,null,{"$f":"IF(D9=0, \"\", SUM(D9:I9))","v":""},"/",{"$f":"IF(D9=\"\", \"\", IF(I9=0, 50, 60))","v":""}]
[null,"Kick Height",null,null,null,null,null,null,null,"","/","",{"$f":"IF(D9=0, \"\", SUM(D9:I10))","v":""},"/",{"$f":"IF(D9=\"\", \"\", IF(I9=0, 100, 120))","v":""}]
["CHOREOGRAPHY","Creativity",null,null,null,null,null,null,null,"","/",""]
[null,"Visual Effectiveness",null,null,null,null,null,null,null,"","/","",{"$f":"IF(D11=0, \"\", SUM(D11:I12))","v":""},"/",{"$f":"IF(D11=\"\", \"\", IF(I11=0, 100, 120))","v":""}]
["DIFFICULTY","Diffuculty of Routine Choreography",null,null,null,null,null,null,null,"","/",""]
[null,"Difficulty of Formations and Transitions",null,null,null,null,null,null,null,"","/",""]
[null,"Difficulty of Kicks",null,null,null,null,null,null,null,"","/","",{"$f":"IF(D13=0, \"\", SUM(D13:I15))","v":""},"/",{"$f":"IF(D13=\"\", \"\", IF(I13=0,150, 180))","v":""}]
["EXECUTION","Placement & Control",null,null,null,null,null,null,null,"","/",""]
[null,"Degree of Accuracy",null,null,null,null,null,null,null,"","/","",{"$f":"IF(D16=0, \"\", SUM(D16:I17))","v":""},"/",{"$f":"IF(D16=\"\", \"\", IF(I16=0, 100, 120))","v":""}]
["R.E.","Routine Effectiveness",null,null,null,null,null,null,null,"","/","",{"$f":"IF(D18=0, \"\", SUM(D18:I18))","v":""},"/",{"$f":"IF(D18=\"\", \"\", IF(I18=0, 50, 60))","v":""}]
[null,"SUB TOTALS",null,{"$f":"D9+D10+D11+D12+D13+D14+D15+D16+D17+D18","v":0},0,0,0,0,0,{"$f":"IF(D9=0, \"\", SUM(D19:I19))","v":""},"/",{"$f":"IF(D9=\"\", \"\", SUM(L9:L18))","v":""},{"$f":"IF(D9=0, \"\", SUM(M9:M18))","v":""},"/",{"$f":"IF(D9=\"\", \"\", SUM(O9:O18))","v":""}]
[null,"DEDUCTIONS \nEnter as a negative number i.e. -3 or DQ",null,null,null,null,null,null,null,{"$f":"IF(D20=\"\", \"\", IF(D20=\"DQ\",\"DQ\",SUM(D20:I20)))","v":""},null,null,{"$f":"IF(D20=\"\", \"\", IF(D20=\"DQ\",\"DQ\",SUM(D20:I20)))","v":""}]
[null,"TOTALS",null,{"$f":"IF(D20=\"DQ\", \"DQ\",SUM(D19+D20))","v":0},0,0,0,0,0,{"$f":"IF(D9=0, \"\", IF(D20=\"DQ\",\"DQ\",SUM(D21:I21)))","v":""},"/",{"$f":"IF(D9=\"\", \"\", SUM(L9:L18))","v":""},{"$f":"IF(D9=0, \"\", IF(D20=\"DQ\",\"DQ\",SUM(M19:M20)))","v":""},"/",{"$f":"IF(D9=\"\", \"\", SUM(O9:O18))","v":""}]
[]
[null,"KC/T #1","Time:",null,null,null,"Kick Count:",null,null,null,null,null,"# Comp:"]
[null,"KC/T #2","Time:",null,null,null,"Kick Count:",null,null,null,null,null,"# Comp:"]
[null,"KC/T #3","Time:",null,null,null,"Kick Count:",null,null,null,null,null,"# Comp:"]

{"sheet":"Team21","index":25,"n_rows":25,"n_cols":15,"rows_kept":25,"cut":false,"hidden":false,"merged":[[16,1,16,2],[17,1,17,2],[19,1,19,2],[20,1,20,2],[10,1,10,2],[11,1,11,2],[13,1,13,2],[14,1,14,2],[0,0,0,14],[1,0,1,14],[3,2,3,7],[3,8,3,9],[3,10,3,14],[4,2,4,7],[15,0,16,0],[8,0,9,0],[8,1,8,2],[9,1,9,2],[10,0,11,0],[6,10,7,11],[6,0,6,2],[6,9,7,9],[7,0,7,2],[15,1,15,2],[12,0,14,0],[12,1,12,2],[4,8,4,9],[4,10,4,14],[6,12,7,12],[6,13,7,14],[22,3,22,4],[22,8,22,9],[23,3,23,4],[23,8,23,9],[24,3,24,4],[24,8,24,9]]}
["Minnesota State High School League Dance Team Competition"]
["High Kick Judges Recap Sheet"]
[]
[null,"School:",{"$f":"IF('Ranking Sheet'!B32=0, \"\", 'Ranking Sheet'!B32)","v":""},null,null,null,null,null,"Class:",null,{"$f":"IF(Class=0, \"\", Class)","v":""}]
[null,"Meet Site:",{"$f":"IF(Site=0, \"\", Site)","v":""},null,null,null,null,null,"Meet Date:",null,{"$f":"IF(DATE=0, \"\", DATE)","v":""}]
[]
["Judge's Initials → ",null,null,{"$f":"IF('Ranking Sheet'!D10=0, \"\", 'Ranking Sheet'!D10)","v":""},{"$f":"IF('Ranking Sheet'!F10=0, \"\", 'Ranking Sheet'!F10)","v":""},{"$f":"IF('Ranking Sheet'!H10=0, \"\", 'Ranking Sheet'!H10)","v":""},{"$f":"IF('Ranking Sheet'!J10=0, \"\", 'Ranking Sheet'!J10)","v":""},{"$f":"IF('Ranking Sheet'!L10=0, \"\", 'Ranking Sheet'!L10)","v":""},{"$f":"IF('Ranking Sheet'!N10=0, \"\", 'Ranking Sheet'!N10)","v":""},"Category Total Points","Total Points Possible",null,"Subtotal Points","Subtotal Points Possible"]
["Category",null,null,1,2,3,4,5,6]
["KICKS","Technique of Kicks",null,null,null,null,null,null,null,{"$f":"IF(D9=0, \"\", SUM(D9:I9))","v":""},"/",{"$f":"IF(D9=\"\", \"\", IF(I9=0, 50, 60))","v":""}]
[null,"Kick Height",null,null,null,null,null,null,null,"","/","",{"$f":"IF(D9=0, \"\", SUM(D9:I10))","v":""},"/",{"$f":"IF(D9=\"\", \"\", IF(I9=0, 100, 120))","v":""}]
["CHOREOGRAPHY","Creativity",null,null,null,null,null,null,null,"","/",""]
[null,"Visual Effectiveness",null,null,null,null,null,null,null,"","/","",{"$f":"IF(D11=0, \"\", SUM(D11:I12))","v":""},"/",{"$f":"IF(D11=\"\", \"\", IF(I11=0, 100, 120))","v":""}]
["DIFFICULTY","Diffuculty of Routine Choreography",null,null,null,null,null,null,null,"","/",""]
[null,"Difficulty of Formations and Transitions",null,null,null,null,null,null,null,"","/",""]
[null,"Difficulty of Kicks",null,null,null,null,null,null,null,"","/","",{"$f":"IF(D13=0, \"\", SUM(D13:I15))","v":""},"/",{"$f":"IF(D13=\"\", \"\", IF(I13=0,150, 180))","v":""}]
["EXECUTION","Placement & Control",null,null,null,null,null,null,null,"","/",""]
[null,"Degree of Accuracy",null,null,null,null,null,null,null,"","/","",{"$f":"IF(D16=0, \"\", SUM(D16:I17))","v":""},"/",{"$f":"IF(D16=\"\", \"\", IF(I16=0, 100, 120))","v":""}]
["R.E.","Routine Effectiveness",null,null,null,null,null,null,null,"","/","",{"$f":"IF(D18=0, \"\", SUM(D18:I18))","v":""},"/",{"$f":"IF(D18=\"\", \"\", IF(I18=0, 50, 60))","v":""}]
[null,"SUB TOTALS",null,{"$f":"D9+D10+D11+D12+D13+D14+D15+D16+D17+D18","v":0},0,0,0,0,0,{"$f":"IF(D9=0, \"\", SUM(D19:I19))","v":""},"/",{"$f":"IF(D9=\"\", \"\", SUM(L9:L18))","v":""},{"$f":"IF(D9=0, \"\", SUM(M9:M18))","v":""},"/",{"$f":"IF(D9=\"\", \"\", SUM(O9:O18))","v":""}]
[null,"DEDUCTIONS \nEnter as a negative number i.e. -3 or DQ",null,null,null,null,null,null,null,{"$f":"IF(D20=\"\", \"\", IF(D20=\"DQ\",\"DQ\",SUM(D20:I20)))","v":""},null,null,{"$f":"IF(D20=\"\", \"\", IF(D20=\"DQ\",\"DQ\",SUM(D20:I20)))","v":""}]
[null,"TOTALS",null,{"$f":"IF(D20=\"DQ\", \"DQ\",SUM(D19+D20))","v":0},0,0,0,0,0,{"$f":"IF(D9=0, \"\", IF(D20=\"DQ\",\"DQ\",SUM(D21:I21)))","v":""},"/",{"$f":"IF(D9=\"\", \"\", SUM(L9:L18))","v":""},{"$f":"IF(D9=0, \"\", IF(D20=\"DQ\",\"DQ\",SUM(M19:M20)))","v":""},"/",{"$f":"IF(D9=\"\", \"\", SUM(O9:O18))","v":""}]
[]
[null,"KC/T #1","Time:",null,null,null,"Kick Count:",null,null,null,null,null,"# Comp:"]
[null,"KC/T #2","Time:",null,null,null,"Kick Count:",null,null,null,null,null,"# Comp:"]
[null,"KC/T #3","Time:",null,null,null,"Kick Count:",null,null,null,null,null,"# Comp:"]

{"sheet":"Team22","index":26,"n_rows":25,"n_cols":15,"rows_kept":25,"cut":false,"hidden":false,"merged":[[16,1,16,2],[17,1,17,2],[19,1,19,2],[20,1,20,2],[10,1,10,2],[11,1,11,2],[13,1,13,2],[14,1,14,2],[0,0,0,14],[1,0,1,14],[3,2,3,7],[3,8,3,9],[3,10,3,14],[4,2,4,7],[15,0,16,0],[8,0,9,0],[8,1,8,2],[9,1,9,2],[10,0,11,0],[6,10,7,11],[6,0,6,2],[6,9,7,9],[7,0,7,2],[15,1,15,2],[12,0,14,0],[12,1,12,2],[4,8,4,9],[4,10,4,14],[6,12,7,12],[6,13,7,14],[22,3,22,4],[22,8,22,9],[23,3,23,4],[23,8,23,9],[24,3,24,4],[24,8,24,9]]}
["Minnesota State High School League Dance Team Competition"]
["High Kick Judges Recap Sheet"]
[]
[null,"School:",{"$f":"IF('Ranking Sheet'!B33=0, \"\", 'Ranking Sheet'!B33)","v":""},null,null,null,null,null,"Class:",null,{"$f":"IF(Class=0, \"\", Class)","v":""}]
[null,"Meet Site:",{"$f":"IF(Site=0, \"\", Site)","v":""},null,null,null,null,null,"Meet Date:",null,{"$f":"IF(DATE=0, \"\", DATE)","v":""}]
[]
["Judge's Initials → ",null,null,{"$f":"IF('Ranking Sheet'!D10=0, \"\", 'Ranking Sheet'!D10)","v":""},{"$f":"IF('Ranking Sheet'!F10=0, \"\", 'Ranking Sheet'!F10)","v":""},{"$f":"IF('Ranking Sheet'!H10=0, \"\", 'Ranking Sheet'!H10)","v":""},{"$f":"IF('Ranking Sheet'!J10=0, \"\", 'Ranking Sheet'!J10)","v":""},{"$f":"IF('Ranking Sheet'!L10=0, \"\", 'Ranking Sheet'!L10)","v":""},{"$f":"IF('Ranking Sheet'!N10=0, \"\", 'Ranking Sheet'!N10)","v":""},"Category Total Points","Total Points Possible",null,"Subtotal Points","Subtotal Points Possible"]
["Category",null,null,1,2,3,4,5,6]
["KICKS","Technique of Kicks",null,null,null,null,null,null,null,{"$f":"IF(D9=0, \"\", SUM(D9:I9))","v":""},"/",{"$f":"IF(D9=\"\", \"\", IF(I9=0, 50, 60))","v":""}]
[null,"Kick Height",null,null,null,null,null,null,null,"","/","",{"$f":"IF(D9=0, \"\", SUM(D9:I10))","v":""},"/",{"$f":"IF(D9=\"\", \"\", IF(I9=0, 100, 120))","v":""}]
["CHOREOGRAPHY","Creativity",null,null,null,null,null,null,null,"","/",""]
[null,"Visual Effectiveness",null,null,null,null,null,null,null,"","/","",{"$f":"IF(D11=0, \"\", SUM(D11:I12))","v":""},"/",{"$f":"IF(D11=\"\", \"\", IF(I11=0, 100, 120))","v":""}]
["DIFFICULTY","Diffuculty of Routine Choreography",null,null,null,null,null,null,null,"","/",""]
[null,"Difficulty of Formations and Transitions",null,null,null,null,null,null,null,"","/",""]
[null,"Difficulty of Kicks",null,null,null,null,null,null,null,"","/","",{"$f":"IF(D13=0, \"\", SUM(D13:I15))","v":""},"/",{"$f":"IF(D13=\"\", \"\", IF(I13=0,150, 180))","v":""}]
["EXECUTION","Placement & Control",null,null,null,null,null,null,null,"","/",""]
[null,"Degree of Accuracy",null,null,null,null,null,null,null,"","/","",{"$f":"IF(D16=0, \"\", SUM(D16:I17))","v":""},"/",{"$f":"IF(D16=\"\", \"\", IF(I16=0, 100, 120))","v":""}]
["R.E.","Routine Effectiveness",null,null,null,null,null,null,null,"","/","",{"$f":"IF(D18=0, \"\", SUM(D18:I18))","v":""},"/",{"$f":"IF(D18=\"\", \"\", IF(I18=0, 50, 60))","v":""}]
[null,"SUB TOTALS",null,{"$f":"D9+D10+D11+D12+D13+D14+D15+D16+D17+D18","v":0},0,0,0,0,0,{"$f":"IF(D9=0, \"\", SUM(D19:I19))","v":""},"/",{"$f":"IF(D9=\"\", \"\", SUM(L9:L18))","v":""},{"$f":"IF(D9=0, \"\", SUM(M9:M18))","v":""},"/",{"$f":"IF(D9=\"\", \"\", SUM(O9:O18))","v":""}]
[null,"DEDUCTIONS \nEnter as a negative number i.e. -3 or DQ",null,null,null,null,null,null,null,{"$f":"IF(D20=\"\", \"\", IF(D20=\"DQ\",\"DQ\",SUM(D20:I20)))","v":""},null,null,{"$f":"IF(D20=\"\", \"\", IF(D20=\"DQ\",\"DQ\",SUM(D20:I20)))","v":""}]
[null,"TOTALS",null,{"$f":"IF(D20=\"DQ\", \"DQ\",SUM(D19+D20))","v":0},0,0,0,0,0,{"$f":"IF(D9=0, \"\", IF(D20=\"DQ\",\"DQ\",SUM(D21:I21)))","v":""},"/",{"$f":"IF(D9=\"\", \"\", SUM(L9:L18))","v":""},{"$f":"IF(D9=0, \"\", IF(D20=\"DQ\",\"DQ\",SUM(M19:M20)))","v":""},"/",{"$f":"IF(D9=\"\", \"\", SUM(O9:O18))","v":""}]
[]
[null,"KC/T #1","Time:",null,null,null,"Kick Count:",null,null,null,null,null,"# Comp:"]
[null,"KC/T #2","Time:",null,null,null,"Kick Count:",null,null,null,null,null,"# Comp:"]
[null,"KC/T #3","Time:",null,null,null,"Kick Count:",null,null,null,null,null,"# Comp:"]

{"sheet":"Team23","index":27,"n_rows":25,"n_cols":15,"rows_kept":25,"cut":false,"hidden":false,"merged":[[16,1,16,2],[17,1,17,2],[19,1,19,2],[20,1,20,2],[10,1,10,2],[11,1,11,2],[13,1,13,2],[14,1,14,2],[0,0,0,14],[1,0,1,14],[3,2,3,7],[3,8,3,9],[3,10,3,14],[4,2,4,7],[15,0,16,0],[8,0,9,0],[8,1,8,2],[9,1,9,2],[10,0,11,0],[6,10,7,11],[6,0,6,2],[6,9,7,9],[7,0,7,2],[15,1,15,2],[12,0,14,0],[12,1,12,2],[4,8,4,9],[4,10,4,14],[6,12,7,12],[6,13,7,14],[22,3,22,4],[22,8,22,9],[23,3,23,4],[23,8,23,9],[24,3,24,4],[24,8,24,9]]}
["Minnesota State High School League Dance Team Competition"]
["High Kick Judges Recap Sheet"]
[]
[null,"School:",{"$f":"IF('Ranking Sheet'!B34=0, \"\", 'Ranking Sheet'!B34)","v":""},null,null,null,null,null,"Class:",null,{"$f":"IF(Class=0, \"\", Class)","v":""}]
[null,"Meet Site:",{"$f":"IF(Site=0, \"\", Site)","v":""},null,null,null,null,null,"Meet Date:",null,{"$f":"IF(DATE=0, \"\", DATE)","v":""}]
[]
["Judge's Initials → ",null,null,{"$f":"IF('Ranking Sheet'!D10=0, \"\", 'Ranking Sheet'!D10)","v":""},{"$f":"IF('Ranking Sheet'!F10=0, \"\", 'Ranking Sheet'!F10)","v":""},{"$f":"IF('Ranking Sheet'!H10=0, \"\", 'Ranking Sheet'!H10)","v":""},{"$f":"IF('Ranking Sheet'!J10=0, \"\", 'Ranking Sheet'!J10)","v":""},{"$f":"IF('Ranking Sheet'!L10=0, \"\", 'Ranking Sheet'!L10)","v":""},{"$f":"IF('Ranking Sheet'!N10=0, \"\", 'Ranking Sheet'!N10)","v":""},"Category Total Points","Total Points Possible",null,"Subtotal Points","Subtotal Points Possible"]
["Category",null,null,1,2,3,4,5,6]
["KICKS","Technique of Kicks",null,null,null,null,null,null,null,{"$f":"IF(D9=0, \"\", SUM(D9:I9))","v":""},"/",{"$f":"IF(D9=\"\", \"\", IF(I9=0, 50, 60))","v":""}]
[null,"Kick Height",null,null,null,null,null,null,null,"","/","",{"$f":"IF(D9=0, \"\", SUM(D9:I10))","v":""},"/",{"$f":"IF(D9=\"\", \"\", IF(I9=0, 100, 120))","v":""}]
["CHOREOGRAPHY","Creativity",null,null,null,null,null,null,null,"","/",""]
[null,"Visual Effectiveness",null,null,null,null,null,null,null,"","/","",{"$f":"IF(D11=0, \"\", SUM(D11:I12))","v":""},"/",{"$f":"IF(D11=\"\", \"\", IF(I11=0, 100, 120))","v":""}]
["DIFFICULTY","Diffuculty of Routine Choreography",null,null,null,null,null,null,null,"","/",""]
[null,"Difficulty of Formations and Transitions",null,null,null,null,null,null,null,"","/",""]
[null,"Difficulty of Kicks",null,null,null,null,null,null,null,"","/","",{"$f":"IF(D13=0, \"\", SUM(D13:I15))","v":""},"/",{"$f":"IF(D13=\"\", \"\", IF(I13=0,150, 180))","v":""}]
["EXECUTION","Placement & Control",null,null,null,null,null,null,null,"","/",""]
[null,"Degree of Accuracy",null,null,null,null,null,null,null,"","/","",{"$f":"IF(D16=0, \"\", SUM(D16:I17))","v":""},"/",{"$f":"IF(D16=\"\", \"\", IF(I16=0, 100, 120))","v":""}]
["R.E.","Routine Effectiveness",null,null,null,null,null,null,null,"","/","",{"$f":"IF(D18=0, \"\", SUM(D18:I18))","v":""},"/",{"$f":"IF(D18=\"\", \"\", IF(I18=0, 50, 60))","v":""}]
[null,"SUB TOTALS",null,{"$f":"D9+D10+D11+D12+D13+D14+D15+D16+D17+D18","v":0},0,0,0,0,0,{"$f":"IF(D9=0, \"\", SUM(D19:I19))","v":""},"/",{"$f":"IF(D9=\"\", \"\", SUM(L9:L18))","v":""},{"$f":"IF(D9=0, \"\", SUM(M9:M18))","v":""},"/",{"$f":"IF(D9=\"\", \"\", SUM(O9:O18))","v":""}]
[null,"DEDUCTIONS \nEnter as a negative number i.e. -3 or DQ",null,null,null,null,null,null,null,{"$f":"IF(D20=\"\", \"\", IF(D20=\"DQ\",\"DQ\",SUM(D20:I20)))","v":""},null,null,{"$f":"IF(D20=\"\", \"\", IF(D20=\"DQ\",\"DQ\",SUM(D20:I20)))","v":""}]
[null,"TOTALS",null,{"$f":"IF(D20=\"DQ\", \"DQ\",SUM(D19+D20))","v":0},0,0,0,0,0,{"$f":"IF(D9=0, \"\", IF(D20=\"DQ\",\"DQ\",SUM(D21:I21)))","v":""},"/",{"$f":"IF(D9=\"\", \"\", SUM(L9:L18))","v":""},{"$f":"IF(D9=0, \"\", IF(D20=\"DQ\",\"DQ\",SUM(M19:M20)))","v":""},"/",{"$f":"IF(D9=\"\", \"\", SUM(O9:O18))","v":""}]
[]
[null,"KC/T #1","Time:",null,null,null,"Kick Count:",null,null,null,null,null,"# Comp:"]
[null,"KC/T #2","Time:",null,null,null,"Kick Count:",null,null,null,null,null,"# Comp:"]
[null,"KC/T #3","Time:",null,null,null,"Kick Count:",null,null,null,null,null,"# Comp:"]

{"sheet":"Team24","index":28,"n_rows":25,"n_cols":15,"rows_kept":25,"cut":false,"hidden":false,"merged":[[16,1,16,2],[17,1,17,2],[19,1,19,2],[20,1,20,2],[10,1,10,2],[11,1,11,2],[13,1,13,2],[14,1,14,2],[0,0,0,14],[1,0,1,14],[3,2,3,7],[3,8,3,9],[3,10,3,14],[4,2,4,7],[15,0,16,0],[8,0,9,0],[8,1,8,2],[9,1,9,2],[10,0,11,0],[6,10,7,11],[6,0,6,2],[6,9,7,9],[7,0,7,2],[15,1,15,2],[12,0,14,0],[12,1,12,2],[4,8,4,9],[4,10,4,14],[6,12,7,12],[6,13,7,14],[22,3,22,4],[22,8,22,9],[23,3,23,4],[23,8,23,9],[24,3,24,4],[24,8,24,9]]}
["Minnesota State High School League Dance Team Competition"]
["High Kick Judges Recap Sheet"]
[]
[null,"School:",{"$f":"IF('Ranking Sheet'!B35=0, \"\", 'Ranking Sheet'!B35)","v":""},null,null,null,null,null,"Class:",null,{"$f":"IF(Class=0, \"\", Class)","v":""}]
[null,"Meet Site:",{"$f":"IF(Site=0, \"\", Site)","v":""},null,null,null,null,null,"Meet Date:",null,{"$f":"IF(DATE=0, \"\", DATE)","v":""}]
[]
["Judge's Initials → ",null,null,{"$f":"IF('Ranking Sheet'!D10=0, \"\", 'Ranking Sheet'!D10)","v":""},{"$f":"IF('Ranking Sheet'!F10=0, \"\", 'Ranking Sheet'!F10)","v":""},{"$f":"IF('Ranking Sheet'!H10=0, \"\", 'Ranking Sheet'!H10)","v":""},{"$f":"IF('Ranking Sheet'!J10=0, \"\", 'Ranking Sheet'!J10)","v":""},{"$f":"IF('Ranking Sheet'!L10=0, \"\", 'Ranking Sheet'!L10)","v":""},{"$f":"IF('Ranking Sheet'!N10=0, \"\", 'Ranking Sheet'!N10)","v":""},"Category Total Points","Total Points Possible",null,"Subtotal Points","Subtotal Points Possible"]
["Category",null,null,1,2,3,4,5,6]
["KICKS","Technique of Kicks",null,null,null,null,null,null,null,{"$f":"IF(D9=0, \"\", SUM(D9:I9))","v":""},"/",{"$f":"IF(D9=\"\", \"\", IF(I9=0, 50, 60))","v":""}]
[null,"Kick Height",null,null,null,null,null,null,null,"","/","",{"$f":"IF(D9=0, \"\", SUM(D9:I10))","v":""},"/",{"$f":"IF(D9=\"\", \"\", IF(I9=0, 100, 120))","v":""}]
["CHOREOGRAPHY","Creativity",null,null,null,null,null,null,null,"","/",""]
[null,"Visual Effectiveness",null,null,null,null,null,null,null,"","/","",{"$f":"IF(D11=0, \"\", SUM(D11:I12))","v":""},"/",{"$f":"IF(D11=\"\", \"\", IF(I11=0, 100, 120))","v":""}]
["DIFFICULTY","Diffuculty of Routine Choreography",null,null,null,null,null,null,null,"","/",""]
[null,"Difficulty of Formations and Transitions",null,null,null,null,null,null,null,"","/",""]
[null,"Difficulty of Kicks",null,null,null,null,null,null,null,"","/","",{"$f":"IF(D13=0, \"\", SUM(D13:I15))","v":""},"/",{"$f":"IF(D13=\"\", \"\", IF(I13=0,150, 180))","v":""}]
["EXECUTION","Placement & Control",null,null,null,null,null,null,null,"","/",""]
[null,"Degree of Accuracy",null,null,null,null,null,null,null,"","/","",{"$f":"IF(D16=0, \"\", SUM(D16:I17))","v":""},"/",{"$f":"IF(D16=\"\", \"\", IF(I16=0, 100, 120))","v":""}]
["R.E.","Routine Effectiveness",null,null,null,null,null,null,null,"","/","",{"$f":"IF(D18=0, \"\", SUM(D18:I18))","v":""},"/",{"$f":"IF(D18=\"\", \"\", IF(I18=0, 50, 60))","v":""}]
[null,"SUB TOTALS",null,{"$f":"D9+D10+D11+D12+D13+D14+D15+D16+D17+D18","v":0},0,0,0,0,0,{"$f":"IF(D9=0, \"\", SUM(D19:I19))","v":""},"/",{"$f":"IF(D9=\"\", \"\", SUM(L9:L18))","v":""},{"$f":"IF(D9=0, \"\", SUM(M9:M18))","v":""},"/",{"$f":"IF(D9=\"\", \"\", SUM(O9:O18))","v":""}]
[null,"DEDUCTIONS \nEnter as a negative number i.e. -3 or DQ",null,null,null,null,null,null,null,{"$f":"IF(D20=\"\", \"\", IF(D20=\"DQ\",\"DQ\",SUM(D20:I20)))","v":""},null,null,{"$f":"IF(D20=\"\", \"\", IF(D20=\"DQ\",\"DQ\",SUM(D20:I20)))","v":""}]
[null,"TOTALS",null,{"$f":"IF(D20=\"DQ\", \"DQ\",SUM(D19+D20))","v":0},0,0,0,0,0,{"$f":"IF(D9=0, \"\", IF(D20=\"DQ\",\"DQ\",SUM(D21:I21)))","v":""},"/",{"$f":"IF(D9=\"\", \"\", SUM(L9:L18))","v":""},{"$f":"IF(D9=0, \"\", IF(D20=\"DQ\",\"DQ\",SUM(M19:M20)))","v":""},"/",{"$f":"IF(D9=\"\", \"\", SUM(O9:O18))","v":""}]
[]
[null,"KC/T #1","Time:",null,null,null,"Kick Count:",null,null,null,null,null,"# Comp:"]
[null,"KC/T #2","Time:",null,null,null,"Kick Count:",null,null,null,null,null,"# Comp:"]
[null,"KC/T #3","Time:",null,null,null,"Kick Count:",null,null,null,null,null,"# Comp:"]

{"sheet":"Tie-Breaker Sheet","index":29,"n_rows":37,"n_cols":11,"rows_kept":37,"cut":false,"hidden":false,"merged":[[17,1,17,2],[27,1,27,2],[26,1,26,2],[36,0,36,2],[36,6,36,7],[30,1,30,2],[31,1,31,2],[32,1,32,2],[33,1,33,2],[34,1,34,2],[25,1,25,2],[29,1,29,2],[18,1,18,2],[19,1,19,2],[20,1,20,2],[21,1,21,2],[6,10,10,10],[13,1,13,2],[14,1,14,2],[15,1,15,2],[16,1,16,2],[28,1,28,2],[6,4,6,9],[22,1,22,2],[23,1,23,2],[24,1,24,2],[7,6,7,7],[6,3,10,3],[12,1,12,2],[8,4,10,4],[8,5,10,5],[9,0,9,2],[10,0,10,2],[11,1,11,2],[8,6,10,6],[8,7,10,7],[7,8,7,9],[6,0,8,2],[8,8,10,8],[8,9,10,9],[1,0,1,1],[3,0,3,10],[4,0,4,10],[1,9,1,10],[1,4,1,6],[7,4,7,5]]}
[]
["MEET DATE",null,{"$f":"IF(DATE=0, \"\", DATE)","v":""},"MEET SITE",{"$f":"IF(Site=0, \"\", Site)","v":""},null,null,"CLASS",{"$f":"IF(Class=0, \"\", Class)","v":""},{"$f":"CATEGORY","v":"High Kick Category"}]
[]
["Minnesota State High School League Dance Team Competition"]
["State and Section Competition - Tie-Breaker Rank B Sheet"]
[]
[null,null,null,"Subtotal Final Placement Before Extra\nTie-breakers","Tie-Breakers",null,null,null,null,null,"Tie-Breaker Final\nPlace"]
[null,null,null,null,"3rd Tie Break",null,"4th Tie Break",null,"5th Tie Break"]
[null,null,null,null,"Total Points","New Total Rank","Superior Judges Rank","New Total Rank","Total of All Judges Rank minus Superior Judge Rank","New Total Rank"]
[]
["School"]
[1,{"$f":"IF(Team1=0, \"\", Team1)","v":""},null,{"$f":"IF('Rank Wkst'!AG8<>0, 'Rank Wkst'!BK8, \"\")","v":""},{"$f":"IF(AND('Rank Wkst'!BF8>1, 'Rank Wkst'!C8<>\"DQ\"), 'Rank Wkst'!CD8, \"\")","v":""},{"$f":"IF(AND('Rank Wkst'!BF8>1,'Rank Wkst'!C8<>\"DQ\"), 'Rank Wkst'!CH8, \"\")","v":""},{"$f":"IF(AND('Rank Wkst'!CF8>1, 'Rank Wkst'!C8<>\"DQ\"), 'Rank Wkst'!CJ8, \"\")","v":""},{"$f":"IF(AND('Rank Wkst'!CF8>1,'Rank Wkst'!C8<>\"DQ\"), 'Rank Wkst'!CN8, \"\")","v":""},{"$f":"IF(AND('Rank Wkst'!CL8>1, 'Rank Wkst'!C8<>\"DQ\"), 'Rank Wkst'!CQ8, \"\")","v":""},{"$f":"IF(AND('Rank Wkst'!CL8>1,'Rank Wkst'!C8<>\"DQ\"), 'Rank Wkst'!CU8, \"\")","v":""},{"$f":"IF('Rank Wkst'!AG8<>0,'Rank Wkst'!CX8,\"\")","v":""}]
[2,{"$f":"IF(Team2=0, \"\", Team2)","v":""},null,{"$f":"IF('Rank Wkst'!AG9<>0, 'Rank Wkst'!BK9, \"\")","v":""},{"$f":"IF(AND('Rank Wkst'!BF9>1, 'Rank Wkst'!C9<>\"DQ\"), 'Rank Wkst'!CD9, \"\")","v":""},{"$f":"IF(AND('Rank Wkst'!BF9>1,'Rank Wkst'!C9<>\"DQ\"), 'Rank Wkst'!CH9, \"\")","v":""},{"$f":"IF(AND('Rank Wkst'!CF9>1, 'Rank Wkst'!C9<>\"DQ\"), 'Rank Wkst'!CJ9, \"\")","v":""},{"$f":"IF(AND('Rank Wkst'!CF9>1,'Rank Wkst'!C9<>\"DQ\"), 'Rank Wkst'!CN9, \"\")","v":""},{"$f":"IF(AND('Rank Wkst'!CL9>1, 'Rank Wkst'!C9<>\"DQ\"), 'Rank Wkst'!CQ9, \"\")","v":""},{"$f":"IF(AND('Rank Wkst'!CL9>1,'Rank Wkst'!C9<>\"DQ\"), 'Rank Wkst'!CU9, \"\")","v":""},{"$f":"IF('Rank Wkst'!AG9<>0,'Rank Wkst'!CX9,\"\")","v":""}]
[3,{"$f":"IF(Team3=0, \"\", Team3)","v":""},null,{"$f":"IF('Rank Wkst'!AG10<>0, 'Rank Wkst'!BK10, \"\")","v":""},{"$f":"IF(AND('Rank Wkst'!BF10>1, 'Rank Wkst'!C10<>\"DQ\"), 'Rank Wkst'!CD10, \"\")","v":""},{"$f":"IF(AND('Rank Wkst'!BF10>1,'Rank Wkst'!C10<>\"DQ\"), 'Rank Wkst'!CH10, \"\")","v":""},{"$f":"IF(AND('Rank Wkst'!CF10>1, 'Rank Wkst'!C10<>\"DQ\"), 'Rank Wkst'!CJ10, \"\")","v":""},{"$f":"IF(AND('Rank Wkst'!CF10>1,'Rank Wkst'!C10<>\"DQ\"), 'Rank Wkst'!CN10, \"\")","v":""},{"$f":"IF(AND('Rank Wkst'!CL10>1, 'Rank Wkst'!C10<>\"DQ\"), 'Rank Wkst'!CQ10, \"\")","v":""},{"$f":"IF(AND('Rank Wkst'!CL10>1,'Rank Wkst'!C10<>\"DQ\"), 'Rank Wkst'!CU10, \"\")","v":""},{"$f":"IF('Rank Wkst'!AG10<>0,'Rank Wkst'!CX10,\"\")","v":""}]
[4,{"$f":"IF(Team4=0, \"\", Team4)","v":""},null,{"$f":"IF('Rank Wkst'!AG11<>0, 'Rank Wkst'!BK11, \"\")","v":""},{"$f":"IF(AND('Rank Wkst'!BF11>1, 'Rank Wkst'!C11<>\"DQ\"), 'Rank Wkst'!CD11, \"\")","v":""},{"$f":"IF(AND('Rank Wkst'!BF11>1,'Rank Wkst'!C11<>\"DQ\"), 'Rank Wkst'!CH11, \"\")","v":""},{"$f":"IF(AND('Rank Wkst'!CF11>1, 'Rank Wkst'!C11<>\"DQ\"), 'Rank Wkst'!CJ11, \"\")","v":""},{"$f":"IF(AND('Rank Wkst'!CF11>1,'Rank Wkst'!C11<>\"DQ\"), 'Rank Wkst'!CN11, \"\")","v":""},{"$f":"IF(AND('Rank Wkst'!CL11>1, 'Rank Wkst'!C11<>\"DQ\"), 'Rank Wkst'!CQ11, \"\")","v":""},{"$f":"IF(AND('Rank Wkst'!CL11>1,'Rank Wkst'!C11<>\"DQ\"), 'Rank Wkst'!CU11, \"\")","v":""},{"$f":"IF('Rank Wkst'!AG11<>0,'Rank Wkst'!CX11,\"\")","v":""}]
[5,{"$f":"IF(Team5=0, \"\", Team5)","v":""},null,{"$f":"IF('Rank Wkst'!AG12<>0, 'Rank Wkst'!BK12, \"\")","v":""},{"$f":"IF(AND('Rank Wkst'!BF12>1, 'Rank Wkst'!C12<>\"DQ\"), 'Rank Wkst'!CD12, \"\")","v":""},{"$f":"IF(AND('Rank Wkst'!BF12>1,'Rank Wkst'!C12<>\"DQ\"), 'Rank Wkst'!CH12, \"\")","v":""},{"$f":"IF(AND('Rank Wkst'!CF12>1, 'Rank Wkst'!C12<>\"DQ\"), 'Rank Wkst'!CJ12, \"\")","v":""},{"$f":"IF(AND('Rank Wkst'!CF12>1,'Rank Wkst'!C12<>\"DQ\"), 'Rank Wkst'!CN12, \"\")","v":""},{"$f":"IF(AND('Rank Wkst'!CL12>1, 'Rank Wkst'!C12<>\"DQ\"), 'Rank Wkst'!CQ12, \"\")","v":""},{"$f":"IF(AND('Rank Wkst'!CL12>1,'Rank Wkst'!C12<>\"DQ\"), 'Rank Wkst'!CU12, \"\")","v":""},{"$f":"IF('Rank Wkst'!AG12<>0,'Rank Wkst'!CX12,\"\")","v":""}]
[6,{"$f":"IF(Team6=0, \"\", Team6)","v":""},null,{"$f":"IF('Rank Wkst'!AG13<>0, 'Rank Wkst'!BK13, \"\")","v":""},{"$f":"IF(AND('Rank Wkst'!BF13>1, 'Rank Wkst'!C13<>\"DQ\"), 'Rank Wkst'!CD13, \"\")","v":""},{"$f":"IF(AND('Rank Wkst'!BF13>1,'Rank Wkst'!C13<>\"DQ\"), 'Rank Wkst'!CH13, \"\")","v":""},{"$f":"IF(AND('Rank Wkst'!CF13>1, 'Rank Wkst'!C13<>\"DQ\"), 'Rank Wkst'!CJ13, \"\")","v":""},{"$f":"IF(AND('Rank Wkst'!CF13>1,'Rank Wkst'!C13<>\"DQ\"), 'Rank Wkst'!CN13, \"\")","v":""},{"$f":"IF(AND('Rank Wkst'!CL13>1, 'Rank Wkst'!C13<>\"DQ\"), 'Rank Wkst'!CQ13, \"\")","v":""},{"$f":"IF(AND('Rank Wkst'!CL13>1,'Rank Wkst'!C13<>\"DQ\"), 'Rank Wkst'!CU13, \"\")","v":""},{"$f":"IF('Rank Wkst'!AG13<>0,'Rank Wkst'!CX13,\"\")","v":""}]
[7,{"$f":"IF(Team7=0, \"\", Team7)","v":""},null,{"$f":"IF('Rank Wkst'!AG14<>0, 'Rank Wkst'!BK14, \"\")","v":""},{"$f":"IF(AND('Rank Wkst'!BF14>1, 'Rank Wkst'!C14<>\"DQ\"), 'Rank Wkst'!CD14, \"\")","v":""},{"$f":"IF(AND('Rank Wkst'!BF14>1,'Rank Wkst'!C14<>\"DQ\"), 'Rank Wkst'!CH14, \"\")","v":""},{"$f":"IF(AND('Rank Wkst'!CF14>1, 'Rank Wkst'!C14<>\"DQ\"), 'Rank Wkst'!CJ14, \"\")","v":""},{"$f":"IF(AND('Rank Wkst'!CF14>1,'Rank Wkst'!C14<>\"DQ\"), 'Rank Wkst'!CN14, \"\")","v":""},{"$f":"IF(AND('Rank Wkst'!CL14>1, 'Rank Wkst'!C14<>\"DQ\"), 'Rank Wkst'!CQ14, \"\")","v":""},{"$f":"IF(AND('Rank Wkst'!CL14>1,'Rank Wkst'!C14<>\"DQ\"), 'Rank Wkst'!CU14, \"\")","v":""},{"$f":"IF('Rank Wkst'!AG14<>0,'Rank Wkst'!CX14,\"\")","v":""}]
[8,{"$f":"IF(Team8=0, \"\", Team8)","v":""},null,{"$f":"IF('Rank Wkst'!AG15<>0, 'Rank Wkst'!BK15, \"\")","v":""},{"$f":"IF(AND('Rank Wkst'!BF15>1, 'Rank Wkst'!C15<>\"DQ\"), 'Rank Wkst'!CD15, \"\")","v":""},{"$f":"IF(AND('Rank Wkst'!BF15>1,'Rank Wkst'!C15<>\"DQ\"), 'Rank Wkst'!CH15, \"\")","v":""},{"$f":"IF(AND('Rank Wkst'!CF15>1, 'Rank Wkst'!C15<>\"DQ\"), 'Rank Wkst'!CJ15, \"\")","v":""},{"$f":"IF(AND('Rank Wkst'!CF15>1,'Rank Wkst'!C15<>\"DQ\"), 'Rank Wkst'!CN15, \"\")","v":""},{"$f":"IF(AND('Rank Wkst'!CL15>1, 'Rank Wkst'!C15<>\"DQ\"), 'Rank Wkst'!CQ15, \"\")","v":""},{"$f":"IF(AND('Rank Wkst'!CL15>1,'Rank Wkst'!C15<>\"DQ\"), 'Rank Wkst'!CU15, \"\")","v":""},{"$f":"IF('Rank Wkst'!AG15<>0,'Rank Wkst'!CX15,\"\")","v":""}]
[9,{"$f":"IF(Team9=0, \"\", Team9)","v":""},null,{"$f":"IF('Rank Wkst'!AG16<>0, 'Rank Wkst'!BK16, \"\")","v":""},{"$f":"IF(AND('Rank Wkst'!BF16>1, 'Rank Wkst'!C16<>\"DQ\"), 'Rank Wkst'!CD16, \"\")","v":""},{"$f":"IF(AND('Rank Wkst'!BF16>1,'Rank Wkst'!C16<>\"DQ\"), 'Rank Wkst'!CH16, \"\")","v":""},{"$f":"IF(AND('Rank Wkst'!CF16>1, 'Rank Wkst'!C16<>\"DQ\"), 'Rank Wkst'!CJ16, \"\")","v":""},{"$f":"IF(AND('Rank Wkst'!CF16>1,'Rank Wkst'!C16<>\"DQ\"), 'Rank Wkst'!CN16, \"\")","v":""},{"$f":"IF(AND('Rank Wkst'!CL16>1, 'Rank Wkst'!C16<>\"DQ\"), 'Rank Wkst'!CQ16, \"\")","v":""},{"$f":"IF(AND('Rank Wkst'!CL16>1,'Rank Wkst'!C16<>\"DQ\"), 'Rank Wkst'!CU16, \"\")","v":""},{"$f":"IF('Rank Wkst'!AG16<>0,'Rank Wkst'!CX16,\"\")","v":""}]
[10,{"$f":"IF(Team10=0, \"\", Team10)","v":""},null,{"$f":"IF('Rank Wkst'!AG17<>0, 'Rank Wkst'!BK17, \"\")","v":""},{"$f":"IF(AND('Rank Wkst'!BF17>1, 'Rank Wkst'!C17<>\"DQ\"), 'Rank Wkst'!CD17, \"\")","v":""},{"$f":"IF(AND('Rank Wkst'!BF17>1,'Rank Wkst'!C17<>\"DQ\"), 'Rank Wkst'!CH17, \"\")","v":""},{"$f":"IF(AND('Rank Wkst'!CF17>1, 'Rank Wkst'!C17<>\"DQ\"), 'Rank Wkst'!CJ17, \"\")","v":""},{"$f":"IF(AND('Rank Wkst'!CF17>1,'Rank Wkst'!C17<>\"DQ\"), 'Rank Wkst'!CN17, \"\")","v":""},{"$f":"IF(AND('Rank Wkst'!CL17>1, 'Rank Wkst'!C17<>\"DQ\"), 'Rank Wkst'!CQ17, \"\")","v":""},{"$f":"IF(AND('Rank Wkst'!CL17>1,'Rank Wkst'!C17<>\"DQ\"), 'Rank Wkst'!CU17, \"\")","v":""},{"$f":"IF('Rank Wkst'!AG17<>0,'Rank Wkst'!CX17,\"\")","v":""}]
[11,{"$f":"IF(Team11=0, \"\", Team11)","v":""},null,{"$f":"IF('Rank Wkst'!AG18<>0, 'Rank Wkst'!BK18, \"\")","v":""},{"$f":"IF(AND('Rank Wkst'!BF18>1, 'Rank Wkst'!C18<>\"DQ\"), 'Rank Wkst'!CD18, \"\")","v":""},{"$f":"IF(AND('Rank Wkst'!BF18>1,'Rank Wkst'!C18<>\"DQ\"), 'Rank Wkst'!CH18, \"\")","v":""},{"$f":"IF(AND('Rank Wkst'!CF18>1, 'Rank Wkst'!C18<>\"DQ\"), 'Rank Wkst'!CJ18, \"\")","v":""},{"$f":"IF(AND('Rank Wkst'!CF18>1,'Rank Wkst'!C18<>\"DQ\"), 'Rank Wkst'!CN18, \"\")","v":""},{"$f":"IF(AND('Rank Wkst'!CL18>1, 'Rank Wkst'!C18<>\"DQ\"), 'Rank Wkst'!CQ18, \"\")","v":""},{"$f":"IF(AND('Rank Wkst'!CL18>1,'Rank Wkst'!C18<>\"DQ\"), 'Rank Wkst'!CU18, \"\")","v":""},{"$f":"IF('Rank Wkst'!AG18<>0,'Rank Wkst'!CX18,\"\")","v":""}]
[12,{"$f":"IF(Team12=0, \"\", Team12)","v":""},null,{"$f":"IF('Rank Wkst'!AG19<>0, 'Rank Wkst'!BK19, \"\")","v":""},{"$f":"IF(AND('Rank Wkst'!BF19>1, 'Rank Wkst'!C19<>\"DQ\"), 'Rank Wkst'!CD19, \"\")","v":""},{"$f":"IF(AND('Rank Wkst'!BF19>1,'Rank Wkst'!C19<>\"DQ\"), 'Rank Wkst'!CH19, \"\")","v":""},{"$f":"IF(AND('Rank Wkst'!CF19>1, 'Rank Wkst'!C19<>\"DQ\"), 'Rank Wkst'!CJ19, \"\")","v":""},{"$f":"IF(AND('Rank Wkst'!CF19>1,'Rank Wkst'!C19<>\"DQ\"), 'Rank Wkst'!CN19, \"\")","v":""},{"$f":"IF(AND('Rank Wkst'!CL19>1, 'Rank Wkst'!C19<>\"DQ\"), 'Rank Wkst'!CQ19, \"\")","v":""},{"$f":"IF(AND('Rank Wkst'!CL19>1,'Rank Wkst'!C19<>\"DQ\"), 'Rank Wkst'!CU19, \"\")","v":""},{"$f":"IF('Rank Wkst'!AG19<>0,'Rank Wkst'!CX19,\"\")","v":""}]
[13,{"$f":"IF(Team13=0, \"\", Team13)","v":""},null,{"$f":"IF('Rank Wkst'!AG20<>0, 'Rank Wkst'!BK20, \"\")","v":""},{"$f":"IF(AND('Rank Wkst'!BF20>1, 'Rank Wkst'!C20<>\"DQ\"), 'Rank Wkst'!CD20, \"\")","v":""},{"$f":"IF(AND('Rank Wkst'!BF20>1,'Rank Wkst'!C20<>\"DQ\"), 'Rank Wkst'!CH20, \"\")","v":""},{"$f":"IF(AND('Rank Wkst'!CF20>1, 'Rank Wkst'!C20<>\"DQ\"), 'Rank Wkst'!CJ20, \"\")","v":""},{"$f":"IF(AND('Rank Wkst'!CF20>1,'Rank Wkst'!C20<>\"DQ\"), 'Rank Wkst'!CN20, \"\")","v":""},{"$f":"IF(AND('Rank Wkst'!CL20>1, 'Rank Wkst'!C20<>\"DQ\"), 'Rank Wkst'!CQ20, \"\")","v":""},{"$f":"IF(AND('Rank Wkst'!CL20>1,'Rank Wkst'!C20<>\"DQ\"), 'Rank Wkst'!CU20, \"\")","v":""},{"$f":"IF('Rank Wkst'!AG20<>0,'Rank Wkst'!CX20,\"\")","v":""}]
[14,{"$f":"IF(Team14=0, \"\", Team14)","v":""},null,{"$f":"IF('Rank Wkst'!AG21<>0, 'Rank Wkst'!BK21, \"\")","v":""},{"$f":"IF(AND('Rank Wkst'!BF21>1, 'Rank Wkst'!C21<>\"DQ\"), 'Rank Wkst'!CD21, \"\")","v":""},{"$f":"IF(AND('Rank Wkst'!BF21>1,'Rank Wkst'!C21<>\"DQ\"), 'Rank Wkst'!CH21, \"\")","v":""},{"$f":"IF(AND('Rank Wkst'!CF21>1, 'Rank Wkst'!C21<>\"DQ\"), 'Rank Wkst'!CJ21, \"\")","v":""},{"$f":"IF(AND('Rank Wkst'!CF21>1,'Rank Wkst'!C21<>\"DQ\"), 'Rank Wkst'!CN21, \"\")","v":""},{"$f":"IF(AND('Rank Wkst'!CL21>1, 'Rank Wkst'!C21<>\"DQ\"), 'Rank Wkst'!CQ21, \"\")","v":""},{"$f":"IF(AND('Rank Wkst'!CL21>1,'Rank Wkst'!C21<>\"DQ\"), 'Rank Wkst'!CU21, \"\")","v":""},{"$f":"IF('Rank Wkst'!AG21<>0,'Rank Wkst'!CX21,\"\")","v":""}]
[15,{"$f":"IF(Team15=0, \"\", Team15)","v":""},null,{"$f":"IF('Rank Wkst'!AG22<>0, 'Rank Wkst'!BK22, \"\")","v":""},{"$f":"IF(AND('Rank Wkst'!BF22>1, 'Rank Wkst'!C22<>\"DQ\"), 'Rank Wkst'!CD22, \"\")","v":""},{"$f":"IF(AND('Rank Wkst'!BF22>1,'Rank Wkst'!C22<>\"DQ\"), 'Rank Wkst'!CH22, \"\")","v":""},{"$f":"IF(AND('Rank Wkst'!CF22>1, 'Rank Wkst'!C22<>\"DQ\"), 'Rank Wkst'!CJ22, \"\")","v":""},{"$f":"IF(AND('Rank Wkst'!CF22>1,'Rank Wkst'!C22<>\"DQ\"), 'Rank Wkst'!CN22, \"\")","v":""},{"$f":"IF(AND('Rank Wkst'!CL22>1, 'Rank Wkst'!C22<>\"DQ\"), 'Rank Wkst'!CQ22, \"\")","v":""},{"$f":"IF(AND('Rank Wkst'!CL22>1,'Rank Wkst'!C22<>\"DQ\"), 'Rank Wkst'!CU22, \"\")","v":""},{"$f":"IF('Rank Wkst'!AG22<>0,'Rank Wkst'!CX22,\"\")","v":""}]
[16,{"$f":"IF(Team16=0, \"\", Team16)","v":""},null,{"$f":"IF('Rank Wkst'!AG23<>0, 'Rank Wkst'!BK23, \"\")","v":""},{"$f":"IF(AND('Rank Wkst'!BF23>1, 'Rank Wkst'!C23<>\"DQ\"), 'Rank Wkst'!CD23, \"\")","v":""},{"$f":"IF(AND('Rank Wkst'!BF23>1,'Rank Wkst'!C23<>\"DQ\"), 'Rank Wkst'!CH23, \"\")","v":""},{"$f":"IF(AND('Rank Wkst'!CF23>1, 'Rank Wkst'!C23<>\"DQ\"), 'Rank Wkst'!CJ23, \"\")","v":""},{"$f":"IF(AND('Rank Wkst'!CF23>1,'Rank Wkst'!C23<>\"DQ\"), 'Rank Wkst'!CN23, \"\")","v":""},{"$f":"IF(AND('Rank Wkst'!CL23>1, 'Rank Wkst'!C23<>\"DQ\"), 'Rank Wkst'!CQ23, \"\")","v":""},{"$f":"IF(AND('Rank Wkst'!CL23>1,'Rank Wkst'!C23<>\"DQ\"), 'Rank Wkst'!CU23, \"\")","v":""},{"$f":"IF('Rank Wkst'!AG23<>0,'Rank Wkst'!CX23,\"\")","v":""}]
[17,{"$f":"IF(Team17=0, \"\", Team17)","v":""},null,{"$f":"IF('Rank Wkst'!AG24<>0, 'Rank Wkst'!BK24, \"\")","v":""},{"$f":"IF(AND('Rank Wkst'!BF24>1, 'Rank Wkst'!C24<>\"DQ\"), 'Rank Wkst'!CD24, \"\")","v":""},{"$f":"IF(AND('Rank Wkst'!BF24>1,'Rank Wkst'!C24<>\"DQ\"), 'Rank Wkst'!CH24, \"\")","v":""},{"$f":"IF(AND('Rank Wkst'!CF24>1, 'Rank Wkst'!C24<>\"DQ\"), 'Rank Wkst'!CJ24, \"\")","v":""},{"$f":"IF(AND('Rank Wkst'!CF24>1,'Rank Wkst'!C24<>\"DQ\"), 'Rank Wkst'!CN24, \"\")","v":""},{"$f":"IF(AND('Rank Wkst'!CL24>1, 'Rank Wkst'!C24<>\"DQ\"), 'Rank Wkst'!CQ24, \"\")","v":""},{"$f":"IF(AND('Rank Wkst'!CL24>1,'Rank Wkst'!C24<>\"DQ\"), 'Rank Wkst'!CU24, \"\")","v":""},{"$f":"IF('Rank Wkst'!AG24<>0,'Rank Wkst'!CX24,\"\")","v":""}]
[18,{"$f":"IF(Team18=0, \"\", Team18)","v":""},null,{"$f":"IF('Rank Wkst'!AG25<>0, 'Rank Wkst'!BK25, \"\")","v":""},{"$f":"IF(AND('Rank Wkst'!BF25>1, 'Rank Wkst'!C25<>\"DQ\"), 'Rank Wkst'!CD25, \"\")","v":""},{"$f":"IF(AND('Rank Wkst'!BF25>1,'Rank Wkst'!C25<>\"DQ\"), 'Rank Wkst'!CH25, \"\")","v":""},{"$f":"IF(AND('Rank Wkst'!CF25>1, 'Rank Wkst'!C25<>\"DQ\"), 'Rank Wkst'!CJ25, \"\")","v":""},{"$f":"IF(AND('Rank Wkst'!CF25>1,'Rank Wkst'!C25<>\"DQ\"), 'Rank Wkst'!CN25, \"\")","v":""},{"$f":"IF(AND('Rank Wkst'!CL25>1, 'Rank Wkst'!C25<>\"DQ\"), 'Rank Wkst'!CQ25, \"\")","v":""},{"$f":"IF(AND('Rank Wkst'!CL25>1,'Rank Wkst'!C25<>\"DQ\"), 'Rank Wkst'!CU25, \"\")","v":""},{"$f":"IF('Rank Wkst'!AG25<>0,'Rank Wkst'!CX25,\"\")","v":""}]
[19,{"$f":"IF(Team19=0, \"\", Team19)","v":""},null,{"$f":"IF('Rank Wkst'!AG26<>0, 'Rank Wkst'!BK26, \"\")","v":""},{"$f":"IF(AND('Rank Wkst'!BF26>1, 'Rank Wkst'!C26<>\"DQ\"), 'Rank Wkst'!CD26, \"\")","v":""},{"$f":"IF(AND('Rank Wkst'!BF26>1,'Rank Wkst'!C26<>\"DQ\"), 'Rank Wkst'!CH26, \"\")","v":""},{"$f":"IF(AND('Rank Wkst'!CF26>1, 'Rank Wkst'!C26<>\"DQ\"), 'Rank Wkst'!CJ26, \"\")","v":""},{"$f":"IF(AND('Rank Wkst'!CF26>1,'Rank Wkst'!C26<>\"DQ\"), 'Rank Wkst'!CN26, \"\")","v":""},{"$f":"IF(AND('Rank Wkst'!CL26>1, 'Rank Wkst'!C26<>\"DQ\"), 'Rank Wkst'!CQ26, \"\")","v":""},{"$f":"IF(AND('Rank Wkst'!CL26>1,'Rank Wkst'!C26<>\"DQ\"), 'Rank Wkst'!CU26, \"\")","v":""},{"$f":"IF('Rank Wkst'!AG26<>0,'Rank Wkst'!CX26,\"\")","v":""}]
[20,{"$f":"IF(Team20=0, \"\", Team20)","v":""},null,{"$f":"IF('Rank Wkst'!AG27<>0, 'Rank Wkst'!BK27, \"\")","v":""},{"$f":"IF(AND('Rank Wkst'!BF27>1, 'Rank Wkst'!C27<>\"DQ\"), 'Rank Wkst'!CD27, \"\")","v":""},{"$f":"IF(AND('Rank Wkst'!BF27>1,'Rank Wkst'!C27<>\"DQ\"), 'Rank Wkst'!CH27, \"\")","v":""},{"$f":"IF(AND('Rank Wkst'!CF27>1, 'Rank Wkst'!C27<>\"DQ\"), 'Rank Wkst'!CJ27, \"\")","v":""},{"$f":"IF(AND('Rank Wkst'!CF27>1,'Rank Wkst'!C27<>\"DQ\"), 'Rank Wkst'!CN27, \"\")","v":""},{"$f":"IF(AND('Rank Wkst'!CL27>1, 'Rank Wkst'!C27<>\"DQ\"), 'Rank Wkst'!CQ27, \"\")","v":""},{"$f":"IF(AND('Rank Wkst'!CL27>1,'Rank Wkst'!C27<>\"DQ\"), 'Rank Wkst'!CU27, \"\")","v":""},{"$f":"IF('Rank Wkst'!AG27<>0,'Rank Wkst'!CX27,\"\")","v":""}]
[21,{"$f":"IF(Team21=0, \"\", Team21)","v":""},null,{"$f":"IF('Rank Wkst'!AG28<>0, 'Rank Wkst'!BK28, \"\")","v":""},{"$f":"IF(AND('Rank Wkst'!BF28>1, 'Rank Wkst'!C28<>\"DQ\"), 'Rank Wkst'!CD28, \"\")","v":""},{"$f":"IF(AND('Rank Wkst'!BF28>1,'Rank Wkst'!C28<>\"DQ\"), 'Rank Wkst'!CH28, \"\")","v":""},{"$f":"IF(AND('Rank Wkst'!CF28>1, 'Rank Wkst'!C28<>\"DQ\"), 'Rank Wkst'!CJ28, \"\")","v":""},{"$f":"IF(AND('Rank Wkst'!CF28>1,'Rank Wkst'!C28<>\"DQ\"), 'Rank Wkst'!CN28, \"\")","v":""},{"$f":"IF(AND('Rank Wkst'!CL28>1, 'Rank Wkst'!C28<>\"DQ\"), 'Rank Wkst'!CQ28, \"\")","v":""},{"$f":"IF(AND('Rank Wkst'!CL28>1,'Rank Wkst'!C28<>\"DQ\"), 'Rank Wkst'!CU28, \"\")","v":""},{"$f":"IF('Rank Wkst'!AG28<>0,'Rank Wkst'!CX28,\"\")","v":""}]
[22,{"$f":"IF(Team22=0, \"\", Team22)","v":""},null,{"$f":"IF('Rank Wkst'!AG29<>0, 'Rank Wkst'!BK29, \"\")","v":""},{"$f":"IF(AND('Rank Wkst'!BF29>1, 'Rank Wkst'!C29<>\"DQ\"), 'Rank Wkst'!CD29, \"\")","v":""},{"$f":"IF(AND('Rank Wkst'!BF29>1,'Rank Wkst'!C29<>\"DQ\"), 'Rank Wkst'!CH29, \"\")","v":""},{"$f":"IF(AND('Rank Wkst'!CF29>1, 'Rank Wkst'!C29<>\"DQ\"), 'Rank Wkst'!CJ29, \"\")","v":""},{"$f":"IF(AND('Rank Wkst'!CF29>1,'Rank Wkst'!C29<>\"DQ\"), 'Rank Wkst'!CN29, \"\")","v":""},{"$f":"IF(AND('Rank Wkst'!CL29>1, 'Rank Wkst'!C29<>\"DQ\"), 'Rank Wkst'!CQ29, \"\")","v":""},{"$f":"IF(AND('Rank Wkst'!CL29>1,'Rank Wkst'!C29<>\"DQ\"), 'Rank Wkst'!CU29, \"\")","v":""},{"$f":"IF('Rank Wkst'!AG29<>0,'Rank Wkst'!CX29,\"\")","v":""}]
[23,{"$f":"IF(Team23=0, \"\", Team23)","v":""},null,{"$f":"IF('Rank Wkst'!AG30<>0, 'Rank Wkst'!BK30, \"\")","v":""},{"$f":"IF(AND('Rank Wkst'!BF30>1, 'Rank Wkst'!C30<>\"DQ\"), 'Rank Wkst'!CD30, \"\")","v":""},{"$f":"IF(AND('Rank Wkst'!BF30>1,'Rank Wkst'!C30<>\"DQ\"), 'Rank Wkst'!CH30, \"\")","v":""},{"$f":"IF(AND('Rank Wkst'!CF30>1, 'Rank Wkst'!C30<>\"DQ\"), 'Rank Wkst'!CJ30, \"\")","v":""},{"$f":"IF(AND('Rank Wkst'!CF30>1,'Rank Wkst'!C30<>\"DQ\"), 'Rank Wkst'!CN30, \"\")","v":""},{"$f":"IF(AND('Rank Wkst'!CL30>1, 'Rank Wkst'!C30<>\"DQ\"), 'Rank Wkst'!CQ30, \"\")","v":""},{"$f":"IF(AND('Rank Wkst'!CL30>1,'Rank Wkst'!C30<>\"DQ\"), 'Rank Wkst'!CU30, \"\")","v":""},{"$f":"IF('Rank Wkst'!AG30<>0,'Rank Wkst'!CX30,\"\")","v":""}]
[24,{"$f":"IF(Team24=0, \"\", Team24)","v":""},null,{"$f":"IF('Rank Wkst'!AG31<>0, 'Rank Wkst'!BK31, \"\")","v":""},{"$f":"IF(AND('Rank Wkst'!BF31>1, 'Rank Wkst'!C31<>\"DQ\"), 'Rank Wkst'!CD31, \"\")","v":""},{"$f":"IF(AND('Rank Wkst'!BF31>1,'Rank Wkst'!C31<>\"DQ\"), 'Rank Wkst'!CH31, \"\")","v":""},{"$f":"IF(AND('Rank Wkst'!CF31>1, 'Rank Wkst'!C31<>\"DQ\"), 'Rank Wkst'!CJ31, \"\")","v":""},{"$f":"IF(AND('Rank Wkst'!CF31>1,'Rank Wkst'!C31<>\"DQ\"), 'Rank Wkst'!CN31, \"\")","v":""},{"$f":"IF(AND('Rank Wkst'!CL31>1, 'Rank Wkst'!C31<>\"DQ\"), 'Rank Wkst'!CQ31, \"\")","v":""},{"$f":"IF(AND('Rank Wkst'!CL31>1,'Rank Wkst'!C31<>\"DQ\"), 'Rank Wkst'!CU31, \"\")","v":""},{"$f":"IF('Rank Wkst'!AG31<>0,'Rank Wkst'!CX31,\"\")","v":""}]
[]
["Superior Judge Signature:",null,null,null,null,null,"Tabulation Signature:"]

{"sheet":"Superior Judge Recap","index":30,"n_rows":35,"n_cols":18,"rows_kept":35,"cut":false,"hidden":false,"merged":[[25,1,25,2],[32,1,32,2],[33,1,33,2],[34,1,34,2],[26,1,26,2],[27,1,27,2],[28,1,28,2],[29,1,29,2],[30,1,30,2],[31,1,31,2],[19,1,19,2],[20,1,20,2],[21,1,21,2],[22,1,22,2],[23,1,23,2],[24,1,24,2],[14,1,14,2],[15,1,15,2],[16,1,16,2],[17,1,17,2],[18,1,18,2],[10,1,10,2],[11,1,11,2],[12,1,12,2],[13,1,13,2],[1,0,1,17],[2,0,2,17],[4,0,4,1],[6,0,6,1],[4,3,4,4],[6,3,6,4],[4,5,4,17],[6,5,6,17],[9,13,9,14],[8,3,8,9],[9,6,9,7],[9,8,9,9],[9,15,9,16],[8,10,8,16]]}
[]
["Minnesota State High School League Dance Team Competition"]
["Superior Judge Recap Sheet"]
[]
["MEET DATE:",null,{"$f":"IF(DATE=0, \"\", DATE)","v":""},"MEET SITE:",null,{"$f":"IF(Site=0, \"\", Site)","v":""}]
[]
["CLASS:",null,{"$f":"IF(Class=0, \"\", Class)","v":""},"CATEGORY:",null,{"$f":"CATEGORY","v":"High Kick Category"}]
[]
[null,null,null,"Judges Rank",null,null,null,null,null,null,"Judges Points"]
[null,null,null,null,null,null,"Drop Best Rank",null,"Drop Worst Rank",null,null,null,null,"Drop Lowest Points",null,"Drop Highest Points"]
[null,"School",null,"Best Rank","Worst Rank","Rank Spread","2nd Best Rank","Rank Spread with 2nd Best Rank","2nd Worst Rank","Rank Spread with 2nd Worst Rank","Low Points","High Points","Point Spread","2nd Low Points","Point Spread with 2nd Low Points","2nd High Points","Point Spread with 2nd High Points","Final Rank"]
[1,{"$f":"'Rank Wkst'!B8","v":""},null,{"$f":"'Rank Wkst'!GL8","v":""},{"$f":"'Rank Wkst'!GM8","v":""},{"$f":"'Rank Wkst'!GN8","v":""},{"$f":"'Rank Wkst'!GO8","v":""},{"$f":"'Rank Wkst'!GP8","v":""},{"$f":"'Rank Wkst'!GQ8","v":""},{"$f":"'Rank Wkst'!GR8","v":""},{"$f":"'Rank Wkst'!GY8","v":""},{"$f":"'Rank Wkst'!GZ8","v":""},{"$f":"'Rank Wkst'!HA8","v":""},{"$f":"'Rank Wkst'!HB8","v":""},{"$f":"'Rank Wkst'!HC8","v":""},{"$f":"'Rank Wkst'!HD8","v":""},{"$f":"'Rank Wkst'!HE8","v":""},{"$f":"'Ranking Sheet'!U12","v":""}]
[2,{"$f":"'Rank Wkst'!B9","v":""},null,{"$f":"'Rank Wkst'!GL9","v":""},{"$f":"'Rank Wkst'!GM9","v":""},{"$f":"'Rank Wkst'!GN9","v":""},{"$f":"'Rank Wkst'!GO9","v":""},{"$f":"'Rank Wkst'!GP9","v":""},{"$f":"'Rank Wkst'!GQ9","v":""},{"$f":"'Rank Wkst'!GR9","v":""},{"$f":"'Rank Wkst'!GY9","v":""},{"$f":"'Rank Wkst'!GZ9","v":""},{"$f":"'Rank Wkst'!HA9","v":""},{"$f":"'Rank Wkst'!HB9","v":""},{"$f":"'Rank Wkst'!HC9","v":""},{"$f":"'Rank Wkst'!HD9","v":""},{"$f":"'Rank Wkst'!HE9","v":""},{"$f":"'Ranking Sheet'!U13","v":""}]
[3,{"$f":"'Rank Wkst'!B10","v":""},null,{"$f":"'Rank Wkst'!GL10","v":""},{"$f":"'Rank Wkst'!GM10","v":""},{"$f":"'Rank Wkst'!GN10","v":""},{"$f":"'Rank Wkst'!GO10","v":""},{"$f":"'Rank Wkst'!GP10","v":""},{"$f":"'Rank Wkst'!GQ10","v":""},{"$f":"'Rank Wkst'!GR10","v":""},{"$f":"'Rank Wkst'!GY10","v":""},{"$f":"'Rank Wkst'!GZ10","v":""},{"$f":"'Rank Wkst'!HA10","v":""},{"$f":"'Rank Wkst'!HB10","v":""},{"$f":"'Rank Wkst'!HC10","v":""},{"$f":"'Rank Wkst'!HD10","v":""},{"$f":"'Rank Wkst'!HE10","v":""},{"$f":"'Ranking Sheet'!U14","v":""}]
[4,{"$f":"'Rank Wkst'!B11","v":""},null,{"$f":"'Rank Wkst'!GL11","v":""},{"$f":"'Rank Wkst'!GM11","v":""},{"$f":"'Rank Wkst'!GN11","v":""},{"$f":"'Rank Wkst'!GO11","v":""},{"$f":"'Rank Wkst'!GP11","v":""},{"$f":"'Rank Wkst'!GQ11","v":""},{"$f":"'Rank Wkst'!GR11","v":""},{"$f":"'Rank Wkst'!GY11","v":""},{"$f":"'Rank Wkst'!GZ11","v":""},{"$f":"'Rank Wkst'!HA11","v":""},{"$f":"'Rank Wkst'!HB11","v":""},{"$f":"'Rank Wkst'!HC11","v":""},{"$f":"'Rank Wkst'!HD11","v":""},{"$f":"'Rank Wkst'!HE11","v":""},{"$f":"'Ranking Sheet'!U15","v":""}]
[5,{"$f":"'Rank Wkst'!B12","v":""},null,{"$f":"'Rank Wkst'!GL12","v":""},{"$f":"'Rank Wkst'!GM12","v":""},{"$f":"'Rank Wkst'!GN12","v":""},{"$f":"'Rank Wkst'!GO12","v":""},{"$f":"'Rank Wkst'!GP12","v":""},{"$f":"'Rank Wkst'!GQ12","v":""},{"$f":"'Rank Wkst'!GR12","v":""},{"$f":"'Rank Wkst'!GY12","v":""},{"$f":"'Rank Wkst'!GZ12","v":""},{"$f":"'Rank Wkst'!HA12","v":""},{"$f":"'Rank Wkst'!HB12","v":""},{"$f":"'Rank Wkst'!HC12","v":""},{"$f":"'Rank Wkst'!HD12","v":""},{"$f":"'Rank Wkst'!HE12","v":""},{"$f":"'Ranking Sheet'!U16","v":""}]
[6,{"$f":"'Rank Wkst'!B13","v":""},null,{"$f":"'Rank Wkst'!GL13","v":""},{"$f":"'Rank Wkst'!GM13","v":""},{"$f":"'Rank Wkst'!GN13","v":""},{"$f":"'Rank Wkst'!GO13","v":""},{"$f":"'Rank Wkst'!GP13","v":""},{"$f":"'Rank Wkst'!GQ13","v":""},{"$f":"'Rank Wkst'!GR13","v":""},{"$f":"'Rank Wkst'!GY13","v":""},{"$f":"'Rank Wkst'!GZ13","v":""},{"$f":"'Rank Wkst'!HA13","v":""},{"$f":"'Rank Wkst'!HB13","v":""},{"$f":"'Rank Wkst'!HC13","v":""},{"$f":"'Rank Wkst'!HD13","v":""},{"$f":"'Rank Wkst'!HE13","v":""},{"$f":"'Ranking Sheet'!U17","v":""}]
[7,{"$f":"'Rank Wkst'!B14","v":""},null,{"$f":"'Rank Wkst'!GL14","v":""},{"$f":"'Rank Wkst'!GM14","v":""},{"$f":"'Rank Wkst'!GN14","v":""},{"$f":"'Rank Wkst'!GO14","v":""},{"$f":"'Rank Wkst'!GP14","v":""},{"$f":"'Rank Wkst'!GQ14","v":""},{"$f":"'Rank Wkst'!GR14","v":""},{"$f":"'Rank Wkst'!GY14","v":""},{"$f":"'Rank Wkst'!GZ14","v":""},{"$f":"'Rank Wkst'!HA14","v":""},{"$f":"'Rank Wkst'!HB14","v":""},{"$f":"'Rank Wkst'!HC14","v":""},{"$f":"'Rank Wkst'!HD14","v":""},{"$f":"'Rank Wkst'!HE14","v":""},{"$f":"'Ranking Sheet'!U18","v":""}]
[8,{"$f":"'Rank Wkst'!B15","v":""},null,{"$f":"'Rank Wkst'!GL15","v":""},{"$f":"'Rank Wkst'!GM15","v":""},{"$f":"'Rank Wkst'!GN15","v":""},{"$f":"'Rank Wkst'!GO15","v":""},{"$f":"'Rank Wkst'!GP15","v":""},{"$f":"'Rank Wkst'!GQ15","v":""},{"$f":"'Rank Wkst'!GR15","v":""},{"$f":"'Rank Wkst'!GY15","v":""},{"$f":"'Rank Wkst'!GZ15","v":""},{"$f":"'Rank Wkst'!HA15","v":""},{"$f":"'Rank Wkst'!HB15","v":""},{"$f":"'Rank Wkst'!HC15","v":""},{"$f":"'Rank Wkst'!HD15","v":""},{"$f":"'Rank Wkst'!HE15","v":""},{"$f":"'Ranking Sheet'!U19","v":""}]
[9,{"$f":"'Rank Wkst'!B16","v":""},null,{"$f":"'Rank Wkst'!GL16","v":""},{"$f":"'Rank Wkst'!GM16","v":""},{"$f":"'Rank Wkst'!GN16","v":""},{"$f":"'Rank Wkst'!GO16","v":""},{"$f":"'Rank Wkst'!GP16","v":""},{"$f":"'Rank Wkst'!GQ16","v":""},{"$f":"'Rank Wkst'!GR16","v":""},{"$f":"'Rank Wkst'!GY16","v":""},{"$f":"'Rank Wkst'!GZ16","v":""},{"$f":"'Rank Wkst'!HA16","v":""},{"$f":"'Rank Wkst'!HB16","v":""},{"$f":"'Rank Wkst'!HC16","v":""},{"$f":"'Rank Wkst'!HD16","v":""},{"$f":"'Rank Wkst'!HE16","v":""},{"$f":"'Ranking Sheet'!U20","v":""}]
[10,{"$f":"'Rank Wkst'!B17","v":""},null,{"$f":"'Rank Wkst'!GL17","v":""},{"$f":"'Rank Wkst'!GM17","v":""},{"$f":"'Rank Wkst'!GN17","v":""},{"$f":"'Rank Wkst'!GO17","v":""},{"$f":"'Rank Wkst'!GP17","v":""},{"$f":"'Rank Wkst'!GQ17","v":""},{"$f":"'Rank Wkst'!GR17","v":""},{"$f":"'Rank Wkst'!GY17","v":""},{"$f":"'Rank Wkst'!GZ17","v":""},{"$f":"'Rank Wkst'!HA17","v":""},{"$f":"'Rank Wkst'!HB17","v":""},{"$f":"'Rank Wkst'!HC17","v":""},{"$f":"'Rank Wkst'!HD17","v":""},{"$f":"'Rank Wkst'!HE17","v":""},{"$f":"'Ranking Sheet'!U21","v":""}]
[11,{"$f":"'Rank Wkst'!B18","v":""},null,{"$f":"'Rank Wkst'!GL18","v":""},{"$f":"'Rank Wkst'!GM18","v":""},{"$f":"'Rank Wkst'!GN18","v":""},{"$f":"'Rank Wkst'!GO18","v":""},{"$f":"'Rank Wkst'!GP18","v":""},{"$f":"'Rank Wkst'!GQ18","v":""},{"$f":"'Rank Wkst'!GR18","v":""},{"$f":"'Rank Wkst'!GY18","v":""},{"$f":"'Rank Wkst'!GZ18","v":""},{"$f":"'Rank Wkst'!HA18","v":""},{"$f":"'Rank Wkst'!HB18","v":""},{"$f":"'Rank Wkst'!HC18","v":""},{"$f":"'Rank Wkst'!HD18","v":""},{"$f":"'Rank Wkst'!HE18","v":""},{"$f":"'Ranking Sheet'!U22","v":""}]
[12,{"$f":"'Rank Wkst'!B19","v":""},null,{"$f":"'Rank Wkst'!GL19","v":""},{"$f":"'Rank Wkst'!GM19","v":""},{"$f":"'Rank Wkst'!GN19","v":""},{"$f":"'Rank Wkst'!GO19","v":""},{"$f":"'Rank Wkst'!GP19","v":""},{"$f":"'Rank Wkst'!GQ19","v":""},{"$f":"'Rank Wkst'!GR19","v":""},{"$f":"'Rank Wkst'!GY19","v":""},{"$f":"'Rank Wkst'!GZ19","v":""},{"$f":"'Rank Wkst'!HA19","v":""},{"$f":"'Rank Wkst'!HB19","v":""},{"$f":"'Rank Wkst'!HC19","v":""},{"$f":"'Rank Wkst'!HD19","v":""},{"$f":"'Rank Wkst'!HE19","v":""},{"$f":"'Ranking Sheet'!U23","v":""}]
[13,{"$f":"'Rank Wkst'!B20","v":""},null,{"$f":"'Rank Wkst'!GL20","v":""},{"$f":"'Rank Wkst'!GM20","v":""},{"$f":"'Rank Wkst'!GN20","v":""},{"$f":"'Rank Wkst'!GO20","v":""},{"$f":"'Rank Wkst'!GP20","v":""},{"$f":"'Rank Wkst'!GQ20","v":""},{"$f":"'Rank Wkst'!GR20","v":""},{"$f":"'Rank Wkst'!GY20","v":""},{"$f":"'Rank Wkst'!GZ20","v":""},{"$f":"'Rank Wkst'!HA20","v":""},{"$f":"'Rank Wkst'!HB20","v":""},{"$f":"'Rank Wkst'!HC20","v":""},{"$f":"'Rank Wkst'!HD20","v":""},{"$f":"'Rank Wkst'!HE20","v":""},{"$f":"'Ranking Sheet'!U24","v":""}]
[14,{"$f":"'Rank Wkst'!B21","v":""},null,{"$f":"'Rank Wkst'!GL21","v":""},{"$f":"'Rank Wkst'!GM21","v":""},{"$f":"'Rank Wkst'!GN21","v":""},{"$f":"'Rank Wkst'!GO21","v":""},{"$f":"'Rank Wkst'!GP21","v":""},{"$f":"'Rank Wkst'!GQ21","v":""},{"$f":"'Rank Wkst'!GR21","v":""},{"$f":"'Rank Wkst'!GY21","v":""},{"$f":"'Rank Wkst'!GZ21","v":""},{"$f":"'Rank Wkst'!HA21","v":""},{"$f":"'Rank Wkst'!HB21","v":""},{"$f":"'Rank Wkst'!HC21","v":""},{"$f":"'Rank Wkst'!HD21","v":""},{"$f":"'Rank Wkst'!HE21","v":""},{"$f":"'Ranking Sheet'!U25","v":""}]
[15,{"$f":"'Rank Wkst'!B22","v":""},null,{"$f":"'Rank Wkst'!GL22","v":""},{"$f":"'Rank Wkst'!GM22","v":""},{"$f":"'Rank Wkst'!GN22","v":""},{"$f":"'Rank Wkst'!GO22","v":""},{"$f":"'Rank Wkst'!GP22","v":""},{"$f":"'Rank Wkst'!GQ22","v":""},{"$f":"'Rank Wkst'!GR22","v":""},{"$f":"'Rank Wkst'!GY22","v":""},{"$f":"'Rank Wkst'!GZ22","v":""},{"$f":"'Rank Wkst'!HA22","v":""},{"$f":"'Rank Wkst'!HB22","v":""},{"$f":"'Rank Wkst'!HC22","v":""},{"$f":"'Rank Wkst'!HD22","v":""},{"$f":"'Rank Wkst'!HE22","v":""},{"$f":"'Ranking Sheet'!U26","v":""}]
[16,{"$f":"'Rank Wkst'!B23","v":""},null,{"$f":"'Rank Wkst'!GL23","v":""},{"$f":"'Rank Wkst'!GM23","v":""},{"$f":"'Rank Wkst'!GN23","v":""},{"$f":"'Rank Wkst'!GO23","v":""},{"$f":"'Rank Wkst'!GP23","v":""},{"$f":"'Rank Wkst'!GQ23","v":""},{"$f":"'Rank Wkst'!GR23","v":""},{"$f":"'Rank Wkst'!GY23","v":""},{"$f":"'Rank Wkst'!GZ23","v":""},{"$f":"'Rank Wkst'!HA23","v":""},{"$f":"'Rank Wkst'!HB23","v":""},{"$f":"'Rank Wkst'!HC23","v":""},{"$f":"'Rank Wkst'!HD23","v":""},{"$f":"'Rank Wkst'!HE23","v":""},{"$f":"'Ranking Sheet'!U27","v":""}]
[17,{"$f":"'Rank Wkst'!B24","v":""},null,{"$f":"'Rank Wkst'!GL24","v":""},{"$f":"'Rank Wkst'!GM24","v":""},{"$f":"'Rank Wkst'!GN24","v":""},{"$f":"'Rank Wkst'!GO24","v":""},{"$f":"'Rank Wkst'!GP24","v":""},{"$f":"'Rank Wkst'!GQ24","v":""},{"$f":"'Rank Wkst'!GR24","v":""},{"$f":"'Rank Wkst'!GY24","v":""},{"$f":"'Rank Wkst'!GZ24","v":""},{"$f":"'Rank Wkst'!HA24","v":""},{"$f":"'Rank Wkst'!HB24","v":""},{"$f":"'Rank Wkst'!HC24","v":""},{"$f":"'Rank Wkst'!HD24","v":""},{"$f":"'Rank Wkst'!HE24","v":""},{"$f":"'Ranking Sheet'!U28","v":""}]
[18,{"$f":"'Rank Wkst'!B25","v":""},null,{"$f":"'Rank Wkst'!GL25","v":""},{"$f":"'Rank Wkst'!GM25","v":""},{"$f":"'Rank Wkst'!GN25","v":""},{"$f":"'Rank Wkst'!GO25","v":""},{"$f":"'Rank Wkst'!GP25","v":""},{"$f":"'Rank Wkst'!GQ25","v":""},{"$f":"'Rank Wkst'!GR25","v":""},{"$f":"'Rank Wkst'!GY25","v":""},{"$f":"'Rank Wkst'!GZ25","v":""},{"$f":"'Rank Wkst'!HA25","v":""},{"$f":"'Rank Wkst'!HB25","v":""},{"$f":"'Rank Wkst'!HC25","v":""},{"$f":"'Rank Wkst'!HD25","v":""},{"$f":"'Rank Wkst'!HE25","v":""},{"$f":"'Ranking Sheet'!U29","v":""}]
[19,{"$f":"'Rank Wkst'!B26","v":""},null,{"$f":"'Rank Wkst'!GL26","v":""},{"$f":"'Rank Wkst'!GM26","v":""},{"$f":"'Rank Wkst'!GN26","v":""},{"$f":"'Rank Wkst'!GO26","v":""},{"$f":"'Rank Wkst'!GP26","v":""},{"$f":"'Rank Wkst'!GQ26","v":""},{"$f":"'Rank Wkst'!GR26","v":""},{"$f":"'Rank Wkst'!GY26","v":""},{"$f":"'Rank Wkst'!GZ26","v":""},{"$f":"'Rank Wkst'!HA26","v":""},{"$f":"'Rank Wkst'!HB26","v":""},{"$f":"'Rank Wkst'!HC26","v":""},{"$f":"'Rank Wkst'!HD26","v":""},{"$f":"'Rank Wkst'!HE26","v":""},{"$f":"'Ranking Sheet'!U30","v":""}]
[20,{"$f":"'Rank Wkst'!B27","v":""},null,{"$f":"'Rank Wkst'!GL27","v":""},{"$f":"'Rank Wkst'!GM27","v":""},{"$f":"'Rank Wkst'!GN27","v":""},{"$f":"'Rank Wkst'!GO27","v":""},{"$f":"'Rank Wkst'!GP27","v":""},{"$f":"'Rank Wkst'!GQ27","v":""},{"$f":"'Rank Wkst'!GR27","v":""},{"$f":"'Rank Wkst'!GY27","v":""},{"$f":"'Rank Wkst'!GZ27","v":""},{"$f":"'Rank Wkst'!HA27","v":""},{"$f":"'Rank Wkst'!HB27","v":""},{"$f":"'Rank Wkst'!HC27","v":""},{"$f":"'Rank Wkst'!HD27","v":""},{"$f":"'Rank Wkst'!HE27","v":""},{"$f":"'Ranking Sheet'!U31","v":""}]
[21,{"$f":"'Rank Wkst'!B28","v":""},null,{"$f":"'Rank Wkst'!GL28","v":""},{"$f":"'Rank Wkst'!GM28","v":""},{"$f":"'Rank Wkst'!GN28","v":""},{"$f":"'Rank Wkst'!GO28","v":""},{"$f":"'Rank Wkst'!GP28","v":""},{"$f":"'Rank Wkst'!GQ28","v":""},{"$f":"'Rank Wkst'!GR28","v":""},{"$f":"'Rank Wkst'!GY28","v":""},{"$f":"'Rank Wkst'!GZ28","v":""},{"$f":"'Rank Wkst'!HA28","v":""},{"$f":"'Rank Wkst'!HB28","v":""},{"$f":"'Rank Wkst'!HC28","v":""},{"$f":"'Rank Wkst'!HD28","v":""},{"$f":"'Rank Wkst'!HE28","v":""},{"$f":"'Ranking Sheet'!U32","v":""}]
[22,{"$f":"'Rank Wkst'!B29","v":""},null,{"$f":"'Rank Wkst'!GL29","v":""},{"$f":"'Rank Wkst'!GM29","v":""},{"$f":"'Rank Wkst'!GN29","v":""},{"$f":"'Rank Wkst'!GO29","v":""},{"$f":"'Rank Wkst'!GP29","v":""},{"$f":"'Rank Wkst'!GQ29","v":""},{"$f":"'Rank Wkst'!GR29","v":""},{"$f":"'Rank Wkst'!GY29","v":""},{"$f":"'Rank Wkst'!GZ29","v":""},{"$f":"'Rank Wkst'!HA29","v":""},{"$f":"'Rank Wkst'!HB29","v":""},{"$f":"'Rank Wkst'!HC29","v":""},{"$f":"'Rank Wkst'!HD29","v":""},{"$f":"'Rank Wkst'!HE29","v":""},{"$f":"'Ranking Sheet'!U33","v":""}]
[23,{"$f":"'Rank Wkst'!B30","v":""},null,{"$f":"'Rank Wkst'!GL30","v":""},{"$f":"'Rank Wkst'!GM30","v":""},{"$f":"'Rank Wkst'!GN30","v":""},{"$f":"'Rank Wkst'!GO30","v":""},{"$f":"'Rank Wkst'!GP30","v":""},{"$f":"'Rank Wkst'!GQ30","v":""},{"$f":"'Rank Wkst'!GR30","v":""},{"$f":"'Rank Wkst'!GY30","v":""},{"$f":"'Rank Wkst'!GZ30","v":""},{"$f":"'Rank Wkst'!HA30","v":""},{"$f":"'Rank Wkst'!HB30","v":""},{"$f":"'Rank Wkst'!HC30","v":""},{"$f":"'Rank Wkst'!HD30","v":""},{"$f":"'Rank Wkst'!HE30","v":""},{"$f":"'Ranking Sheet'!U34","v":""}]
[24,{"$f":"'Rank Wkst'!B31","v":""},null,{"$f":"'Rank Wkst'!GL31","v":""},{"$f":"'Rank Wkst'!GM31","v":""},{"$f":"'Rank Wkst'!GN31","v":""},{"$f":"'Rank Wkst'!GO31","v":""},{"$f":"'Rank Wkst'!GP31","v":""},{"$f":"'Rank Wkst'!GQ31","v":""},{"$f":"'Rank Wkst'!GR31","v":""},{"$f":"'Rank Wkst'!GY31","v":""},{"$f":"'Rank Wkst'!GZ31","v":""},{"$f":"'Rank Wkst'!HA31","v":""},{"$f":"'Rank Wkst'!HB31","v":""},{"$f":"'Rank Wkst'!HC31","v":""},{"$f":"'Rank Wkst'!HD31","v":""},{"$f":"'Rank Wkst'!HE31","v":""},{"$f":"'Ranking Sheet'!U35","v":""}]

{"sheet":"Score Summary","index":31,"n_rows":47,"n_cols":9,"rows_kept":47,"cut":false,"hidden":false,"merged":[[46,1,46,2],[37,1,37,2],[38,1,38,2],[39,1,39,2],[40,1,40,2],[41,1,41,2],[45,1,45,2],[43,1,43,2],[44,1,44,2],[15,0,15,8],[11,0,11,8],[13,0,13,8],[17,0,17,8],[28,1,28,2],[29,1,29,2],[22,1,22,2],[23,1,23,2],[24,1,24,2],[25,1,25,2],[30,1,30,2],[31,1,31,2],[32,1,32,2],[33,1,33,2],[42,1,42,2],[34,1,34,2],[35,1,35,2],[36,1,36,2],[26,1,26,2],[27,1,27,2],[21,0,21,2],[1,0,1,8],[2,0,2,8],[4,0,4,1],[6,0,6,1],[4,5,4,8],[6,5,6,8],[21,3,21,8]]}
[]
["Minnesota State High School League Dance Team Competition"]
["Team Scoring Summary"]
[]
["MEET DATE:",null,{"$f":"IF(DATE=0, \"\", DATE)","v":""},null,"MEET SITE:",{"$f":"IF(Site=0, \"\", Site)","v":""}]
[]
["CLASS:",null,{"$f":"IF(Class=0, \"\", Class)","v":""},null,"CATEGORY:",{"$f":"CATEGORY","v":"High Kick Category"}]
[]
["Announcers - Please read the following:"]
["May I please have your attention: "]
[]
["At today/tonight’s competition we are piloting a system, which will allow us to periodically share results during this event."]
[]
["Judges scores are used to determine ranked placements and, in final tabulation, high and low ranks are dropped."]
[]
["The scores announced during the competition are the total points scored by each official and will be read from the lowest score to the highest score for each performance.  Teams have not yet been ranked, and high and low ranks have not been dropped.  The final results will be based on rank, not on these point totals."]
[]
["This is informational only and our way of sharing how each team is scoring as the meet progresses."]
[]
[]
[]
[null,null,null,"Team Scores (Lowest to Highest)"]
["Team","School",null,"Score 1","Score 2","Score 3","Score 4","Score 5","Score 6 \n(if applicable)"]
[1,{"$f":" 'Rank Wkst'!DL8","v":""},null,{"$f":"'Rank Wkst'!FU8","v":""},{"$f":"'Rank Wkst'!FV8","v":""},{"$f":"'Rank Wkst'!FW8","v":""},{"$f":"'Rank Wkst'!FX8","v":""},{"$f":"'Rank Wkst'!FY8","v":""},{"$f":"'Rank Wkst'!FZ8","v":""}]
[2,{"$f":" 'Rank Wkst'!DL9","v":""},null,{"$f":"'Rank Wkst'!FU9","v":""},{"$f":"'Rank Wkst'!FV9","v":""},{"$f":"'Rank Wkst'!FW9","v":""},{"$f":"'Rank Wkst'!FX9","v":""},{"$f":"'Rank Wkst'!FY9","v":""},{"$f":"'Rank Wkst'!FZ9","v":""}]
[3,{"$f":" 'Rank Wkst'!DL10","v":""},null,{"$f":"'Rank Wkst'!FU10","v":""},{"$f":"'Rank Wkst'!FV10","v":""},{"$f":"'Rank Wkst'!FW10","v":""},{"$f":"'Rank Wkst'!FX10","v":""},{"$f":"'Rank Wkst'!FY10","v":""},{"$f":"'Rank Wkst'!FZ10","v":""}]
[4,{"$f":" 'Rank Wkst'!DL11","v":""},null,{"$f":"'Rank Wkst'!FU11","v":""},{"$f":"'Rank Wkst'!FV11","v":""},{"$f":"'Rank Wkst'!FW11","v":""},{"$f":"'Rank Wkst'!FX11","v":""},{"$f":"'Rank Wkst'!FY11","v":""},{"$f":"'Rank Wkst'!FZ11","v":""}]
[5,{"$f":" 'Rank Wkst'!DL12","v":""},null,{"$f":"'Rank Wkst'!FU12","v":""},{"$f":"'Rank Wkst'!FV12","v":""},{"$f":"'Rank Wkst'!FW12","v":""},{"$f":"'Rank Wkst'!FX12","v":""},{"$f":"'Rank Wkst'!FY12","v":""},{"$f":"'Rank Wkst'!FZ12","v":""}]
[6,{"$f":" 'Rank Wkst'!DL13","v":""},null,{"$f":"'Rank Wkst'!FU13","v":""},{"$f":"'Rank Wkst'!FV13","v":""},{"$f":"'Rank Wkst'!FW13","v":""},{"$f":"'Rank Wkst'!FX13","v":""},{"$f":"'Rank Wkst'!FY13","v":""},{"$f":"'Rank Wkst'!FZ13","v":""}]
[7,{"$f":" 'Rank Wkst'!DL14","v":""},null,{"$f":"'Rank Wkst'!FU14","v":""},{"$f":"'Rank Wkst'!FV14","v":""},{"$f":"'Rank Wkst'!FW14","v":""},{"$f":"'Rank Wkst'!FX14","v":""},{"$f":"'Rank Wkst'!FY14","v":""},{"$f":"'Rank Wkst'!FZ14","v":""}]
[8,{"$f":" 'Rank Wkst'!DL15","v":""},null,{"$f":"'Rank Wkst'!FU15","v":""},{"$f":"'Rank Wkst'!FV15","v":""},{"$f":"'Rank Wkst'!FW15","v":""},{"$f":"'Rank Wkst'!FX15","v":""},{"$f":"'Rank Wkst'!FY15","v":""},{"$f":"'Rank Wkst'!FZ15","v":""}]
[9,{"$f":" 'Rank Wkst'!DL16","v":""},null,{"$f":"'Rank Wkst'!FU16","v":""},{"$f":"'Rank Wkst'!FV16","v":""},{"$f":"'Rank Wkst'!FW16","v":""},{"$f":"'Rank Wkst'!FX16","v":""},{"$f":"'Rank Wkst'!FY16","v":""},{"$f":"'Rank Wkst'!FZ16","v":""}]
[10,{"$f":" 'Rank Wkst'!DL17","v":""},null,{"$f":"'Rank Wkst'!FU17","v":""},{"$f":"'Rank Wkst'!FV17","v":""},{"$f":"'Rank Wkst'!FW17","v":""},{"$f":"'Rank Wkst'!FX17","v":""},{"$f":"'Rank Wkst'!FY17","v":""},{"$f":"'Rank Wkst'!FZ17","v":""}]
[11,{"$f":" 'Rank Wkst'!DL18","v":""},null,{"$f":"'Rank Wkst'!FU18","v":""},{"$f":"'Rank Wkst'!FV18","v":""},{"$f":"'Rank Wkst'!FW18","v":""},{"$f":"'Rank Wkst'!FX18","v":""},{"$f":"'Rank Wkst'!FY18","v":""},{"$f":"'Rank Wkst'!FZ18","v":""}]
[12,{"$f":" 'Rank Wkst'!DL19","v":""},null,{"$f":"'Rank Wkst'!FU19","v":""},{"$f":"'Rank Wkst'!FV19","v":""},{"$f":"'Rank Wkst'!FW19","v":""},{"$f":"'Rank Wkst'!FX19","v":""},{"$f":"'Rank Wkst'!FY19","v":""},{"$f":"'Rank Wkst'!FZ19","v":""}]
[13,{"$f":" 'Rank Wkst'!DL20","v":""},null,{"$f":"'Rank Wkst'!FU20","v":""},{"$f":"'Rank Wkst'!FV20","v":""},{"$f":"'Rank Wkst'!FW20","v":""},{"$f":"'Rank Wkst'!FX20","v":""},{"$f":"'Rank Wkst'!FY20","v":""},{"$f":"'Rank Wkst'!FZ20","v":""}]
[14,{"$f":" 'Rank Wkst'!DL21","v":""},null,{"$f":"'Rank Wkst'!FU21","v":""},{"$f":"'Rank Wkst'!FV21","v":""},{"$f":"'Rank Wkst'!FW21","v":""},{"$f":"'Rank Wkst'!FX21","v":""},{"$f":"'Rank Wkst'!FY21","v":""},{"$f":"'Rank Wkst'!FZ21","v":""}]
[15,{"$f":" 'Rank Wkst'!DL22","v":""},null,{"$f":"'Rank Wkst'!FU22","v":""},{"$f":"'Rank Wkst'!FV22","v":""},{"$f":"'Rank Wkst'!FW22","v":""},{"$f":"'Rank Wkst'!FX22","v":""},{"$f":"'Rank Wkst'!FY22","v":""},{"$f":"'Rank Wkst'!FZ22","v":""}]
[16,{"$f":" 'Rank Wkst'!DL23","v":""},null,{"$f":"'Rank Wkst'!FU23","v":""},{"$f":"'Rank Wkst'!FV23","v":""},{"$f":"'Rank Wkst'!FW23","v":""},{"$f":"'Rank Wkst'!FX23","v":""},{"$f":"'Rank Wkst'!FY23","v":""},{"$f":"'Rank Wkst'!FZ23","v":""}]
[17,{"$f":" 'Rank Wkst'!DL24","v":""},null,{"$f":"'Rank Wkst'!FU24","v":""},{"$f":"'Rank Wkst'!FV24","v":""},{"$f":"'Rank Wkst'!FW24","v":""},{"$f":"'Rank Wkst'!FX24","v":""},{"$f":"'Rank Wkst'!FY24","v":""},{"$f":"'Rank Wkst'!FZ24","v":""}]
[18,{"$f":" 'Rank Wkst'!DL25","v":""},null,{"$f":"'Rank Wkst'!FU25","v":""},{"$f":"'Rank Wkst'!FV25","v":""},{"$f":"'Rank Wkst'!FW25","v":""},{"$f":"'Rank Wkst'!FX25","v":""},{"$f":"'Rank Wkst'!FY25","v":""},{"$f":"'Rank Wkst'!FZ25","v":""}]
[19,{"$f":" 'Rank Wkst'!DL26","v":""},null,{"$f":"'Rank Wkst'!FU26","v":""},{"$f":"'Rank Wkst'!FV26","v":""},{"$f":"'Rank Wkst'!FW26","v":""},{"$f":"'Rank Wkst'!FX26","v":""},{"$f":"'Rank Wkst'!FY26","v":""},{"$f":"'Rank Wkst'!FZ26","v":""}]
[20,{"$f":" 'Rank Wkst'!DL27","v":""},null,{"$f":"'Rank Wkst'!FU27","v":""},{"$f":"'Rank Wkst'!FV27","v":""},{"$f":"'Rank Wkst'!FW27","v":""},{"$f":"'Rank Wkst'!FX27","v":""},{"$f":"'Rank Wkst'!FY27","v":""},{"$f":"'Rank Wkst'!FZ27","v":""}]
[21,{"$f":" 'Rank Wkst'!DL28","v":""},null,{"$f":"'Rank Wkst'!FU28","v":""},{"$f":"'Rank Wkst'!FV28","v":""},{"$f":"'Rank Wkst'!FW28","v":""},{"$f":"'Rank Wkst'!FX28","v":""},{"$f":"'Rank Wkst'!FY28","v":""},{"$f":"'Rank Wkst'!FZ28","v":""}]
[22,{"$f":" 'Rank Wkst'!DL29","v":""},null,{"$f":"'Rank Wkst'!FU29","v":""},{"$f":"'Rank Wkst'!FV29","v":""},{"$f":"'Rank Wkst'!FW29","v":""},{"$f":"'Rank Wkst'!FX29","v":""},{"$f":"'Rank Wkst'!FY29","v":""},{"$f":"'Rank Wkst'!FZ29","v":""}]
[23,{"$f":" 'Rank Wkst'!DL30","v":""},null,{"$f":"'Rank Wkst'!FU30","v":""},{"$f":"'Rank Wkst'!FV30","v":""},{"$f":"'Rank Wkst'!FW30","v":""},{"$f":"'Rank Wkst'!FX30","v":""},{"$f":"'Rank Wkst'!FY30","v":""},{"$f":"'Rank Wkst'!FZ30","v":""}]
[24,{"$f":" 'Rank Wkst'!DL31","v":""},null,{"$f":"'Rank Wkst'!FU31","v":""},{"$f":"'Rank Wkst'!FV31","v":""},{"$f":"'Rank Wkst'!FW31","v":""},{"$f":"'Rank Wkst'!FX31","v":""},{"$f":"'Rank Wkst'!FY31","v":""},{"$f":"'Rank Wkst'!FZ31","v":""}]

{"sheet":"Teams in Rank Order","index":32,"n_rows":0,"n_cols":0,"rows_kept":0,"cut":false,"hidden":false,"merged":[]}

{"sheet":"State Prelims Announce","index":33,"n_rows":34,"n_cols":12,"rows_kept":34,"cut":false,"hidden":false,"merged":[[1,1,1,12],[2,1,2,12],[10,3,10,6],[10,10,10,12],[11,3,11,6],[11,10,11,12],[12,3,12,6],[12,10,12,12],[13,3,13,6],[13,10,13,12],[14,3,14,6],[14,10,14,12],[15,3,15,6],[15,10,15,12],[17,1,17,12],[18,1,18,12],[20,1,20,12],[22,1,22,12],[30,3,30,10],[31,3,31,10],[32,4,32,10],[33,1,34,12],[24,8,24,10],[25,1,25,10],[26,3,26,10],[27,3,27,10],[28,3,28,10],[29,3,29,10]]}
[]
[null,"Minnesota State High School League Dance Team Competition"]
[null,"Announcers Sheet - After State Preliminary Comp"]
[]
[null,"AFTER THE PRELIMINARY COMPETITION:"]
[]
[null,"“At this time, I would like to present the Class    ",null,null,null,null,null,null,null,null,{"$f":"IF(Class=0, \"\", Class)","v":""}]
[null,"teams in the Jazz Category in the order in which they performed.  "]
[null,"Please welcome each team as they are introduced:”"]
[]
[null,1,null,{"$f":"IF(Team1=0, \"\", Team1)","v":""},null,null,null,null,7,null,{"$f":"IF(Team7=0, \"\", Team7)","v":""}]
[null,2,null,{"$f":"IF(Team2=0, \"\", Team2)","v":""},null,null,null,null,8,null,{"$f":"IF(Team8=0, \"\", Team8)","v":""}]
[null,3,null,{"$f":"IF(Team3=0, \"\", Team3)","v":""},null,null,null,null,9,null,{"$f":"IF(Team9=0, \"\", Team9)","v":""}]
[null,4,null,{"$f":"IF(Team4=0, \"\", Team4)","v":""},null,null,null,null,10,null,{"$f":"IF(Team10=0, \"\", Team10)","v":""}]
[null,5,null,{"$f":"IF(Team5=0, \"\", Team5)","v":""},null,null,null,null,11,null,{"$f":"IF(Team11=0, \"\", Team11)","v":""}]
[null,6,null,{"$f":"IF(Team6=0, \"\", Team6)","v":""},null,null,null,null,12,null,{"$f":"IF(Team12=0, \"\", Team12)","v":""}]
[]
[null,"“Coaches:  A reminder that the results for Prelims are available in"]
[null,"the Registration Area."]
[]
[null,"“The teams that did not finish in the top six will not be announced.  The teams will be announced in Performance order & not in the order in which they placed in the Preliminary Competition. "]
[]
[null,"“When your school is announced, we would ask that the entire team please step forward.”"]
[]
[null,"\"The Teams moving on to Finals in Class",null,null,null,null,null,null,{"$f":"IF(Class=0, \"\", Class)","v":""},null,null,"are:"]
[]
[null,1]
[null,2]
[null,3]
[null,4]
[null,5]
[null,6]
[]
[null,"“Congratulations to all of the teams advancing to Finals and also congratulations to all of the teams not advancing on completing a successful season!\""]

{"sheet":"State Finals Announce","index":34,"n_rows":46,"n_cols":11,"rows_kept":46,"cut":false,"hidden":false,"merged":[[1,1,1,12],[2,1,2,12],[10,3,10,6],[10,10,10,12],[11,3,11,6],[11,10,11,12],[12,3,12,6],[12,10,12,12],[14,1,14,12],[15,1,15,12],[17,1,17,12],[18,3,18,12],[19,3,19,12],[20,3,20,12],[21,3,21,12],[22,3,22,12],[24,1,24,12],[26,1,26,12],[42,1,42,10],[43,1,43,12],[45,1,45,12],[28,1,28,12],[32,1,32,10],[33,1,33,12],[37,1,37,10],[38,1,38,12],[40,4,40,8]]}
[]
[null,"Minnesota State High School League Dance Team Competition"]
[null,"Announcers Sheet - After State Finals"]
[]
[null,"AFTER THE FINAL COMPETITION:"]
[]
[null,"“At this time, I would like to present the Class    ",null,null,null,null,null,null,null,null,{"$f":"IF(Class=0, \"\", Class)","v":""}]
[null,"finalists in the Jazz Category in the order in which they performed.  "]
[null,"Please welcome each team as they are introduced:”"]
[]
[null,1,null,{"$f":"IF(Team1=0, \"\", Team1)","v":""},null,null,null,null,4,null,{"$f":"IF(Team4=0, \"\", Team4)","v":""}]
[null,2,null,{"$f":"IF(Team2=0, \"\", Team2)","v":""},null,null,null,null,5,null,{"$f":"IF(Team5=0, \"\", Team5)","v":""}]
[null,3,null,{"$f":"IF(Team3=0, \"\", Team3)","v":""},null,null,null,null,6,null,{"$f":"IF(Team6=0, \"\",Team6)","v":""}]
[]
[null,"“Coaches:  A reminder that the results for Finals are available in"]
[null,"the Registration Area."]
[]
[null,"“Assisting with the presentation of the awards this evening are members of the Minnesota State High School League Board of Directors:”"]
[null,1]
[null,2]
[null,3]
[null,4]
[null,5]
[]
[null,"“The teams that did not finish in the top three will not be announced. A trophy and individual medals will be awarded to the third, second and championship teams.”"]
[]
[null,"“When your school is announced, we would ask that the entire team and coaches line up on the center court line to receive your awards.\""]
[]
[null,"\"We will be announcing the rank score for each team - the lowest rank score wins.\""]
[]
[null,"In THIRD PLACE in JAZZ  "]
[null,"with a rank score of ",null,null,null,null,{"$f":"'Rank Wkst'!BW10","v":""},null,"is the team from:"]
[null,{"$f":"'Rank Wkst'!DF10","v":""}]
[null,"Read the name of each girl and coaches while medals are awarded.  Ask the captains to come forward and receive their trophy."]
[]
[null,"In SECOND PLACE in JAZZ "]
[null,"with a rank score of ",null,null,null,null,{"$f":"'Rank Wkst'!BW9","v":""},null,"is the team from:"]
[null,{"$f":"'Rank Wkst'!DF9","v":""}]
[null,"Read the name of each girl and coaches while medals are awarded.  Ask the captains to come forward and receive their trophy."]
[]
[null,"The ",null,{"$f":"IF(DATE=0, \"\", DATE)","v":""},"JAZZ  STATE CHAMPIONS in Class",null,null,null,null,null,{"$f":"IF(Class=0, \"\", Class)","v":""}]
[null,"with a rank score of ",null,null,null,null,{"$f":"'Rank Wkst'!BW8","v":""},null,"is the team from:"]
[null,{"$f":"'Rank Wkst'!DF8","v":""}]
[null,"Read the name of each girl and coaches while medals are awarded.  Ask the captains to come forward and receive their trophy."]
[]
[null,"“Congratulations to all of the teams on their great performances today and on having a very successful season!\""]

{"sheet":"First and Lake State Finals","index":35,"n_rows":11,"n_cols":6,"rows_kept":11,"cut":false,"hidden":false,"merged":[[10,1,10,3],[10,5,10,10],[1,1,1,12],[2,1,2,12],[4,1,4,12],[6,1,6,12],[8,1,8,3],[8,5,8,10]]}
[]
[null,"Minnesota State High School League Dance Team Competition"]
[null,"Determining First & Last - State Finals"]
[]
[null,"After Preliminary Competition, a drawing will take place for the order of performance for the Final Competition"]
[]
[null,"These teams were first or last in the Preliminary competition and cannot be first or last for Finals:"]
[]
[null,"Team 1",null,null,null,{"$f":"IF(Team1=0, \"\", Team1)","v":""}]
[]
[null,"Team 12",null,null,null,{"$f":"IF(Team12=0, \"\", Team12)","v":""}]

{"sheet":"State Tie Announce","index":36,"n_rows":31,"n_cols":12,"rows_kept":31,"cut":false,"hidden":false,"merged":[[30,9,30,12],[1,1,1,12],[2,1,2,12],[10,9,10,12],[17,9,17,12],[19,9,19,12],[27,9,27,12]]}
[]
[null,"Minnesota State High School League Dance Team Competition"]
[null,"Announcers Sheet for Ties"]
[]
[null,"After the Final Competition, if a TIE is present:"]
[]
[null,"Tie for Third:"]
[]
[null,"\"There was a tie for 3rd place with both schools having a rank score of ",null,null,null,null,null,null,null,null,{"$f":"'Rank Wkst'!HV10","v":""},"."]
[]
[null,"Based on the tie breaking procedure, the third place team is",null,null,null,null,null,null,null,{"$f":"'Rank Wkst'!HT10","v":""}]
[]
[]
[null,"Tie for Second:"]
[]
[null,"\"There was a tie for 2nd place with both schools having a rank score of ",null,null,null,null,null,null,null,null,{"$f":"'Rank Wkst'!HV9","v":""},"."]
[]
[null,"Based on the tie breaking procedures, the third place team is:",null,null,null,null,null,null,null,{"$f":"'Rank Wkst'!HS9","v":""}]
[]
[null,"In Second Place, the ",null,null,{"$f":"IF(DATE=0, \"\", DATE)","v":""},"Runner-up, the team from:",null,null,null,{"$f":"'Rank Wkst'!HR9","v":""}]
[]
[]
[null,"Tie for First:"]
[]
[null,"\"There was a tie for 1st place with both schools having a rank score of ",null,null,null,null,null,null,null,null,{"$f":"'Rank Wkst'!HV8","v":""},"."]
[]
[null,"Based on the tie breaking procedures, the",null,null,null,null,null,{"$f":"IF(DATE=0, \"\", DATE)","v":""},"Runner-up is the team from:"]
[null,null,null,null,null,null,null,null,null,{"$f":"'Rank Wkst'!HQ8","v":""}]
[]
[null,"Finishing in 1st place . . . ",null,null," Congratulations to the",null,null,{"$f":"IF(DATE=0, \"\", DATE)","v":""},"State Champion . . . "]
[null,null,null,null,null,null,null,null,null,{"$f":"'Rank Wkst'!HP8","v":""}]

{"sheet":"Judges Names","index":37,"n_rows":14,"n_cols":4,"rows_kept":14,"cut":false,"hidden":false,"merged":[[1,1,1,3],[2,1,2,3],[5,2,5,3]]}
[]
[null,"Minnesota State High School League Dance Team Competition"]
[null,"Judges Initials and Names"]
[]
[null,"Meet Date:"]
[null,"Meet Site:"]
[]
[null,"Judge #","Judges Initials","Judge Name"]
[null,1]
[null,2]
[null,3]
[null,4]
[null,5]
[null,6]