{"text_format":"1","workbook":"xlsx","n_sheets":38,"sheets":["Ranking Sheet","Rank Wkst","Final Placement","Announcers Form","Point Summary","Team1","Team2","Team3","Team4","Team5","Team6","Team7","Team8","Team9","Team10","Team11","Team12","Team13","Team14","Team15","Team16","Team17","Team18","Team19","Team20","Team21","Team22","Team23","Team24","Tie-Breaker Sheet","Teams in Rank Order","State Prelims Announce","State Finals Announce","First and Last State Finals","State Tie Announce","Superior Judge Recap","Score Summary","Judges Names"],"not_rendered":{"charts":0,"images":0,"macros":1,"external_links":0,"defined_names":79,"comments":1,"pivot_tables":0},"unopened":[],"bounds":{"document_bytes":16777216,"sheet_cells":100000,"rows_first":2000,"rows_last":500,"rows_between":2000,"halvings":0,"cell_chars":16384,"cell_head_chars":4096},"cells_cut":0,"cells_raw":0,"read":"whole","date_system":"1900"}

{"sheet":"Ranking Sheet","index":0,"n_rows":37,"n_cols":35,"rows_kept":37,"cut":false,"hidden":false,"merged":[[36,3,36,11],[6,3,6,4],[9,9,9,10],[36,12,36,16],[36,17,36,24],[9,17,9,18],[9,15,9,16],[9,13,9,14],[8,24,10,24],[8,21,10,21],[7,17,8,18],[7,20,7,21],[6,19,10,19],[11,1,11,2],[9,0,9,2],[9,5,9,6],[7,15,8,16],[9,7,9,8],[9,3,9,4],[9,11,9,12],[7,11,8,12],[7,5,8,6],[7,3,8,4],[19,1,19,2],[24,1,24,2],[15,1,15,2],[16,1,16,2],[14,1,14,2],[6,15,6,16],[7,13,8,14],[6,11,6,12],[6,5,6,6],[6,7,6,8],[23,1,23,2],[17,1,17,2],[12,1,12,2],[34,1,34,2],[26,1,26,2],[18,1,18,2],[27,1,27,2],[25,1,25,2],[32,1,32,2],[30,1,30,2],[36,0,36,2],[10,0,10,2],[20,1,20,2],[21,1,21,2],[22,1,22,2],[31,1,31,2],[13,1,13,2],[33,1,33,2],[28,1,28,2],[29,1,29,2],[7,7,8,8],[1,17,1,18],[1,19,1,21],[1,22,1,24],[6,20,6,23],[6,17,6,18],[7,22,7,23],[6,13,6,14],[7,9,8,10],[8,20,10,20],[1,0,1,1],[6,0,8,2],[3,0,3,24],[8,22,10,22],[6,24,7,24],[8,23,10,23],[1,3,1,5],[6,9,6,10],[4,0,4,24],[1,6,1,16]]}
[]
["MEET DATE",null,null,"MEET SITE",null,null,null,null,null,null,null,null,null,null,null,null,null,"CLASS",null,null,null,null,"Jazz Category"]
[]
["Minnesota State High School League Dance Team Competition"]
["Judges Ranking Sheet - \"A\" RANK SYSTEM (7 or 8 judges)"]
[]
["Judges →",null,null,"Judge 1",null,"Judge 2",null,"Judge 3",null,"Judge 4",null,"Judge 5",null,"Judge 6",null,"Judge 7",null,"Judge 8",null,"Add Together the Ranks MINUS\n2 Worst Ranks & 1 Best Rank","TIE BREAKERS",null,null,null,"Final\nPlace"]
[null,null,null,null,null,null,null,null,null,null,null,null,null,null,null,null,null,null,null,null,"1st Tie Break",null,"2nd Tie Break"]
[null,null,null,null,null,null,null,null,null,null,null,null,null,null,null,null,null,null,null,null,"Add in 2nd Worst Rank","New Total Rank","Add in Worst & Best Ranks","New Total Rank"]
["Judges Initials →"]
["School",null,null,"Points","Rank","Points","Rank","Points","Rank","Points","Rank","Points","Rank","Points","Rank","Points","Rank","Points","Rank",null,null,null,null,null,null,null,"Best Rank","2nd Worst Rank","Worst Rank",null,null,null,"Best Rank","2nd Worst Rank","Worst Rank"]
[1,null,null,{"$f":"'Rank Wkst'!C8","v":""},{"$f":"'Rank Wkst'!G8","v":""},{"$f":"'Rank Wkst'!H8","v":""},{"$f":"'Rank Wkst'!L8","v":""},{"$f":"'Rank Wkst'!M8","v":""},{"$f":"'Rank Wkst'!Q8","v":""},{"$f":"'Rank Wkst'!R8","v":""},{"$f":"'Rank Wkst'!V8","v":""},{"$f":"'Rank Wkst'!W8","v":""},{"$f":"'Rank Wkst'!AA8","v":""},{"$f":"'Rank Wkst'!AB8","v":""},{"$f":"'Rank Wkst'!AF8","v":""},{"$f":"'Rank Wkst'!AG8","v":""},{"$f":"'Rank Wkst'!AK8","v":""},{"$f":"'Rank Wkst'!AL8","v":""},{"$f":"'Rank Wkst'!AP8","v":""},{"$f":"'Rank Wkst'!AX8","v":""},{"$f":"IF(AND('Rank Wkst'!BB8>1, D12<>\"DQ\"), 'Rank Wkst'!BF8, \"\")","v":""},{"$f":"IF(AND('Rank Wkst'!BB8>1, D12<>\"DQ\"),'Rank Wkst'!BK8, \"\")","v":""},{"$f":"IF(AND('Rank Wkst'!BI8>1, D12<>\"DQ\"), 'Rank Wkst'!BO8, \"\")","v":""},{"$f":"IF(AND('Rank Wkst'!BI8>1,D12<>\"DQ\"), 'Rank Wkst'!BT8, \"\")","v":""},{"$f":"IF('Rank Wkst'!AQ8<>0, 'Rank Wkst'!BW8, \"\")","v":""},null,{"$f":"IF('Rank Wkst'!C8=\"DQ\", \"\", 'Rank Wkst'!AR8)","v":0},{"$f":"IF('Rank Wkst'!C8=\"DQ\",\"\", 'Rank Wkst'!AT8)","v":0},{"$f":"IF('Rank Wkst'!C8=\"DQ\", \"\", 'Rank Wkst'!AU8)","v":0},null,null,null,{"$f":"'Rank Wkst'!AR8","v":0},{"$f":"'Rank Wkst'!AT8","v":0},{"$f":"'Rank Wkst'!AU8","v":0}]
[2,null,null,{"$f":"'Rank Wkst'!C9","v":""},{"$f":"'Rank Wkst'!G9","v":""},{"$f":"'Rank Wkst'!H9","v":""},{"$f":"'Rank Wkst'!L9","v":""},{"$f":"'Rank Wkst'!M9","v":""},{"$f":"'Rank Wkst'!Q9","v":""},{"$f":"'Rank Wkst'!R9","v":""},{"$f":"'Rank Wkst'!V9","v":""},{"$f":"'Rank Wkst'!W9","v":""},{"$f":"'Rank Wkst'!AA9","v":""},{"$f":"'Rank Wkst'!AB9","v":""},{"$f":"'Rank Wkst'!AF9","v":""},{"$f":"'Rank Wkst'!AG9","v":""},{"$f":"'Rank Wkst'!AK9","v":""},{"$f":"'Rank Wkst'!AL9","v":""},{"$f":"'Rank Wkst'!AP9","v":""},{"$f":"'Rank Wkst'!AX9","v":""},{"$f":"IF(AND('Rank Wkst'!BB9>1, D13<>\"DQ\"), 'Rank Wkst'!BF9, \"\")","v":""},{"$f":"IF(AND('Rank Wkst'!BB9>1, D13<>\"DQ\"),'Rank Wkst'!BK9, \"\")","v":""},{"$f":"IF(AND('Rank Wkst'!BI9>1, D13<>\"DQ\"), 'Rank Wkst'!BO9, \"\")","v":""},{"$f":"IF(AND('Rank Wkst'!BI9>1,D13<>\"DQ\"), 'Rank Wkst'!BT9, \"\")","v":""},{"$f":"IF('Rank Wkst'!AQ9<>0, 'Rank Wkst'!BW9, \"\")","v":""},null,{"$f":"IF('Rank Wkst'!C9=\"DQ\", \"\", 'Rank Wkst'!AR9)","v":0},{"$f":"IF('Rank Wkst'!C9=\"DQ\",\"\", 'Rank Wkst'!AT9)","v":0},{"$f":"IF('Rank Wkst'!C9=\"DQ\", \"\", 'Rank Wkst'!AU9)","v":0},null,null,null,{"$f":"'Rank Wkst'!AR9","v":0},{"$f":"'Rank Wkst'!AT9","v":0},{"$f":"'Rank Wkst'!AU9","v":0}]
[3,null,null,{"$f":"'Rank Wkst'!C10","v":""},{"$f":"'Rank Wkst'!G10","v":""},{"$f":"'Rank Wkst'!H10","v":""},{"$f":"'Rank Wkst'!L10","v":""},{"$f":"'Rank Wkst'!M10","v":""},{"$f":"'Rank Wkst'!Q10","v":""},{"$f":"'Rank Wkst'!R10","v":""},{"$f":"'Rank Wkst'!V10","v":""},{"$f":"'Rank Wkst'!W10","v":""},{"$f":"'Rank Wkst'!AA10","v":""},{"$f":"'Rank Wkst'!AB10","v":""},{"$f":"'Rank Wkst'!AF10","v":""},{"$f":"'Rank Wkst'!AG10","v":""},{"$f":"'Rank Wkst'!AK10","v":""},{"$f":"'Rank Wkst'!AL10","v":""},{"$f":"'Rank Wkst'!AP10","v":""},{"$f":"'Rank Wkst'!AX10","v":""},{"$f":"IF(AND('Rank Wkst'!BB10>1, D14<>\"DQ\"), 'Rank Wkst'!BF10, \"\")","v":""},{"$f":"IF(AND('Rank Wkst'!BB10>1, D14<>\"DQ\"),'Rank Wkst'!BK10, \"\")","v":""},{"$f":"IF(AND('Rank Wkst'!BI10>1, D14<>\"DQ\"), 'Rank Wkst'!BO10, \"\")","v":""},{"$f":"IF(AND('Rank Wkst'!BI10>1,D14<>\"DQ\"), 'Rank Wkst'!BT10, \"\")","v":""},{"$f":"IF('Rank Wkst'!AQ10<>0, 'Rank Wkst'!BW10, \"\")","v":""},null,{"$f":"IF('Rank Wkst'!C10=\"DQ\", \"\", 'Rank Wkst'!AR10)","v":0},{"$f":"IF('Rank Wkst'!C10=\"DQ\",\"\", 'Rank Wkst'!AT10)","v":0},{"$f":"IF('Rank Wkst'!C10=\"DQ\", \"\", 'Rank Wkst'!AU10)","v":0},null,null,null,{"$f":"'Rank Wkst'!AR10","v":0},{"$f":"'Rank Wkst'!AT10","v":0},{"$f":"'Rank Wkst'!AU10","v":0}]
[4,null,null,{"$f":"'Rank Wkst'!C11","v":""},{"$f":"'Rank Wkst'!G11","v":""},{"$f":"'Rank Wkst'!H11","v":""},{"$f":"'Rank Wkst'!L11","v":""},{"$f":"'Rank Wkst'!M11","v":""},{"$f":"'Rank Wkst'!Q11","v":""},{"$f":"'Rank Wkst'!R11","v":""},{"$f":"'Rank Wkst'!V11","v":""},{"$f":"'Rank Wkst'!W11","v":""},{"$f":"'Rank Wkst'!AA11","v":""},{"$f":"'Rank Wkst'!AB11","v":""},{"$f":"'Rank Wkst'!AF11","v":""},{"$f":"'Rank Wkst'!AG11","v":""},{"$f":"'Rank Wkst'!AK11","v":""},{"$f":"'Rank Wkst'!AL11","v":""},{"$f":"'Rank Wkst'!AP11","v":""},{"$f":"'Rank Wkst'!AX11","v":""},{"$f":"IF(AND('Rank Wkst'!BB11>1, D15<>\"DQ\"), 'Rank Wkst'!BF11, \"\")","v":""},{"$f":"IF(AND('Rank Wkst'!BB11>1, D15<>\"DQ\"),'Rank Wkst'!BK11, \"\")","v":""},{"$f":"IF(AND('Rank Wkst'!BI11>1, D15<>\"DQ\"), 'Rank Wkst'!BO11, \"\")","v":""},{"$f":"IF(AND('Rank Wkst'!BI11>1,D15<>\"DQ\"), 'Rank Wkst'!BT11, \"\")","v":""},{"$f":"IF('Rank Wkst'!AQ11<>0, 'Rank Wkst'!BW11, \"\")","v":""},null,{"$f":"IF('Rank Wkst'!C11=\"DQ\", \"\", 'Rank Wkst'!AR11)","v":0},{"$f":"IF('Rank Wkst'!C11=\"DQ\",\"\", 'Rank Wkst'!AT11)","v":0},{"$f":"IF('Rank Wkst'!C11=\"DQ\", \"\", 'Rank Wkst'!AU11)","v":0},null,null,null,{"$f":"'Rank Wkst'!AR11","v":0},{"$f":"'Rank Wkst'!AT11","v":0},{"$f":"'Rank Wkst'!AU11","v":0}]
[5,null,null,{"$f":"'Rank Wkst'!C12","v":""},{"$f":"'Rank Wkst'!G12","v":""},{"$f":"'Rank Wkst'!H12","v":""},{"$f":"'Rank Wkst'!L12","v":""},{"$f":"'Rank Wkst'!M12","v":""},{"$f":"'Rank Wkst'!Q12","v":""},{"$f":"'Rank Wkst'!R12","v":""},{"$f":"'Rank Wkst'!V12","v":""},{"$f":"'Rank Wkst'!W12","v":""},{"$f":"'Rank Wkst'!AA12","v":""},{"$f":"'Rank Wkst'!AB12","v":""},{"$f":"'Rank Wkst'!AF12","v":""},{"$f":"'Rank Wkst'!AG12","v":""},{"$f":"'Rank Wkst'!AK12","v":""},{"$f":"'Rank Wkst'!AL12","v":""},{"$f":"'Rank Wkst'!AP12","v":""},{"$f":"'Rank Wkst'!AX12","v":""},{"$f":"IF(AND('Rank Wkst'!BB12>1, D16<>\"DQ\"), 'Rank Wkst'!BF12, \"\")","v":""},{"$f":"IF(AND('Rank Wkst'!BB12>1, D16<>\"DQ\"),'Rank Wkst'!BK12, \"\")","v":""},{"$f":"IF(AND('Rank Wkst'!BI12>1, D16<>\"DQ\"), 'Rank Wkst'!BO12, \"\")","v":""},{"$f":"IF(AND('Rank Wkst'!BI12>1,D16<>\"DQ\"), 'Rank Wkst'!BT12, \"\")","v":""},{"$f":"IF('Rank Wkst'!AQ12<>0, 'Rank Wkst'!BW12, \"\")","v":""},null,{"$f":"IF('Rank Wkst'!C12=\"DQ\", \"\", 'Rank Wkst'!AR12)","v":0},{"$f":"IF('Rank Wkst'!C12=\"DQ\",\"\", 'Rank Wkst'!AT12)","v":0},{"$f":"IF('Rank Wkst'!C12=\"DQ\", \"\", 'Rank Wkst'!AU12)","v":0},null,null,null,{"$f":"'Rank Wkst'!AR12","v":0},{"$f":"'Rank Wkst'!AT12","v":0},{"$f":"'Rank Wkst'!AU12","v":0}]
[6,null,null,{"$f":"'Rank Wkst'!C13","v":""},{"$f":"'Rank Wkst'!G13","v":""},{"$f":"'Rank Wkst'!H13","v":""},{"$f":"'Rank Wkst'!L13","v":""},{"$f":"'Rank Wkst'!M13","v":""},{"$f":"'Rank Wkst'!Q13","v":""},{"$f":"'Rank Wkst'!R13","v":""},{"$f":"'Rank Wkst'!V13","v":""},{"$f":"'Rank Wkst'!W13","v":""},{"$f":"'Rank Wkst'!AA13","v":""},{"$f":"'Rank Wkst'!AB13","v":""},{"$f":"'Rank Wkst'!AF13","v":""},{"$f":"'Rank Wkst'!AG13","v":""},{"$f":"'Rank Wkst'!AK13","v":""},{"$f":"'Rank Wkst'!AL13","v":""},{"$f":"'Rank Wkst'!AP13","v":""},{"$f":"'Rank Wkst'!AX13","v":""},{"$f":"IF(AND('Rank Wkst'!BB13>1, D17<>\"DQ\"), 'Rank Wkst'!BF13, \"\")","v":""},{"$f":"IF(AND('Rank Wkst'!BB13>1, D17<>\"DQ\"),'Rank Wkst'!BK13, \"\")","v":""},{"$f":"IF(AND('Rank Wkst'!BI13>1, D17<>\"DQ\"), 'Rank Wkst'!BO13, \"\")","v":""},{"$f":"IF(AND('Rank Wkst'!BI13>1,D17<>\"DQ\"), 'Rank Wkst'!BT13, \"\")","v":""},{"$f":"IF('Rank Wkst'!AQ13<>0, 'Rank Wkst'!BW13, \"\")","v":""},null,{"$f":"IF('Rank Wkst'!C13=\"DQ\", \"\", 'Rank Wkst'!AR13)","v":0},{"$f":"IF('Rank Wkst'!C13=\"DQ\",\"\", 'Rank Wkst'!AT13)","v":0},{"$f":"IF('Rank Wkst'!C13=\"DQ\", \"\", 'Rank Wkst'!AU13)","v":0},null,null,null,{"$f":"'Rank Wkst'!AR13","v":0},{"$f":"'Rank Wkst'!AT13","v":0},{"$f":"'Rank Wkst'!AU13","v":0}]
[7,null,null,{"$f":"'Rank Wkst'!C14","v":""},{"$f":"'Rank Wkst'!G14","v":""},{"$f":"'Rank Wkst'!H14","v":""},{"$f":"'Rank Wkst'!L14","v":""},{"$f":"'Rank Wkst'!M14","v":""},{"$f":"'Rank Wkst'!Q14","v":""},{"$f":"'Rank Wkst'!R14","v":""},{"$f":"'Rank Wkst'!V14","v":""},{"$f":"'Rank Wkst'!W14","v":""},{"$f":"'Rank Wkst'!AA14","v":""},{"$f":"'Rank Wkst'!AB14","v":""},{"$f":"'Rank Wkst'!AF14","v":""},{"$f":"'Rank Wkst'!AG14","v":""},{"$f":"'Rank Wkst'!AK14","v":""},{"$f":"'Rank Wkst'!AL14","v":""},{"$f":"'Rank Wkst'!AP14","v":""},{"$f":"'Rank Wkst'!AX14","v":""},{"$f":"IF(AND('Rank Wkst'!BB14>1, D18<>\"DQ\"), 'Rank Wkst'!BF14, \"\")","v":""},{"$f":"IF(AND('Rank Wkst'!BB14>1, D18<>\"DQ\"),'Rank Wkst'!BK14, \"\")","v":""},{"$f":"IF(AND('Rank Wkst'!BI14>1, D18<>\"DQ\"), 'Rank Wkst'!BO14, \"\")","v":""},{"$f":"IF(AND('Rank Wkst'!BI14>1,D18<>\"DQ\"), 'Rank Wkst'!BT14, \"\")","v":""},{"$f":"IF('Rank Wkst'!AQ14<>0, 'Rank Wkst'!BW14, \"\")","v":""},null,{"$f":"IF('Rank Wkst'!C14=\"DQ\", \"\", 'Rank Wkst'!AR14)","v":0},{"$f":"IF('Rank Wkst'!C14=\"DQ\",\"\", 'Rank Wkst'!AT14)","v":0},{"$f":"IF('Rank Wkst'!C14=\"DQ\", \"\", 'Rank Wkst'!AU14)","v":0},null,null,null,{"$f":"'Rank Wkst'!AR14","v":0},{"$f":"'Rank Wkst'!AT14","v":0},{"$f":"'Rank Wkst'!AU14","v":0}]
[8,null,null,{"$f":"'Rank Wkst'!C15","v":""},{"$f":"'Rank Wkst'!G15","v":""},{"$f":"'Rank Wkst'!H15","v":""},{"$f":"'Rank Wkst'!L15","v":""},{"$f":"'Rank Wkst'!M15","v":""},{"$f":"'Rank Wkst'!Q15","v":""},{"$f":"'Rank Wkst'!R15","v":""},{"$f":"'Rank Wkst'!V15","v":""},{"$f":"'Rank Wkst'!W15","v":""},{"$f":"'Rank Wkst'!AA15","v":""},{"$f":"'Rank Wkst'!AB15","v":""},{"$f":"'Rank Wkst'!AF15","v":""},{"$f":"'Rank Wkst'!AG15","v":""},{"$f":"'Rank Wkst'!AK15","v":""},{"$f":"'Rank Wkst'!AL15","v":""},{"$f":"'Rank Wkst'!AP15","v":""},{"$f":"'Rank Wkst'!AX15","v":""},{"$f":"IF(AND('Rank Wkst'!BB15>1, D19<>\"DQ\"), 'Rank Wkst'!BF15, \"\")","v":""},{"$f":"IF(AND('Rank Wkst'!BB15>1, D19<>\"DQ\"),'Rank Wkst'!BK15, \"\")","v":""},{"$f":"IF(AND('Rank Wkst'!BI15>1, D19<>\"DQ\"), 'Rank Wkst'!BO15, \"\")","v":""},{"$f":"IF(AND('Rank Wkst'!BI15>1,D19<>\"DQ\"), 'Rank Wkst'!BT15, \"\")","v":""},{"$f":"IF('Rank Wkst'!AQ15<>0, 'Rank Wkst'!BW15, \"\")","v":""},null,{"$f":"IF('Rank Wkst'!C15=\"DQ\", \"\", 'Rank Wkst'!AR15)","v":0},{"$f":"IF('Rank Wkst'!C15=\"DQ\",\"\", 'Rank Wkst'!AT15)","v":0},{"$f":"IF('Rank Wkst'!C15=\"DQ\", \"\", 'Rank Wkst'!AU15)","v":0},null,null,null,{"$f":"'Rank Wkst'!AR15","v":0},{"$f":"'Rank Wkst'!AT15","v":0},{"$f":"'Rank Wkst'!AU15","v":0}]
[9,null,null,{"$f":"'Rank Wkst'!C16","v":""},{"$f":"'Rank Wkst'!G16","v":""},{"$f":"'Rank Wkst'!H16","v":""},{"$f":"'Rank Wkst'!L16","v":""},{"$f":"'Rank Wkst'!M16","v":""},{"$f":"'Rank Wkst'!Q16","v":""},{"$f":"'Rank Wkst'!R16","v":""},{"$f":"'Rank Wkst'!V16","v":""},{"$f":"'Rank Wkst'!W16","v":""},{"$f":"'Rank Wkst'!AA16","v":""},{"$f":"'Rank Wkst'!AB16","v":""},{"$f":"'Rank Wkst'!AF16","v":""},{"$f":"'Rank Wkst'!AG16","v":""},{"$f":"'Rank Wkst'!AK16","v":""},{"$f":"'Rank Wkst'!AL16","v":""},{"$f":"'Rank Wkst'!AP16","v":""},{"$f":"'Rank Wkst'!AX16","v":""},{"$f":"IF(AND('Rank Wkst'!BB16>1, D20<>\"DQ\"), 'Rank Wkst'!BF16, \"\")","v":""},{"$f":"IF(AND('Rank Wkst'!BB16>1, D20<>\"DQ\"),'Rank Wkst'!BK16, \"\")","v":""},{"$f":"IF(AND('Rank Wkst'!BI16>1, D20<>\"DQ\"), 'Rank Wkst'!BO16, \"\")","v":""},{"$f":"IF(AND('Rank Wkst'!BI16>1,D20<>\"DQ\"), 'Rank Wkst'!BT16, \"\")","v":""},{"$f":"IF('Rank Wkst'!AQ16<>0, 'Rank Wkst'!BW16, \"\")","v":""},null,{"$f":"IF('Rank Wkst'!C16=\"DQ\", \"\", 'Rank Wkst'!AR16)","v":0},{"$f":"IF('Rank Wkst'!C16=\"DQ\",\"\", 'Rank Wkst'!AT16)","v":0},{"$f":"IF('Rank Wkst'!C16=\"DQ\", \"\", 'Rank Wkst'!AU16)","v":0},null,null,null,{"$f":"'Rank Wkst'!AR16","v":0},{"$f":"'Rank Wkst'!AT16","v":0},{"$f":"'Rank Wkst'!AU16","v":0}]
[10,null,null,{"$f":"'Rank Wkst'!C17","v":""},{"$f":"'Rank Wkst'!G17","v":""},{"$f":"'Rank Wkst'!H17","v":""},{"$f":"'Rank Wkst'!L17","v":""},{"$f":"'Rank Wkst'!M17","v":""},{"$f":"'Rank Wkst'!Q17","v":""},{"$f":"'Rank Wkst'!R17","v":""},{"$f":"'Rank Wkst'!V17","v":""},{"$f":"'Rank Wkst'!W17","v":""},{"$f":"'Rank Wkst'!AA17","v":""},{"$f":"'Rank Wkst'!AB17","v":""},{"$f":"'Rank Wkst'!AF17","v":""},{"$f":"'Rank Wkst'!AG17","v":""},{"$f":"'Rank Wkst'!AK17","v":""},{"$f":"'Rank Wkst'!AL17","v":""},{"$f":"'Rank Wkst'!AP17","v":""},{"$f":"'Rank Wkst'!AX17","v":""},{"$f":"IF(AND('Rank Wkst'!BB17>1, D21<>\"DQ\"), 'Rank Wkst'!BF17, \"\")","v":""},{"$f":"IF(AND('Rank Wkst'!BB17>1, D21<>\"DQ\"),'Rank Wkst'!BK17, \"\")","v":""},{"$f":"IF(AND('Rank Wkst'!BI17>1, D21<>\"DQ\"), 'Rank Wkst'!BO17, \"\")","v":""},{"$f":"IF(AND('Rank Wkst'!BI17>1,D21<>\"DQ\"), 'Rank Wkst'!BT17, \"\")","v":""},{"$f":"IF('Rank Wkst'!AQ17<>0, 'Rank Wkst'!BW17, \"\")","v":""},null,{"$f":"IF('Rank Wkst'!C17=\"DQ\", \"\", 'Rank Wkst'!AR17)","v":0},{"$f":"IF('Rank Wkst'!C17=\"DQ\",\"\", 'Rank Wkst'!AT17)","v":0},{"$f":"IF('Rank Wkst'!C17=\"DQ\", \"\", 'Rank Wkst'!AU17)","v":0},null,null,null,{"$f":"'Rank Wkst'!AR17","v":0},{"$f":"'Rank Wkst'!AT17","v":0},{"$f":"'Rank Wkst'!AU17","v":0}]
[11,null,null,{"$f":"'Rank Wkst'!C18","v":""},{"$f":"'Rank Wkst'!G18","v":""},{"$f":"'Rank Wkst'!H18","v":""},{"$f":"'Rank Wkst'!L18","v":""},{"$f":"'Rank Wkst'!M18","v":""},{"$f":"'Rank Wkst'!Q18","v":""},{"$f":"'Rank Wkst'!R18","v":""},{"$f":"'Rank Wkst'!V18","v":""},{"$f":"'Rank Wkst'!W18","v":""},{"$f":"'Rank Wkst'!AA18","v":""},{"$f":"'Rank Wkst'!AB18","v":""},{"$f":"'Rank Wkst'!AF18","v":""},{"$f":"'Rank Wkst'!AG18","v":""},{"$f":"'Rank Wkst'!AK18","v":""},{"$f":"'Rank Wkst'!AL18","v":""},{"$f":"'Rank Wkst'!AP18","v":""},{"$f":"'Rank Wkst'!AX18","v":""},{"$f":"IF(AND('Rank Wkst'!BB18>1, D22<>\"DQ\"), 'Rank Wkst'!BF18, \"\")","v":""},{"$f":"IF(AND('Rank Wkst'!BB18>1, D22<>\"DQ\"),'Rank Wkst'!BK18, \"\")","v":""},{"$f":"IF(AND('Rank Wkst'!BI18>1, D22<>\"DQ\"), 'Rank Wkst'!BO18, \"\")","v":""},{"$f":"IF(AND('Rank Wkst'!BI18>1,D22<>\"DQ\"), 'Rank Wkst'!BT18, \"\")","v":""},{"$f":"IF('Rank Wkst'!AQ18<>0, 'Rank Wkst'!BW18, \"\")","v":""},null,{"$f":"IF('Rank Wkst'!C18=\"DQ\", \"\", 'Rank Wkst'!AR18)","v":0},{"$f":"IF('Rank Wkst'!C18=\"DQ\",\"\", 'Rank Wkst'!AT18)","v":0},{"$f":"IF('Rank Wkst'!C18=\"DQ\", \"\", 'Rank Wkst'!AU18)","v":0},null,null,null,{"$f":"'Rank Wkst'!AR18","v":0},{"$f":"'Rank Wkst'!AT18","v":0},{"$f":"'Rank Wkst'!AU18","v":0}]
[12,null,null,{"$f":"'Rank Wkst'!C19","v":""},{"$f":"'Rank Wkst'!G19","v":""},{"$f":"'Rank Wkst'!H19","v":""},{"$f":"'Rank Wkst'!L19","v":""},{"$f":"'Rank Wkst'!M19","v":""},{"$f":"'Rank Wkst'!Q19","v":""},{"$f":"'Rank Wkst'!R19","v":""},{"$f":"'Rank Wkst'!V19","v":""},{"$f":"'Rank Wkst'!W19","v":""},{"$f":"'Rank Wkst'!AA19","v":""},{"$f":"'Rank Wkst'!AB19","v":""},{"$f":"'Rank Wkst'!AF19","v":""},{"$f":"'Rank Wkst'!AG19","v":""},{"$f":"'Rank Wkst'!AK19","v":""},{"$f":"'Rank Wkst'!AL19","v":""},{"$f":"'Rank Wkst'!AP19","v":""},{"$f":"'Rank Wkst'!AX19","v":""},{"$f":"IF(AND('Rank Wkst'!BB19>1, D23<>\"DQ\"), 'Rank Wkst'!BF19, \"\")","v":""},{"$f":"IF(AND('Rank Wkst'!BB19>1, D23<>\"DQ\"),'Rank Wkst'!BK19, \"\")","v":""},{"$f":"IF(AND('Rank Wkst'!BI19>1, D23<>\"DQ\"), 'Rank Wkst'!BO19, \"\")","v":""},{"$f":"IF(AND('Rank Wkst'!BI19>1,D23<>\"DQ\"), 'Rank Wkst'!BT19, \"\")","v":""},{"$f":"IF('Rank Wkst'!AQ19<>0, 'Rank Wkst'!BW19, \"\")","v":""},null,{"$f":"IF('Rank Wkst'!C19=\"DQ\", \"\", 'Rank Wkst'!AR19)","v":0},{"$f":"IF('Rank Wkst'!C19=\"DQ\",\"\", 'Rank Wkst'!AT19)","v":0},{"$f":"IF('Rank Wkst'!C19=\"DQ\", \"\", 'Rank Wkst'!AU19)","v":0},null,null,null,{"$f":"'Rank Wkst'!AR19","v":0},{"$f":"'Rank Wkst'!AT19","v":0},{"$f":"'Rank Wkst'!AU19","v":0}]
[13,null,null,{"$f":"'Rank Wkst'!C20","v":""},{"$f":"'Rank Wkst'!G20","v":""},{"$f":"'Rank Wkst'!H20","v":""},{"$f":"'Rank Wkst'!L20","v":""},{"$f":"'Rank Wkst'!M20","v":""},{"$f":"'Rank Wkst'!Q20","v":""},{"$f":"'Rank Wkst'!R20","v":""},{"$f":"'Rank Wkst'!V20","v":""},{"$f":"'Rank Wkst'!W20","v":""},{"$f":"'Rank Wkst'!AA20","v":""},{"$f":"'Rank Wkst'!AB20","v":""},{"$f":"'Rank Wkst'!AF20","v":""},{"$f":"'Rank Wkst'!AG20","v":""},{"$f":"'Rank Wkst'!AK20","v":""},{"$f":"'Rank Wkst'!AL20","v":""},{"$f":"'Rank Wkst'!AP20","v":""},{"$f":"'Rank Wkst'!AX20","v":""},{"$f":"IF(AND('Rank Wkst'!BB20>1, D24<>\"DQ\"), 'Rank Wkst'!BF20, \"\")","v":""},{"$f":"IF(AND('Rank Wkst'!BB20>1, D24<>\"DQ\"),'Rank Wkst'!BK20, \"\")","v":""},{"$f":"IF(AND('Rank Wkst'!BI20>1, D24<>\"DQ\"), 'Rank Wkst'!BO20, \"\")","v":""},{"$f":"IF(AND('Rank Wkst'!BI20>1,D24<>\"DQ\"), 'Rank Wkst'!BT20, \"\")","v":""},{"$f":"IF('Rank Wkst'!AQ20<>0, 'Rank Wkst'!BW20, \"\")","v":""},null,{"$f":"IF('Rank Wkst'!C20=\"DQ\", \"\", 'Rank Wkst'!AR20)","v":0},{"$f":"IF('Rank Wkst'!C20=\"DQ\",\"\", 'Rank Wkst'!AT20)","v":0},{"$f":"IF('Rank Wkst'!C20=\"DQ\", \"\", 'Rank Wkst'!AU20)","v":0},null,null,null,{"$f":"'Rank Wkst'!AR20","v":0},{"$f":"'Rank Wkst'!AT20","v":0},{"$f":"'Rank Wkst'!AU20","v":0}]
[14,null,null,{"$f":"'Rank Wkst'!C21","v":""},{"$f":"'Rank Wkst'!G21","v":""},{"$f":"'Rank Wkst'!H21","v":""},{"$f":"'Rank Wkst'!L21","v":""},{"$f":"'Rank Wkst'!M21","v":""},{"$f":"'Rank Wkst'!Q21","v":""},{"$f":"'Rank Wkst'!R21","v":""},{"$f":"'Rank Wkst'!V21","v":""},{"$f":"'Rank Wkst'!W21","v":""},{"$f":"'Rank Wkst'!AA21","v":""},{"$f":"'Rank Wkst'!AB21","v":""},{"$f":"'Rank Wkst'!AF21","v":""},{"$f":"'Rank Wkst'!AG21","v":""},{"$f":"'Rank Wkst'!AK21","v":""},{"$f":"'Rank Wkst'!AL21","v":""},{"$f":"'Rank Wkst'!AP21","v":""},{"$f":"'Rank Wkst'!AX21","v":""},{"$f":"IF(AND('Rank Wkst'!BB21>1, D25<>\"DQ\"), 'Rank Wkst'!BF21, \"\")","v":""},{"$f":"IF(AND('Rank Wkst'!BB21>1, D25<>\"DQ\"),'Rank Wkst'!BK21, \"\")","v":""},{"$f":"IF(AND('Rank Wkst'!BI21>1, D25<>\"DQ\"), 'Rank Wkst'!BO21, \"\")","v":""},{"$f":"IF(AND('Rank Wkst'!BI21>1,D25<>\"DQ\"), 'Rank Wkst'!BT21, \"\")","v":""},{"$f":"IF('Rank Wkst'!AQ21<>0, 'Rank Wkst'!BW21, \"\")","v":""},null,{"$f":"IF('Rank Wkst'!C21=\"DQ\", \"\", 'Rank Wkst'!AR21)","v":0},{"$f":"IF('Rank Wkst'!C21=\"DQ\",\"\", 'Rank Wkst'!AT21)","v":0},{"$f":"IF('Rank Wkst'!C21=\"DQ\", \"\", 'Rank Wkst'!AU21)","v":0},null,null,null,{"$f":"'Rank Wkst'!AR21","v":0},{"$f":"'Rank Wkst'!AT21","v":0},{"$f":"'Rank Wkst'!AU21","v":0}]
[15,null,null,{"$f":"'Rank Wkst'!C22","v":""},{"$f":"'Rank Wkst'!G22","v":""},{"$f":"'Rank Wkst'!H22","v":""},{"$f":"'Rank Wkst'!L22","v":""},{"$f":"'Rank Wkst'!M22","v":""},{"$f":"'Rank Wkst'!Q22","v":""},{"$f":"'Rank Wkst'!R22","v":""},{"$f":"'Rank Wkst'!V22","v":""},{"$f":"'Rank Wkst'!W22","v":""},{"$f":"'Rank Wkst'!AA22","v":""},{"$f":"'Rank Wkst'!AB22","v":""},{"$f":"'Rank Wkst'!AF22","v":""},{"$f":"'Rank Wkst'!AG22","v":""},{"$f":"'Rank Wkst'!AK22","v":""},{"$f":"'Rank Wkst'!AL22","v":""},{"$f":"'Rank Wkst'!AP22","v":""},{"$f":"'Rank Wkst'!AX22","v":""},{"$f":"IF(AND('Rank Wkst'!BB22>1, D26<>\"DQ\"), 'Rank Wkst'!BF22, \"\")","v":""},{"$f":"IF(AND('Rank Wkst'!BB22>1, D26<>\"DQ\"),'Rank Wkst'!BK22, \"\")","v":""},{"$f":"IF(AND('Rank Wkst'!BI22>1, D26<>\"DQ\"), 'Rank Wkst'!BO22, \"\")","v":""},{"$f":"IF(AND('Rank Wkst'!BI22>1,D26<>\"DQ\"), 'Rank Wkst'!BT22, \"\")","v":""},{"$f":"IF('Rank Wkst'!AQ22<>0, 'Rank Wkst'!BW22, \"\")","v":""},null,{"$f":"IF('Rank Wkst'!C22=\"DQ\", \"\", 'Rank Wkst'!AR22)","v":0},{"$f":"IF('Rank Wkst'!C22=\"DQ\",\"\", 'Rank Wkst'!AT22)","v":0},{"$f":"IF('Rank Wkst'!C22=\"DQ\", \"\", 'Rank Wkst'!AU22)","v":0},null,null,null,{"$f":"'Rank Wkst'!AR22","v":0},{"$f":"'Rank Wkst'!AT22","v":0},{"$f":"'Rank Wkst'!AU22","v":0}]
[16,null,null,{"$f":"'Rank Wkst'!C23","v":""},{"$f":"'Rank Wkst'!G23","v":""},{"$f":"'Rank Wkst'!H23","v":""},{"$f":"'Rank Wkst'!L23","v":""},{"$f":"'Rank Wkst'!M23","v":""},{"$f":"'Rank Wkst'!Q23","v":""},{"$f":"'Rank Wkst'!R23","v":""},{"$f":"'Rank Wkst'!V23","v":""},{"$f":"'Rank Wkst'!W23","v":""},{"$f":"'Rank Wkst'!AA23","v":""},{"$f":"'Rank Wkst'!AB23","v":""},{"$f":"'Rank Wkst'!AF23","v":""},{"$f":"'Rank Wkst'!AG23","v":""},{"$f":"'Rank Wkst'!AK23","v":""},{"$f":"'Rank Wkst'!AL23","v":""},{"$f":"'Rank Wkst'!AP23","v":""},{"$f":"'Rank Wkst'!AX23","v":""},{"$f":"IF(AND('Rank Wkst'!BB23>1, D27<>\"DQ\"), 'Rank Wkst'!BF23, \"\")","v":""},{"$f":"IF(AND('Rank Wkst'!BB23>1, D27<>\"DQ\"),'Rank Wkst'!BK23, \"\")","v":""},{"$f":"IF(AND('Rank Wkst'!BI23>1, D27<>\"DQ\"), 'Rank Wkst'!BO23, \"\")","v":""},{"$f":"IF(AND('Rank Wkst'!BI23>1,D27<>\"DQ\"), 'Rank Wkst'!BT23, \"\")","v":""},{"$f":"IF('Rank Wkst'!AQ23<>0, 'Rank Wkst'!BW23, \"\")","v":""},null,{"$f":"IF('Rank Wkst'!C23=\"DQ\", \"\", 'Rank Wkst'!AR23)","v":0},{"$f":"IF('Rank Wkst'!C23=\"DQ\",\"\", 'Rank Wkst'!AT23)","v":0},{"$f":"IF('Rank Wkst'!C23=\"DQ\", \"\", 'Rank Wkst'!AU23)","v":0},null,null,null,{"$f":"'Rank Wkst'!AR23","v":0},{"$f":"'Rank Wkst'!AT23","v":0},{"$f":"'Rank Wkst'!AU23","v":0}]
[17,null,null,{"$f":"'Rank Wkst'!C24","v":""},{"$f":"'Rank Wkst'!G24","v":""},{"$f":"'Rank Wkst'!H24","v":""},{"$f":"'Rank Wkst'!L24","v":""},{"$f":"'Rank Wkst'!M24","v":""},{"$f":"'Rank Wkst'!Q24","v":""},{"$f":"'Rank Wkst'!R24","v":""},{"$f":"'Rank Wkst'!V24","v":""},{"$f":"'Rank Wkst'!W24","v":""},{"$f":"'Rank Wkst'!AA24","v":""},{"$f":"'Rank Wkst'!AB24","v":""},{"$f":"'Rank Wkst'!AF24","v":""},{"$f":"'Rank Wkst'!AG24","v":""},{"$f":"'Rank Wkst'!AK24","v":""},{"$f":"'Rank Wkst'!AL24","v":""},{"$f":"'Rank Wkst'!AP24","v":""},{"$f":"'Rank Wkst'!AX24","v":""},{"$f":"IF(AND('Rank Wkst'!BB24>1, D28<>\"DQ\"), 'Rank Wkst'!BF24, \"\")","v":""},{"$f":"IF(AND('Rank Wkst'!BB24>1, D28<>\"DQ\"),'Rank Wkst'!BK24, \"\")","v":""},{"$f":"IF(AND('Rank Wkst'!BI24>1, D28<>\"DQ\"), 'Rank Wkst'!BO24, \"\")","v":""},{"$f":"IF(AND('Rank Wkst'!BI24>1,D28<>\"DQ\"), 'Rank Wkst'!BT24, \"\")","v":""},{"$f":"IF('Rank Wkst'!AQ24<>0, 'Rank Wkst'!BW24, \"\")","v":""},null,{"$f":"IF('Rank Wkst'!C24=\"DQ\", \"\", 'Rank Wkst'!AR24)","v":0},{"$f":"IF('Rank Wkst'!C24=\"DQ\",\"\", 'Rank Wkst'!AT24)","v":0},{"$f":"IF('Rank Wkst'!C24=\"DQ\", \"\", 'Rank Wkst'!AU24)","v":0},null,null,null,{"$f":"'Rank Wkst'!AR24","v":0},{"$f":"'Rank Wkst'!AT24","v":0},{"$f":"'Rank Wkst'!AU24","v":0}]
[18,null,null,{"$f":"'Rank Wkst'!C25","v":""},{"$f":"'Rank Wkst'!G25","v":""},{"$f":"'Rank Wkst'!H25","v":""},{"$f":"'Rank Wkst'!L25","v":""},{"$f":"'Rank Wkst'!M25","v":""},{"$f":"'Rank Wkst'!Q25","v":""},{"$f":"'Rank Wkst'!R25","v":""},{"$f":"'Rank Wkst'!V25","v":""},{"$f":"'Rank Wkst'!W25","v":""},{"$f":"'Rank Wkst'!AA25","v":""},{"$f":"'Rank Wkst'!AB25","v":""},{"$f":"'Rank Wkst'!AF25","v":""},{"$f":"'Rank Wkst'!AG25","v":""},{"$f":"'Rank Wkst'!AK25","v":""},{"$f":"'Rank Wkst'!AL25","v":""},{"$f":"'Rank Wkst'!AP25","v":""},{"$f":"'Rank Wkst'!AX25","v":""},{"$f":"IF(AND('Rank Wkst'!BB25>1, D29<>\"DQ\"), 'Rank Wkst'!BF25, \"\")","v":""},{"$f":"IF(AND('Rank Wkst'!BB25>1, D29<>\"DQ\"),'Rank Wkst'!BK25, \"\")","v":""},{"$f":"IF(AND('Rank Wkst'!BI25>1, D29<>\"DQ\"), 'Rank Wkst'!BO25, \"\")","v":""},{"$f":"IF(AND('Rank Wkst'!BI25>1,D29<>\"DQ\"), 'Rank Wkst'!BT25, \"\")","v":""},{"$f":"IF('Rank Wkst'!AQ25<>0, 'Rank Wkst'!BW25, \"\")","v":""},null,{"$f":"IF('Rank Wkst'!C25=\"DQ\", \"\", 'Rank Wkst'!AR25)","v":0},{"$f":"IF('Rank Wkst'!C25=\"DQ\",\"\", 'Rank Wkst'!AT25)","v":0},{"$f":"IF('Rank Wkst'!C25=\"DQ\", \"\", 'Rank Wkst'!AU25)","v":0},null,null,null,{"$f":"'Rank Wkst'!AR25","v":0},{"$f":"'Rank Wkst'!AT25","v":0},{"$f":"'Rank Wkst'!AU25","v":0}]
[19,null,null,{"$f":"'Rank Wkst'!C26","v":""},{"$f":"'Rank Wkst'!G26","v":""},{"$f":"'Rank Wkst'!H26","v":""},{"$f":"'Rank Wkst'!L26","v":""},{"$f":"'Rank Wkst'!M26","v":""},{"$f":"'Rank Wkst'!Q26","v":""},{"$f":"'Rank Wkst'!R26","v":""},{"$f":"'Rank Wkst'!V26","v":""},{"$f":"'Rank Wkst'!W26","v":""},{"$f":"'Rank Wkst'!AA26","v":""},{"$f":"'Rank Wkst'!AB26","v":""},{"$f":"'Rank Wkst'!AF26","v":""},{"$f":"'Rank Wkst'!AG26","v":""},{"$f":"'Rank Wkst'!AK26","v":""},{"$f":"'Rank Wkst'!AL26","v":""},{"$f":"'Rank Wkst'!AP26","v":""},{"$f":"'Rank Wkst'!AX26","v":""},{"$f":"IF(AND('Rank Wkst'!BB26>1, D30<>\"DQ\"), 'Rank Wkst'!BF26, \"\")","v":""},{"$f":"IF(AND('Rank Wkst'!BB26>1, D30<>\"DQ\"),'Rank Wkst'!BK26, \"\")","v":""},{"$f":"IF(AND('Rank Wkst'!BI26>1, D30<>\"DQ\"), 'Rank Wkst'!BO26, \"\")","v":""},{"$f":"IF(AND('Rank Wkst'!BI26>1,D30<>\"DQ\"), 'Rank Wkst'!BT26, \"\")","v":""},{"$f":"IF('Rank Wkst'!AQ26<>0, 'Rank Wkst'!BW26, \"\")","v":""},null,{"$f":"IF('Rank Wkst'!C26=\"DQ\", \"\", 'Rank Wkst'!AR26)","v":0},{"$f":"IF('Rank Wkst'!C26=\"DQ\",\"\", 'Rank Wkst'!AT26)","v":0},{"$f":"IF('Rank Wkst'!C26=\"DQ\", \"\", 'Rank Wkst'!AU26)","v":0},null,null,null,{"$f":"'Rank Wkst'!AR26","v":0},{"$f":"'Rank Wkst'!AT26","v":0},{"$f":"'Rank Wkst'!AU26","v":0}]
[20,null,null,{"$f":"'Rank Wkst'!C27","v":""},{"$f":"'Rank Wkst'!G27","v":""},{"$f":"'Rank Wkst'!H27","v":""},{"$f":"'Rank Wkst'!L27","v":""},{"$f":"'Rank Wkst'!M27","v":""},{"$f":"'Rank Wkst'!Q27","v":""},{"$f":"'Rank Wkst'!R27","v":""},{"$f":"'Rank Wkst'!V27","v":""},{"$f":"'Rank Wkst'!W27","v":""},{"$f":"'Rank Wkst'!AA27","v":""},{"$f":"'Rank Wkst'!AB27","v":""},{"$f":"'Rank Wkst'!AF27","v":""},{"$f":"'Rank Wkst'!AG27","v":""},{"$f":"'Rank Wkst'!AK27","v":""},{"$f":"'Rank Wkst'!AL27","v":""},{"$f":"'Rank Wkst'!AP27","v":""},{"$f":"'Rank Wkst'!AX27","v":""},{"$f":"IF(AND('Rank Wkst'!BB27>1, D31<>\"DQ\"), 'Rank Wkst'!BF27, \"\")","v":""},{"$f":"IF(AND('Rank Wkst'!BB27>1, D31<>\"DQ\"),'Rank Wkst'!BK27, \"\")","v":""},{"$f":"IF(AND('Rank Wkst'!BI27>1, D31<>\"DQ\"), 'Rank Wkst'!BO27, \"\")","v":""},{"$f":"IF(AND('Rank Wkst'!BI27>1,D31<>\"DQ\"), 'Rank Wkst'!BT27, \"\")","v":""},{"$f":"IF('Rank Wkst'!AQ27<>0, 'Rank Wkst'!BW27, \"\")","v":""},null,{"$f":"IF('Rank Wkst'!C27=\"DQ\", \"\", 'Rank Wkst'!AR27)","v":0},{"$f":"IF('Rank Wkst'!C27=\"DQ\",\"\", 'Rank Wkst'!AT27)","v":0},{"$f":"IF('Rank Wkst'!C27=\"DQ\", \"\", 'Rank Wkst'!AU27)","v":0},null,null,null,{"$f":"'Rank Wkst'!AR27","v":0},{"$f":"'Rank Wkst'!AT27","v":0},{"$f":"'Rank Wkst'!AU27","v":0}]
[21,null,null,{"$f":"'Rank Wkst'!C28","v":""},{"$f":"'Rank Wkst'!G28","v":""},{"$f":"'Rank Wkst'!H28","v":""},{"$f":"'Rank Wkst'!L28","v":""},{"$f":"'Rank Wkst'!M28","v":""},{"$f":"'Rank Wkst'!Q28","v":""},{"$f":"'Rank Wkst'!R28","v":""},{"$f":"'Rank Wkst'!V28","v":""},{"$f":"'Rank Wkst'!W28","v":""},{"$f":"'Rank Wkst'!AA28","v":""},{"$f":"'Rank Wkst'!AB28","v":""},{"$f":"'Rank Wkst'!AF28","v":""},{"$f":"'Rank Wkst'!AG28","v":""},{"$f":"'Rank Wkst'!AK28","v":""},{"$f":"'Rank Wkst'!AL28","v":""},{"$f":"'Rank Wkst'!AP28","v":""},{"$f":"'Rank Wkst'!AX28","v":""},{"$f":"IF(AND('Rank Wkst'!BB28>1, D32<>\"DQ\"), 'Rank Wkst'!BF28, \"\")","v":""},{"$f":"IF(AND('Rank Wkst'!BB28>1, D32<>\"DQ\"),'Rank Wkst'!BK28, \"\")","v":""},{"$f":"IF(AND('Rank Wkst'!BI28>1, D32<>\"DQ\"), 'Rank Wkst'!BO28, \"\")","v":""},{"$f":"IF(AND('Rank Wkst'!BI28>1,D32<>\"DQ\"), 'Rank Wkst'!BT28, \"\")","v":""},{"$f":"IF('Rank Wkst'!AQ28<>0, 'Rank Wkst'!BW28, \"\")","v":""},null,{"$f":"IF('Rank Wkst'!C28=\"DQ\", \"\", 'Rank Wkst'!AR28)","v":0},{"$f":"IF('Rank Wkst'!C28=\"DQ\",\"\", 'Rank Wkst'!AT28)","v":0},{"$f":"IF('Rank Wkst'!C28=\"DQ\", \"\", 'Rank Wkst'!AU28)","v":0},null,null,null,{"$f":"'Rank Wkst'!AR28","v":0},{"$f":"'Rank Wkst'!AT28","v":0},{"$f":"'Rank Wkst'!AU28","v":0}]
[22,null,null,{"$f":"'Rank Wkst'!C29","v":""},{"$f":"'Rank Wkst'!G29","v":""},{"$f":"'Rank Wkst'!H29","v":""},{"$f":"'Rank Wkst'!L29","v":""},{"$f":"'Rank Wkst'!M29","v":""},{"$f":"'Rank Wkst'!Q29","v":""},{"$f":"'Rank Wkst'!R29","v":""},{"$f":"'Rank Wkst'!V29","v":""},{"$f":"'Rank Wkst'!W29","v":""},{"$f":"'Rank Wkst'!AA29","v":""},{"$f":"'Rank Wkst'!AB29","v":""},{"$f":"'Rank Wkst'!AF29","v":""},{"$f":"'Rank Wkst'!AG29","v":""},{"$f":"'Rank Wkst'!AK29","v":""},{"$f":"'Rank Wkst'!AL29","v":""},{"$f":"'Rank Wkst'!AP29","v":""},{"$f":"'Rank Wkst'!AX29","v":""},{"$f":"IF(AND('Rank Wkst'!BB29>1, D33<>\"DQ\"), 'Rank Wkst'!BF29, \"\")","v":""},{"$f":"IF(AND('Rank Wkst'!BB29>1, D33<>\"DQ\"),'Rank Wkst'!BK29, \"\")","v":""},{"$f":"IF(AND('Rank Wkst'!BI29>1, D33<>\"DQ\"), 'Rank Wkst'!BO29, \"\")","v":""},{"$f":"IF(AND('Rank Wkst'!BI29>1,D33<>\"DQ\"), 'Rank Wkst'!BT29, \"\")","v":""},{"$f":"IF('Rank Wkst'!AQ29<>0, 'Rank Wkst'!BW29, \"\")","v":""},null,{"$f":"IF('Rank Wkst'!C29=\"DQ\", \"\", 'Rank Wkst'!AR29)","v":0},{"$f":"IF('Rank Wkst'!C29=\"DQ\",\"\", 'Rank Wkst'!AT29)","v":0},{"$f":"IF('Rank Wkst'!C29=\"DQ\", \"\", 'Rank Wkst'!AU29)","v":0},null,null,null,{"$f":"'Rank Wkst'!AR29","v":0},{"$f":"'Rank Wkst'!AT29","v":0},{"$f":"'Rank Wkst'!AU29","v":0}]
[23,null,null,{"$f":"'Rank Wkst'!C30","v":""},{"$f":"'Rank Wkst'!G30","v":""},{"$f":"'Rank Wkst'!H30","v":""},{"$f":"'Rank Wkst'!L30","v":""},{"$f":"'Rank Wkst'!M30","v":""},{"$f":"'Rank Wkst'!Q30","v":""},{"$f":"'Rank Wkst'!R30","v":""},{"$f":"'Rank Wkst'!V30","v":""},{"$f":"'Rank Wkst'!W30","v":""},{"$f":"'Rank Wkst'!AA30","v":""},{"$f":"'Rank Wkst'!AB30","v":""},{"$f":"'Rank Wkst'!AF30","v":""},{"$f":"'Rank Wkst'!AG30","v":""},{"$f":"'Rank Wkst'!AK30","v":""},{"$f":"'Rank Wkst'!AL30","v":""},{"$f":"'Rank Wkst'!AP30","v":""},{"$f":"'Rank Wkst'!AX30","v":""},{"$f":"IF(AND('Rank Wkst'!BB30>1, D34<>\"DQ\"), 'Rank Wkst'!BF30, \"\")","v":""},{"$f":"IF(AND('Rank Wkst'!BB30>1, D34<>\"DQ\"),'Rank Wkst'!BK30, \"\")","v":""},{"$f":"IF(AND('Rank Wkst'!BI30>1, D34<>\"DQ\"), 'Rank Wkst'!BO30, \"\")","v":""},{"$f":"IF(AND('Rank Wkst'!BI30>1,D34<>\"DQ\"), 'Rank Wkst'!BT30, \"\")","v":""},{"$f":"IF('Rank Wkst'!AQ30<>0, 'Rank Wkst'!BW30, \"\")","v":""},null,{"$f":"IF('Rank Wkst'!C30=\"DQ\", \"\", 'Rank Wkst'!AR30)","v":0},{"$f":"IF('Rank Wkst'!C30=\"DQ\",\"\", 'Rank Wkst'!AT30)","v":0},{"$f":"IF('Rank Wkst'!C30=\"DQ\", \"\", 'Rank Wkst'!AU30)","v":0},null,null,null,{"$f":"'Rank Wkst'!AR30","v":0},{"$f":"'Rank Wkst'!AT30","v":0},{"$f":"'Rank Wkst'!AU30","v":0}]
[24,null,null,{"$f":"'Rank Wkst'!C31","v":""},{"$f":"'Rank Wkst'!G31","v":""},{"$f":"'Rank Wkst'!H31","v":""},{"$f":"'Rank Wkst'!L31","v":""},{"$f":"'Rank Wkst'!M31","v":""},{"$f":"'Rank Wkst'!Q31","v":""},{"$f":"'Rank Wkst'!R31","v":""},{"$f":"'Rank Wkst'!V31","v":""},{"$f":"'Rank Wkst'!W31","v":""},{"$f":"'Rank Wkst'!AA31","v":""},{"$f":"'Rank Wkst'!AB31","v":""},{"$f":"'Rank Wkst'!AF31","v":""},{"$f":"'Rank Wkst'!AG31","v":""},{"$f":"'Rank Wkst'!AK31","v":""},{"$f":"'Rank Wkst'!AL31","v":""},{"$f":"'Rank Wkst'!AP31","v":""},{"$f":"'Rank Wkst'!AX31","v":""},{"$f":"IF(AND('Rank Wkst'!BB31>1, D35<>\"DQ\"), 'Rank Wkst'!BF31, \"\")","v":""},{"$f":"IF(AND('Rank Wkst'!BB31>1, D35<>\"DQ\"),'Rank Wkst'!BK31, \"\")","v":""},{"$f":"IF(AND('Rank Wkst'!BI31>1, D35<>\"DQ\"), 'Rank Wkst'!BO31, \"\")","v":""},{"$f":"IF(AND('Rank Wkst'!BI31>1,D35<>\"DQ\"), 'Rank Wkst'!BT31, \"\")","v":""},{"$f":"IF('Rank Wkst'!AQ31<>0, 'Rank Wkst'!BW31, \"\")","v":""},null,{"$f":"IF('Rank Wkst'!C31=\"DQ\", \"\", 'Rank Wkst'!AR31)","v":0},{"$f":"IF('Rank Wkst'!C31=\"DQ\",\"\", 'Rank Wkst'!AT31)","v":0},{"$f":"IF('Rank Wkst'!C31=\"DQ\", \"\", 'Rank Wkst'!AU31)","v":0},null,null,null,{"$f":"'Rank Wkst'!AR31","v":0},{"$f":"'Rank Wkst'!AT31","v":0},{"$f":"'Rank Wkst'!AU31","v":0}]
[]
["Superior Judge Signature:",null,null,null,null,null,null,null,null,null,null,null,"Tabulation Signature:"]

{"sheet":"Rank Wkst","index":1,"n_rows":80,"n_cols":249,"rows_kept":80,"cut":false,"hidden":true,"merged":[[5,150,5,153],[5,2,5,6],[5,1,6,1],[53,4,53,11],[54,1,55,1],[54,2,54,9],[54,10,54,17],[5,120,6,120],[5,72,6,72],[5,42,6,42],[5,179,5,185],[5,172,5,178],[5,154,5,157],[5,158,5,161],[5,162,5,165],[5,166,5,169],[5,43,6,43],[5,46,6,46],[5,50,5,54],[5,27,5,31],[4,32,4,36],[4,135,4,146],[5,138,5,141],[5,142,5,145],[5,146,5,149],[4,37,4,41],[4,7,4,11],[5,7,5,11],[4,12,4,16],[5,12,5,16],[5,37,5,41],[4,17,4,21],[5,17,5,21],[4,22,4,26],[5,22,5,26],[4,27,4,31],[4,2,4,6],[5,92,5,99],[5,101,5,106],[5,32,5,36],[5,56,5,62],[5,63,5,71],[4,92,4,95],[5,107,5,112],[5,113,5,119],[5,48,6,48],[5,47,6,47],[5,44,6,44],[5,45,6,45],[5,199,5,208],[3,234,3,249],[5,198,6,198],[5,214,5,231],[5,234,6,234],[5,235,5,239]]}
[]
[]
[]
[null,null,null,null,null,null,null,null,null,null,null,null,null,null,null,null,null,null,null,null,null,null,null,null,null,null,null,null,null,null,null,null,null,null,null,null,null,null,null,null,null,null,null,null,null,null,null,null,null,null,null,null,null,null,null,null,null,null,null,null,null,null,null,null,null,null,null,null,null,null,null,null,null,null,null,null,null,null,null,null,null,null,null,null,null,null,null,null,null,null,null,null,null,null,null,null,null,null,null,null,null,null,null,null,null,null,null,null,null,null,null,null,null,null,null,null,null,null,null,null,null,null,null,null,null,null,null,null,null,null,null,null,null,null,null,null,null,null,null,null,null,null,null,null,null,null,null,null,null,null,null,null,null,null,null,null,null,null,null,null,null,null,null,null,null,null,null,null,null,null,null,null,null,null,null,{"$f":"IF(FS8<>0, IF(ISERROR(FS8), \"\", FS8), \"\")","v":""},null,null,null,null,null,null,null,null,null,null,null,null,null,null,null,null,null,null,null,null,null,null,"Point Summary Sheet",null,null,null,null,null,null,null,null,null,null,null,null,null,null,null,null,null,null,null,null,null,null,null,null,null,null,null,null,null,null,null,null,null,null,null,"Point Summary Sheet with Tie-Breaker sheet"]
[null,null,"Judge 1",null,null,null,null,"Judge 2",null,null,null,null,"Judge 3",null,null,null,null,"Judge 4",null,null,null,null,"Judge 5",null,null,null,null,"Judge 6",null,null,null,null,"Judge 7",null,null,null,null,"Judge 8",null,null,null,null,null,null,null,null,null,null,null,null,null,null,null,null,null,null,null,null,null,null,null,null,null,null,null,null,null,null,null,null,null,null,null,null,null,null,null,null,null,null,null,null,null,null,null,null,null,null,null,null,null,null,"Tie-breaker Sheet",null,null,null,null,null,null,null,null,null,null,null,null,null,null,null,null,null,null,null,null,null,null,null,null,null,null,null,null,null,null,null,null,null,null,null,null,null,null,null,null,null,null,"Ranking 1st - 24th with all points & rank shown",null,null,null,null,null,null,null,null,null,null,null,null,null,null,null,null,null,null,null,null,null,null,null,null,null,null,null,null,null,null,null,null,null,null,null,null,null,null,null,null,null,null,null,null,null,null,null,null,null,null,null,null,null,null,null,null,null,null,null,null,null,null,null,"L9","L10","L11","L12","L13","L14","L15","L16","L17","L18","L19","L20","L21","N21"]
[null,"School",{"$f":"IF('Ranking Sheet'!D8=0, \"\", 'Ranking Sheet'!D8)","v":""},null,null,null,null,{"$f":"IF('Ranking Sheet'!F8=0, \"\", 'Ranking Sheet'!F8)","v":""},null,null,null,null,{"$f":"IF('Ranking Sheet'!H8=0, \"\", 'Ranking Sheet'!H8)","v":""},null,null,null,null,{"$f":"IF('Ranking Sheet'!J8=0, \"\", 'Ranking Sheet'!J8)","v":""},null,null,null,null,{"$f":"IF('Ranking Sheet'!L8=0, \"\", 'Ranking Sheet'!L8)","v":""},null,null,null,null,{"$f":"IF('Ranking Sheet'!N8=0, \"\", 'Ranking Sheet'!N8)","v":""},null,null,null,null,{"$f":"IF('Ranking Sheet'!P8=0, \"\", 'Ranking Sheet'!P8)","v":""},null,null,null,null,{"$f":"IF('Ranking Sheet'!R8=0, \"\", 'Ranking Sheet'!R8)","v":""},null,null,null,null,"Total Rank","Low","2nd High rank","2nd high rank with 0","High","“A” Rank\nDrop Hi, 2nd Hi and Lo","If = to zero make null",null,"Sub-total Placement",null,null,null,null,null,"“A” Rank 1st Tie break",null,null,null,null,null,null,"“A” Rank 2nd Tie Break",null,null,null,null,null,null,null,null,"Final\nFinal Place",null,null,null,null,null,null,null,null,null,null,null,null,null,null,null,null,null,null,null,"3rd Tie Break",null,null,null,null,null,null,null,null,"4th Tie Break",null,null,null,null,null,"5th Tie Break",null,null,null,null,null,"6th Tie Break",null,null,null,null,null,null,"Final\nFinal Place",null,null,null,null,null,null,null,null,null,null,null,null,null,null,null,null,null,"Judge 1",null,null,null,"Judge 2",null,null,null,"Judge 3",null,null,null,"Judge 4",null,null,null,"Judge 5",null,null,null,"Judge 6",null,null,null,"Judge 7",null,null,null,"Judge 8",null,null,null,null,null,"1st Tie-breaker",null,null,null,null,null,null,"2nd Tie-breaker",null,null,null,null,null,null,null,null,null,null,null,null,null,null,null,null,null,null,"School","Points",null,null,null,null,null,null,null,null,null,null,null,null,null,null,"In Final Order",null,null,null,null,null,null,null,null,null,null,null,null,null,null,null,null,null,null,null,"School in tiebreaker order","Points in tie-breaker order"]
["Team",null,"Points","Initial Rank","Ties","Rank","Rank DQ show dash","Points","Initial Rank","Ties","Rank","Rank DQ show dash","Points","Initial Rank","Ties","Rank","Rank DQ show dash","Points","Initial Rank","Ties","Rank","Rank DQ show dash","Points","Initial Rank","Ties","Rank","Rank DQ show dash","Points","Initial Rank","Ties","Rank","Rank DQ show dash","Points","Initial Rank","Ties","Rank","Rank DQ show dash","Points","Initial Rank","Ties","Rank","Rank DQ show dash",null,null,null,null,null,null,null,"Total Rank  If > 200 (rank 25 x 8), put dash","First Rank","Working Final Place","Final final","Ties","Final Rank","Remove error","Add 2nd hi rank","if=0 make null","Tie breaker with rank low = better new","Eliminate extra ranks","Ties","Ties shown with 0.5 ","1st tie break Remove extra non-values","Low Rank","High Rank","Total Rank plus low & high","if=0 make null","Tie breaker with rank low = better new","Eliminate extra ranks","Ties","Ties shown with 0.5 ","2nd tie break Remove extra non-values",null,"If greater than 25 rank than =null","if DQ put DQ instead of rank","Placements in order 1st - 24th","Placements with a DQ","Schools in order 1st - 20th but error on any ties","Assigning the ties a specific number","removing error","ranking with #NUM error","Ranking schools from top to bottom -- for Final placements & announcers form","Calling out Tie but need to get rid of \"99\"","Getting rid of a possible TIE on DQs","Putting TIE on final place & Announc","Final Ranking score in order","Final Ranking score for announcers form","Announcers form - if tie breaker is used","Annou form correct order","Annou form correct order no error","Annou form eliminating showing when no scores",null,"Low Points","High Points","Total Points\nDrop Hi/Lo","if=0 make null","3rd Tie Break","Eliminate extra ranks","Ties","Tie/ties break ","3rd tie break Remove extra non-values","Total Points\n","if=0 make null"," 4th Tie Break","Ties","Tie/ties break ","4th tie break Remove extra non-values","Superior Judge Rank","Superior judge rank with extra ranks removed"," 5th Tie Break","Ties","Tie/ties break ","5th tie break Remove extra non-values","All judges rank minus Superior Judge Rank","All judges rank minus Superior Judge Rank w/o errors","Removing the zeros"," 6th Tie Break","Ties","Tie/ties break ","6th tie break Remove extra non-values",null,"If greater than 25 rank than =null","if DQ put DQ instead of rank","Placements in order 1st - 24th","Placements with a DQ","Placements with a DQ#2","Schools in order 1st - 20th but error on any ties","Assigning the ties a specific number","removing error","ranking with #NUM error","Ranking schools from top to bottom -- for Final placements & announcers form","Calling out Tie but need to get rid of \"99\"","Getting rid of a possible TIE on DQs","Putting TIE on final place & Announc",null,"Final Rank","Final Rank removing errors","Final Rank of Schools","Points","w/o error","Rank","w/o error","Points","w/o error","Rank","w/o error","Points","w/o error","Rank","w/o error","Points","w/o error","Rank","w/o error","Points","w/o error","Rank","w/o error","Points","w/o error","Rank","w/o error","Points","w/o error","Rank","w/o error","Points","w/o error","Rank","w/o error","Total Rank minus high & low","w/o error","Ties 1st","w/o error","Add in 2nd Worst Rank","w/o error","eliminate  error when at 0","New Total Rank","w/o error","Ties 2nd","w/o error","Add in worst & Best ranks","w/o error","eliminate  error when at 0","New Total Rank","w/o error",null,"Best rank","Best rank removing DQ","Best Rank remove error","2nd Worst Rank","2nd worst rank removing DQ","2nd worst  remove error","Worst Rank","Best rank removing DQ","Best Rank remove error",null,"Team",null,"Technique of Turns","Technique of Leaps & Jumps","Creativity","Visual Effectiveness","Diffuculty of Routine Choreography","Difficulty of Formations and Transitions","Difficulty of Skills","Placement & Control","Degree of Accuracy","Routine Effectiveness","SubTotal","(Deductions)","Total","Out of Total Points","Rank perform order with DQ","Rank in order with DQ","Adding TIE","Schools in order","Technique","Height","Difficulty","Placement & Control","Degree of Accuracy","Visual Effectiveness & Creativity","Practicality of Content","Choregraphy & Combinations","Formations & Transitions","Routine Effectiveness","SubTotal","(Deductions)","Total","Out of Total Points","Rank Points",null,"Rank from Tie-breaker",null,"Technique","Height","Difficulty","Placement & Control","Degree of Accuracy","Visual Effectiveness & Creativity","Practicality of Content","Choregraphy & Combinations","Formations & Transitions","Routine Effectiveness","SubTotal","(Deductions)","Total","Out of Total Points"]
[1,{"$f":"IF('Ranking Sheet'!B12=0, \"\", 'Ranking Sheet'!B12)","v":""},{"$f":"IF(Team1!$D$21=0, \"\", Team1!$D$21)","v":""},{"$f":"IF(C8=\"DQ\", 98, IF(C8=\"\", \"\", RANK(C8,C$8:C$31,0)))","v":""},{"$f":"IF(C8=\"\", \"\", COUNTIF(D$8:D$31,D8))","v":""},{"$f":"IF(C8=\"\", \"\", (((D8+E8-1)*((D8+E8-1)+1)/2)-((D8-1)*((D8-1)+1)/2))/E8)","v":""},{"$f":"IF(F8=\"\", \"\", IF(F8>25, \"-\", F8))","v":""},{"$f":"IF(Team1!$E$21=0, \"\", Team1!$E$21)","v":""},{"$f":"IF(H8=\"DQ\", 98, IF(H8=\"\", \"\", RANK(H8,H$8:H$31,0)))","v":""},{"$f":"IF(H8=\"\", \"\", COUNTIF(I$8:I$31,I8))","v":""},{"$f":"IF(H8=\"\", \"\", (((I8+J8-1)*((I8+J8-1)+1)/2)-((I8-1)*((I8-1)+1)/2))/J8)","v":""},{"$f":"IF(K8=\"\", \"\", IF(K8>25, \"-\", K8))","v":""},{"$f":"IF(Team1!$F$21=0, \"\", Team1!$F$21)","v":""},{"$f":"IF(M8=\"DQ\", 98, IF(M8=\"\", \"\", RANK(M8,M$8:M$31,0)))","v":""},{"$f":"IF(M8=\"\", \"\", COUNTIF(N$8:N$31,N8))","v":""},{"$f":"IF(M8=\"\", \"\", (((N8+O8-1)*((N8+O8-1)+1)/2)-((N8-1)*((N8-1)+1)/2))/O8)","v":""},{"$f":"IF(P8=\"\", \"\", IF(P8>25, \"-\", P8))","v":""},{"$f":"IF(Team1!$G$21=0, \"\", Team1!$G$21)","v":""},{"$f":"IF(R8=\"DQ\", 98, IF(R8=\"\", \"\", RANK(R8,R$8:R$31,0)))","v":""},{"$f":"IF(R8=\"\", \"\", COUNTIF(S$8:S$31,S8))","v":""},{"$f":"IF(R8=\"\", \"\", (((S8+T8-1)*((S8+T8-1)+1)/2)-((S8-1)*((S8-1)+1)/2))/T8)","v":""},{"$f":"IF(U8=\"\", \"\", IF(U8>25, \"-\", U8))","v":""},{"$f":"IF(Team1!$H$21=0, \"\", Team1!$H$21)","v":""},{"$f":"IF(W8=\"DQ\", 98, IF(W8=\"\", \"\", RANK(W8,W$8:W$31,0)))","v":""},{"$f":"IF(W8=\"\", \"\", COUNTIF(X$8:X$31,X8))","v":""},{"$f":"IF(W8=\"\", \"\", (((X8+Y8-1)*((X8+Y8-1)+1)/2)-((X8-1)*((X8-1)+1)/2))/Y8)","v":""},{"$f":"IF(Z8=\"\", \"\", IF(Z8>25, \"-\", Z8))","v":""},{"$f":"IF(Team1!$I$21=0, \"\", Team1!$I$21)","v":""},{"$f":"IF(AB8=\"DQ\", 98, IF(AB8=\"\", \"\", RANK(AB8,AB$8:AB$31,0)))","v":""},{"$f":"IF(AB8=\"\", \"\", COUNTIF(AC$8:AC$31,AC8))","v":""},{"$f":"IF(AB8=\"\", \"\", (((AC8+AD8-1)*((AC8+AD8-1)+1)/2)-((AC8-1)*((AC8-1)+1)/2))/AD8)","v":""},{"$f":"IF(AE8=\"\", \"\", IF(AE8>25, \"-\", AE8))","v":""},{"$f":"IF(Team1!$J$21=0, \"\", Team1!$J$21)","v":""},{"$f":"IF(AG8=\"DQ\", 98, IF(AG8=\"\", \"\", RANK(AG8,AG$8:AG$31,0)))","v":""},{"$f":"IF(AG8=\"\", \"\", COUNTIF(AH$8:AH$31,AH8))","v":""},{"$f":"IF(AG8=\"\", \"\", (((AH8+AI8-1)*((AH8+AI8-1)+1)/2)-((AH8-1)*((AH8-1)+1)/2))/AI8)","v":""},{"$f":"IF(AJ8=\"\", \"\", IF(AJ8>25, \"-\", AJ8))","v":""},{"$f":"IF(Team1!$K$21=0, \"\", Team1!$K$21)","v":""},{"$f":"IF(AL8=\"DQ\", 98, IF(AL8=\"\", \"\", RANK(AL8,AL$8:AL$31,0)))","v":""},{"$f":"IF(AL8=\"\", \"\", COUNTIF(AM$8:AM$31,AM8))","v":""},{"$f":"IF(AL8=\"\", \"\", (((AM8+AN8-1)*((AM8+AN8-1)+1)/2)-((AM8-1)*((AM8-1)+1)/2))/AN8)","v":""},{"$f":"IF(AO8=\"\", \"\", IF(AO8>25, \"-\", AO8))","v":""},{"$f":"SUM(F8,K8,P8,U8,Z8,AE8,AJ8,AO8)","v":0},{"$f":"MIN(F8,K8,P8,U8,Z8,AE8,AJ8,AO8)","v":0},{"$f":"LARGE((F8,K8,P8,U8,Z8,AE8,AJ8,AO8), 2)","v":{"$error":"#NUM!"}},{"$f":"IF(ISERROR(AS8), 0, AS8)","v":0},{"$f":"MAX(F8,K8,P8,U8,Z8,AE8,AJ8,AO8)","v":0},{"$f":"AQ8-AR8-AT8-AU8","v":0},{"$f":"IF(AV8=0, \"\", AV8)","v":""},{"$f":"IF(AW8=\"\", \"\", IF(AW8>200, \"-\", AW8))","v":""},{"$f":"RANK(AW8,AW$8:AW$31,1)","v":{"$error":"#VALUE!"}},{"$f":"IF(AND(ISNUMBER(AV8),AV8<>0),RANK(AV8,AV$8:AV$31,1),99)","v":99},{"$f":"AZ8-(SMALL(AZ$8:AZ$31,1))+1","v":1},{"$f":"COUNTIF(AY$8:AY$31,AY8)","v":24},{"$f":"(((AY8+BB8-1)*((AY8+BB8-1)+1)/2)-((AY8-1)*((AY8-1)+1)/2))/BB8","v":{"$error":"#VALUE!"}},{"$f":"IF(ISERROR(BC8), \"\", BC8)","v":""},{"$f":"AV8+AT8","v":0},{"$f":"IF(BE8=0, \"\", BE8)","v":""},{"$f":"1+SUMPRODUCT(--($BA$8:$BA$31+$BE$8:$BE$31/1000000<$BA8+$BE8/1000000))","v":1},{"$f":"IF(O8=\"\", \"\", BG8)","v":""},{"$f":"COUNTIF(BG$8:BG$31,BG8)","v":24},{"$f":"(((BG8+BI8-1)*((BG8+BI8-1)+1)/2)-((BG8-1)*((BG8-1)+1)/2))/BI8","v":12.5},{"$f":"IF(BE8=0, \"\", BJ8)","v":""},{"$f":"AR8","v":0},{"$f":"AU8","v":0},{"$f":"AV8+AU8+AT8+AR8","v":0},{"$f":"IF(BN8=0, \"\", BN8)","v":""},{"$f":"1+SUMPRODUCT(--($BG$8:$BG$31+$BN$8:$BN$31/1000000<$BG8+$BN8/1000000))","v":1},{"$f":"IF(X8=\"\", \"\", BP8)","v":""},{"$f":"COUNTIF(BP$8:BP$31,BP8)","v":24},{"$f":"(((BP8+BR8-1)*((BP8+BR8-1)+1)/2)-((BP8-1)*((BP8-1)+1)/2))/BR8","v":12.5},{"$f":"IF(BF8=\"\", \"\", BS8)","v":""},{"$f":"IF(ISNUMBER(BT8),BT8,IF(ISNUMBER(BK8),BK8,BA8))","v":1},{"$f":"IF(BU8>25, \"\", BU8)","v":1},{"$f":"IF(C8=\"DQ\", \"DQ\", BV8 )","v":1},{"$f":"IF(BV8=\"\", \"\", SMALL(BV$8:BV$31, 1))","v":1},{"$f":"IF(AQ8<>0, INDEX($BW$8:$BW$31,MATCH(BX8,$BV$8:$BV$31,FALSE),1), \"\")","v":""},{"$f":"IF(BV8=\"\", \"\", OFFSET(B$8,MATCH(SMALL(BV$8:BV$31,ROW()-ROW(BV$8)+1),BV$8:BV$31,0)-1,0))","v":""},{"$f":"COUNT($BV$8:$BV$31)-(RANK(BV8,$BV$8:$BV$31,0)+COUNTIF($BV$8:BV8,BV8))+2","v":24},{"$f":"IF(ISERROR(CA8), \" \", CA8)","v":24},{"$f":"OFFSET(B$8,MATCH(SMALL(CB$8:CB$31,ROW()-ROW(CC$8)+1),CB$8:CB$31,0)-1,0)","v":""},{"$f":"IF(C8=\"\", \"\", IF(ISERROR(CC8),\"\",CC8))","v":""},{"$f":"IF(COUNTIF($BX$8:$BX31,BX8)>1,\"TIE\",\"\")","v":"TIE"},{"$f":"IF(BY8=\"DQ\", \"\", CE8)","v":"TIE"},{"$f":"IF(AQ8<>0, IF(BX8=\"\", \"\", CF8), \"\")","v":""},{"$f":"OFFSET(AX$8,MATCH(SMALL(CB$8:CB$31,ROW()-ROW(CC$8)+1),CB$8:CB$31,0)-1,0)","v":""},{"$f":"IF(ISERROR(CH8), \" \", CH8)","v":""},{"$f":"IF(AND(BB8>1, BW8<>\"DQ\"), \"*\", \"\")","v":"*"},{"$f":"OFFSET(CJ$8,MATCH(SMALL(CB$8:CB$31,ROW()-ROW(CC$8)+1),CB$8:CB$31,0)-1,0)","v":"*"},{"$f":"IF(ISERROR(CK8), \" \", CK8)","v":"*"},{"$f":"IF(C8=\"\", \"\", CL8)","v":""},null,{"$f":"MIN(C8,H8,M8,R8,W8,AB8,AG8,AL8)","v":0},{"$f":"MAX(C8,H8,M8,R8,W8,AB8,AG8,AL8)","v":0},{"$f":"SUM(C8,H8,M8,R8,W8,AB8,AG8,AL8)-MIN(C8,H8,M8,R8,W8,AB8,AG8,AL8)-MAX(C8,H8,M8,R8,W8,AB8,AG8,AL8)","v":0},{"$f":"IF(CQ8=0, \"\", CQ8)","v":""},{"$f":"1+SUMPRODUCT(--($BP$8:$BP$31+1-$CQ$8:$CQ$31/1000000<$BP8+1-$CQ8/1000000))","v":1},{"$f":"IF(BQ8=\"\", \"\", CS8)","v":""},{"$f":"COUNTIF(CT$8:CT$31,CT8)","v":24},{"$f":"(((CS8+CU8-1)*((CS8+CU8-1)+1)/2)-((CS8-1)*((CS8-1)+1)/2))/CU8","v":12.5},{"$f":"IF(BO8=\"\", \"\", CV8)","v":""},{"$f":"SUM(C8,H8,M8,R8,W8,AB8,AG8,AL8)","v":0},{"$f":"IF(CX8=0, \"\", CX8)","v":""},{"$f":"1+SUMPRODUCT(--($CS$8:$CS$31+1-$CX$8:$CX$31/1000000<$CS8+1-$CX8/1000000))","v":1},{"$f":"COUNTIF(CZ$8:CZ$31,CZ8)","v":24},{"$f":"(((CZ8+DA8-1)*((CZ8+DA8-1)+1)/2)-((CZ8-1)*((CZ8-1)+1)/2))/DA8","v":12.5},{"$f":"IF(BO8=\"\", \"\", DB8)","v":""},{"$f":"IF($F8=\"\", 0, $F8)","v":0},{"$f":"IF(DD8=0, \"\", DD8)","v":""},{"$f":"1+SUMPRODUCT(--($CZ$8:$CZ$31+$DD$8:$DD$31/1000000<$CZ8+$DD8/1000000))","v":1},{"$f":"COUNTIF(DF$8:DF$31,DF8)","v":24},{"$f":"(((DF8+DG8-1)*((DF8+DG8-1)+1)/2)-((DF8-1)*((DF8-1)+1)/2))/DG8","v":12.5},{"$f":"IF(BO8=\"\", \"\", DH8)","v":""},{"$f":"AQ8-F8","v":{"$error":"#VALUE!"}},{"$f":"IF(ISERROR(DJ8), 0, DJ8)","v":0},{"$f":"IF(DK8=0, \"\", DK8)","v":""},{"$f":"1+SUMPRODUCT(--($DF$8:$DF$31+$DK$8:$DK$31/1000000<$DF8+$DK8/1000000))","v":1},{"$f":"COUNTIF(DM$8:DM$31,DM8)","v":24},{"$f":"(((DM8+DN8-1)*((DM8+DN8-1)+1)/2)-((DM8-1)*((DM8-1)+1)/2))/DN8","v":12.5},{"$f":"IF(DK8=0, \"\", DO8)","v":""},{"$f":"IF(ISNUMBER(DP8),DP8,IF(ISNUMBER(DI8),DI8,BU8))","v":1},{"$f":"IF(DQ8>25, \"\", DQ8)","v":1},{"$f":"IF(C8=\"DQ\", \"DQ\", DR8 )","v":1},{"$f":"IF(DR8=\"\", \"\", SMALL(DR$8:DR$31, 1))","v":1},{"$f":"INDEX($DS$8:$DS$31,MATCH(DT8,$DR$8:$DR$31,FALSE),1)","v":1},{"$f":"IF(DU8=FALSE, \"\", DU8)","v":1},{"$f":"IF(DR8=\"\", \"\", OFFSET(B$8,MATCH(SMALL(DR$8:DR$31,ROW()-ROW(DR$8)+1),DR$8:DR$31,0)-1,0))","v":""},{"$f":"COUNT($DR$8:$DR$31)-(RANK(DR8,$DR$8:$DR$31,0)+COUNTIF($DR$8:DR8,DR8))+2","v":24},{"$f":"IF(ISERROR(DX8), \" \", DX8)","v":24},{"$f":"OFFSET(B$8,MATCH(SMALL(DY$8:DY$31,ROW()-ROW(DZ$8)+1),DY$8:DY$31,0)-1,0)","v":""},{"$f":"IF(ISERROR(DZ8), \" \", DZ8)","v":""},{"$f":"IF(COUNTIF($DT$8:$DT31,DT8)>1,\"TIE\",\"\")","v":"TIE"},{"$f":"IF(DU8=\"DQ\", \"\", EB8)","v":"TIE"},{"$f":"IF(DT8=\"\", \"\", EC8)","v":"TIE"},null,{"$f":"DU8","v":1},{"$f":"IF(AQ8<>0, EF8, \"\")","v":""},{"$f":"EA8","v":""},{"$f":"INDEX($C$8:$C$31,MATCH(EA8,$B$8:$B$31,FALSE),1)","v":""},{"$f":"IF(ISERROR(EI8), \"\", EI8)","v":""},{"$f":"INDEX($G$8:$G$31,MATCH(EA8,$B$8:$B$31,FALSE),1)","v":""},{"$f":"IF(ISERROR(EK8), \"\", EK8)","v":""},{"$f":"INDEX($H$8:$H$31,MATCH(EA8,$B$8:$B$31,FALSE),1)","v":""},{"$f":"IF(ISERROR(EM8), \"\", EM8)","v":""},{"$f":"INDEX($L$8:$L$31,MATCH(EA8,$B$8:$B$31,FALSE),1)","v":""},{"$f":"IF(ISERROR(EO8), \"\", EO8)","v":""},{"$f":"INDEX($M$8:$M$31,MATCH(EA8,$B$8:$B$31,FALSE),1)","v":""},{"$f":"IF(ISERROR(EQ8), \"\", EQ8)","v":""},{"$f":"INDEX($Q$8:$Q$31,MATCH(EA8,$B$8:$B$31,FALSE),1)","v":""},{"$f":"IF(ISERROR(ES8), \"\", ES8)","v":""},{"$f":"INDEX($R$8:$R$31,MATCH(EA8,$B$8:$B$31,FALSE),1)","v":""},{"$f":"IF(ISERROR(EU8), \"\", EU8)","v":""},{"$f":"INDEX($V$8:$V$31,MATCH(EA8,$B$8:$B$31,FALSE),1)","v":""},{"$f":"IF(ISERROR(EW8), \"\", EW8)","v":""},{"$f":"INDEX($W$8:$W$31,MATCH(EA8,$B$8:$B$31,FALSE),1)","v":""},{"$f":"IF(ISERROR(EY8), \"\", EY8)","v":""},{"$f":"INDEX($AA$8:$AA$31,MATCH(EA8,$B$8:$B$31,FALSE),1)","v":""},{"$f":"IF(ISERROR(FA8), \"\", FA8)","v":""},{"$f":"INDEX($AB$8:$AB$31,MATCH(EA8,$B$8:$B$31,FALSE),1)","v":""},{"$f":"IF(ISERROR(FC8), \"\", FC8)","v":""},{"$f":"INDEX($AF$8:$AF$31,MATCH(EA8,$B$8:$B$31,FALSE),1)","v":""},{"$f":"IF(ISERROR(FE8), \"\", FE8)","v":""},{"$f":"INDEX($AG$8:$AG$31,MATCH(EA8,$B$8:$B$31,FALSE),1)","v":""},{"$f":"IF(ISERROR(FG8), \"\", FG8)","v":""},{"$f":"INDEX($AK$8:$AK$31,MATCH(EA8,$B$8:$B$31,FALSE),1)","v":""},{"$f":"IF(ISERROR(FI8), \"\", FI8)","v":""},{"$f":"INDEX($AL$8:$AL$31,MATCH(EA8,$B$8:$B$31,FALSE),1)","v":""},{"$f":"IF(ISERROR(FK8), \"\", FK8)","v":""},{"$f":"INDEX($AP$8:$AP$31,MATCH(EA8,$B$8:$B$31,FALSE),1)","v":""},{"$f":"IF(ISERROR(FM8), \"\", FM8)","v":""},{"$f":"INDEX($AX$8:$AX$31,MATCH(EA8,$B$8:$B$31,FALSE),1)","v":""},{"$f":"IF(ISERROR(FO8), \"\", FO8)","v":""},{"$f":"INDEX($BB$8:$BB$31,MATCH(EA8,$B$8:$B$31,FALSE),1)","v":24},{"$f":"IF(ISERROR(FQ8), \"\", FQ8)","v":24},{"$f":"INDEX($BE$8:$BE$31,MATCH(EA8,$B$8:$B$31,FALSE),1)","v":0},{"$f":"IF(ISERROR(FS8), \"\", FS8)","v":0},{"$f":"IF(AQ8<>0, FT8, \"\")","v":""},{"$f":"INDEX($BK$8:$BK$31,MATCH(EA8,$B$8:$B$31,FALSE),1)","v":""},{"$f":"IF(ISERROR(FV8), \"\", FV8)","v":""},{"$f":"INDEX($BI$8:$BI$31,MATCH(EA8,$B$8:$B$31,FALSE),1)","v":24},{"$f":"IF(ISERROR(FX8), \"\", FX8)","v":24},{"$f":"INDEX($BN$8:$BN$31,MATCH(EA8,$B$8:$B$31,FALSE),1)","v":0},{"$f":"IF(ISERROR(FZ8), \"\", FZ8)","v":0},{"$f":"IF(AQ8<>0, GA8, \"\")","v":""},{"$f":"INDEX($BT$8:$BT$31,MATCH(EA8,$B$8:$B$31,FALSE),1)","v":""},{"$f":"IF(ISERROR(GC8), \"\", GC8)","v":""},null,{"$f":"INDEX($AR$8:$AR$31,MATCH(EA8,$B$8:$B$31,FALSE),1)","v":0},{"$f":"IF($EF8=\"DQ\", \"\", GF8)","v":0},{"$f":"IF(ISERROR(GG8), 0, GG8)","v":0},{"$f":"INDEX($AT$8:$AT$31,MATCH(EA8,$B$8:$B$31,FALSE),1)","v":0},{"$f":"IF(EF8=\"DQ\", \"\", GI8)","v":0},{"$f":"IF(ISERROR(GJ8), 0, GJ8)","v":0},{"$f":"INDEX($AU$8:$AU$31,MATCH(EA8,$B$8:$B$31,FALSE),1)","v":0},{"$f":"IF(EF8=\"DQ\", \"\", GL8)","v":0},{"$f":"IF(ISERROR(GM8), 0, GM8)","v":0},null,1,{"$f":"IF('Ranking Sheet'!B12=0, \"\", 'Ranking Sheet'!B12)","v":""},{"$f":"IF(Team1!$L$9=0, \"\", Team1!$L$9)","v":""},{"$f":"IF(Team1!$L$10=0, \"\", Team1!$L$10)","v":""},{"$f":"IF(Team1!$L$11=0, \"\", Team1!$L$11)","v":""},{"$f":"IF(Team1!$L$12=0, \"\", Team1!$L$12)","v":""},{"$f":"IF(Team1!$L$13=0, \"\", Team1!$L$13)","v":""},{"$f":"IF(Team1!$L$14=0, \"\", Team1!$L$14)","v":""},{"$f":"IF(Team1!$L$15=0, \"\", Team1!$L$15)","v":""},{"$f":"IF(Team1!$L$16=0, \"\", Team1!$L$16)","v":""},{"$f":"IF(Team1!$L$17=0, \"\", Team1!$L$17)","v":""},{"$f":"IF(Team1!$L$18=0, \"\", Team1!$L$18)","v":""},{"$f":"IF(Team1!$L$19=0, \"\", Team1!$L$19)","v":""},{"$f":"IF(Team1!$L$20=0, \"\", Team1!$L$20)","v":""},{"$f":"IF(Team1!$L$21=0, \"\", Team1!$L$21)","v":""},{"$f":"IF(Team1!$N$21=0, \"\", Team1!$N$21)","v":""},{"$f":"DS8","v":1},{"$f":"BY8","v":""},{"$f":"CG8","v":""},{"$f":"EA8","v":""},{"$f":"IF(AW8=\"\", \"\", OFFSET(GR$8,MATCH(SMALL(DY$8:DY$31,ROW()-ROW(DY$8)+1),DY$8:DY$31,0)-1,0))","v":""},{"$f":"IF(AW8=\"\", \"\", OFFSET(GS$8,MATCH(SMALL(DY$8:DY$31,ROW()-ROW(DY$8)+1),DY$8:DY$31,0)-1,0))","v":""},{"$f":"IF(AW8=\"\", \"\", OFFSET(GT$8,MATCH(SMALL(DY$8:DY$31,ROW()-ROW(DY$8)+1),DY$8:DY$31,0)-1,0))","v":""},{"$f":"IF(AW8=\"\", \"\", OFFSET(GU$8,MATCH(SMALL(DY$8:DY$31,ROW()-ROW(DY$8)+1),DY$8:DY$31,0)-1,0))","v":""},{"$f":"IF(AW8=\"\", \"\", OFFSET(GV$8,MATCH(SMALL(DY$8:DY$31,ROW()-ROW(DY$8)+1),DY$8:DY$31,0)-1,0))","v":""},{"$f":"IF(AW8=\"\", \"\", OFFSET(GW$8,MATCH(SMALL(DY$8:DY$31,ROW()-ROW(DY$8)+1),DY$8:DY$31,0)-1,0))","v":""},{"$f":"IF(AW8=\"\", \"\", OFFSET(GX$8,MATCH(SMALL(DY$8:DY$31,ROW()-ROW(DY$8)+1),DY$8:DY$31,0)-1,0))","v":""},{"$f":"IF(AW8=\"\", \"\", OFFSET(GY$8,MATCH(SMALL(DY$8:DY$31,ROW()-ROW(DY$8)+1),DY$8:DY$31,0)-1,0))","v":""},{"$f":"IF(AW8=\"\", \"\", OFFSET(GZ$8,MATCH(SMALL(DY$8:DY$31,ROW()-ROW(DY$8)+1),DY$8:DY$31,0)-1,0))","v":""},{"$f":"IF(AW8=\"\", \"\", OFFSET(HA$8,MATCH(SMALL(DY$8:DY$31,ROW()-ROW(DY$8)+1),DY$8:DY$31,0)-1,0))","v":""},{"$f":"IF(AW8=\"\", \"\", OFFSET(HB$8,MATCH(SMALL(DY$8:DY$31,ROW()-ROW(DY$8)+1),DY$8:DY$31,0)-1,0))","v":""},{"$f":"IF(AW8=\"\", \"\", OFFSET(HC$8,MATCH(SMALL(DY$8:DY$31,ROW()-ROW(DY$8)+1),DY$8:DY$31,0)-1,0))","v":""},{"$f":"IF(AW8=\"\", \"\", OFFSET(HD$8,MATCH(SMALL(DY$8:DY$31,ROW()-ROW(DY$8)+1),DY$8:DY$31,0)-1,0))","v":""},{"$f":"IF(AW8=\"\", \"\", OFFSET(HE$8,MATCH(SMALL(DY$8:DY$31,ROW()-ROW(DY$8)+1),DY$8:DY$31,0)-1,0))","v":""},{"$f":"CI8","v":""},null,{"$f":"DV8","v":1},{"$f":"EA8","v":""},{"$f":"IF(AW8=\"\", \"\", OFFSET(GR$8,MATCH(SMALL(DY$8:DY$31,ROW()-ROW(DY$8)+1),DY$8:DY$31,0)-1,0))","v":""},{"$f":"IF(AW8=\"\", \"\", OFFSET(GS$8,MATCH(SMALL(DY$8:DY$31,ROW()-ROW(DY$8)+1),DY$8:DY$31,0)-1,0))","v":""},{"$f":"IF(AW8=\"\", \"\", OFFSET(GT$8,MATCH(SMALL(DY$8:DY$31,ROW()-ROW(DY$8)+1),DY$8:DY$31,0)-1,0))","v":""},{"$f":"IF(AW8=\"\", \"\", OFFSET(GU$8,MATCH(SMALL(DY$8:DY$31,ROW()-ROW(DY$8)+1),DY$8:DY$31,0)-1,0))","v":""},{"$f":"IF(AW8=\"\", \"\", OFFSET(GV$8,MATCH(SMALL(DY$8:DY$31,ROW()-ROW(DY$8)+1),DY$8:DY$31,0)-1,0))","v":""},{"$f":"IF(AW8=\"\", \"\", OFFSET(GW$8,MATCH(SMALL(DY$8:DY$31,ROW()-ROW(DY$8)+1),DY$8:DY$31,0)-1,0))","v":""},{"$f":"IF(AW8=\"\", \"\", OFFSET(GX$8,MATCH(SMALL(DY$8:DY$31,ROW()-ROW(DY$8)+1),DY$8:DY$31,0)-1,0))","v":""},{"$f":"IF(AW8=\"\", \"\", OFFSET(GY$8,MATCH(SMALL(DY$8:DY$31,ROW()-ROW(DY$8)+1),DY$8:DY$31,0)-1,0))","v":""},{"$f":"IF(AW8=\"\", \"\", OFFSET(GZ$8,MATCH(SMALL(DY$8:DY$31,ROW()-ROW(DY$8)+1),DY$8:DY$31,0)-1,0))","v":""},{"$f":"IF(AW8=\"\", \"\", OFFSET(HA$8,MATCH(SMALL(DY$8:DY$31,ROW()-ROW(DY$8)+1),DY$8:DY$31,0)-1,0))","v":""},{"$f":"IF(AW8=\"\", \"\", OFFSET(HB$8,MATCH(SMALL(DY$8:DY$31,ROW()-ROW(DY$8)+1),DY$8:DY$31,0)-1,0))","v":""},{"$f":"IF(AW8=\"\", \"\", OFFSET(HC$8,MATCH(SMALL(DY$8:DY$31,ROW()-ROW(DY$8)+1),DY$8:DY$31,0)-1,0))","v":""},{"$f":"IF(AW8=\"\", \"\", OFFSET(HD$8,MATCH(SMALL(DY$8:DY$31,ROW()-ROW(DY$8)+1),DY$8:DY$31,0)-1,0))","v":""},{"$f":"IF(AW8=\"\", \"\", OFFSET(HE$8,MATCH(SMALL(DY$8:DY$31,ROW()-ROW(DY$8)+1),DY$8:DY$31,0)-1,0))","v":""}]
[2,{"$f":"IF('Ranking Sheet'!B13=0, \"\", 'Ranking Sheet'!B13)","v":""},{"$f":"IF(Team2!$D$21=0, \"\", Team2!$D$21)","v":""},{"$f":"IF(C9=\"DQ\", 98, IF(C9=\"\", \"\", RANK(C9,C$8:C$31,0)))","v":""},{"$f":"IF(C9=\"\", \"\", COUNTIF(D$8:D$31,D9))","v":""},{"$f":"IF(C9=\"\", \"\", (((D9+E9-1)*((D9+E9-1)+1)/2)-((D9-1)*((D9-1)+1)/2))/E9)","v":""},{"$f":"IF(F9=\"\", \"\", IF(F9>25, \"-\", F9))","v":""},{"$f":"IF(Team2!$E$21=0, \"\", Team2!$E$21)","v":""},{"$f":"IF(H9=\"DQ\", 98, IF(H9=\"\", \"\", RANK(H9,H$8:H$31,0)))","v":""},{"$f":"IF(H9=\"\", \"\", COUNTIF(I$8:I$31,I9))","v":""},{"$f":"IF(H9=\"\", \"\", (((I9+J9-1)*((I9+J9-1)+1)/2)-((I9-1)*((I9-1)+1)/2))/J9)","v":""},{"$f":"IF(K9=\"\", \"\", IF(K9>25, \"-\", K9))","v":""},{"$f":"IF(Team2!$F$21=0, \"\", Team2!$F$21)","v":""},{"$f":"IF(M9=\"DQ\", 98, IF(M9=\"\", \"\", RANK(M9,M$8:M$31,0)))","v":""},{"$f":"IF(M9=\"\", \"\", COUNTIF(N$8:N$31,N9))","v":""},{"$f":"IF(M9=\"\", \"\", (((N9+O9-1)*((N9+O9-1)+1)/2)-((N9-1)*((N9-1)+1)/2))/O9)","v":""},{"$f":"IF(P9=\"\", \"\", IF(P9>25, \"-\", P9))","v":""},{"$f":"IF(Team2!$G$21=0, \"\", Team2!$G$21)","v":""},{"$f":"IF(R9=\"DQ\", 98, IF(R9=\"\", \"\", RANK(R9,R$8:R$31,0)))","v":""},{"$f":"IF(R9=\"\", \"\", COUNTIF(S$8:S$31,S9))","v":""},{"$f":"IF(R9=\"\", \"\", (((S9+T9-1)*((S9+T9-1)+1)/2)-((S9-1)*((S9-1)+1)/2))/T9)","v":""},{"$f":"IF(U9=\"\", \"\", IF(U9>25, \"-\", U9))","v":""},{"$f":"IF(Team2!$H$21=0, \"\", Team2!$H$21)","v":""},{"$f":"IF(W9=\"DQ\", 98, IF(W9=\"\", \"\", RANK(W9,W$8:W$31,0)))","v":""},{"$f":"IF(W9=\"\", \"\", COUNTIF(X$8:X$31,X9))","v":""},{"$f":"IF(W9=\"\", \"\", (((X9+Y9-1)*((X9+Y9-1)+1)/2)-((X9-1)*((X9-1)+1)/2))/Y9)","v":""},{"$f":"IF(Z9=\"\", \"\", IF(Z9>25, \"-\", Z9))","v":""},{"$f":"IF(Team2!$I$21=0, \"\", Team2!$I$21)","v":""},{"$f":"IF(AB9=\"DQ\", 98, IF(AB9=\"\", \"\", RANK(AB9,AB$8:AB$31,0)))","v":""},{"$f":"IF(AB9=\"\", \"\", COUNTIF(AC$8:AC$31,AC9))","v":""},{"$f":"IF(AB9=\"\", \"\", (((AC9+AD9-1)*((AC9+AD9-1)+1)/2)-((AC9-1)*((AC9-1)+1)/2))/AD9)","v":""},{"$f":"IF(AE9=\"\", \"\", IF(AE9>25, \"-\", AE9))","v":""},{"$f":"IF(Team2!$J$21=0, \"\", Team2!$J$21)","v":""},{"$f":"IF(AG9=\"DQ\", 98, IF(AG9=\"\", \"\", RANK(AG9,AG$8:AG$31,0)))","v":""},{"$f":"IF(AG9=\"\", \"\", COUNTIF(AH$8:AH$31,AH9))","v":""},{"$f":"IF(AG9=\"\", \"\", (((AH9+AI9-1)*((AH9+AI9-1)+1)/2)-((AH9-1)*((AH9-1)+1)/2))/AI9)","v":""},{"$f":"IF(AJ9=\"\", \"\", IF(AJ9>25, \"-\", AJ9))","v":""},{"$f":"IF(Team2!$K$21=0, \"\", Team2!$K$21)","v":""},{"$f":"IF(AL9=\"DQ\", 98, IF(AL9=\"\", \"\", RANK(AL9,AL$8:AL$31,0)))","v":""},{"$f":"IF(AL9=\"\", \"\", COUNTIF(AM$8:AM$31,AM9))","v":""},{"$f":"IF(AL9=\"\", \"\", (((AM9+AN9-1)*((AM9+AN9-1)+1)/2)-((AM9-1)*((AM9-1)+1)/2))/AN9)","v":""},{"$f":"IF(AO9=\"\", \"\", IF(AO9>25, \"-\", AO9))","v":""},{"$f":"SUM(F9,K9,P9,U9,Z9,AE9,AJ9,AO9)","v":0},{"$f":"MIN(F9,K9,P9,U9,Z9,AE9,AJ9,AO9)","v":0},{"$f":"LARGE((F9,K9,P9,U9,Z9,AE9,AJ9,AO9), 2)","v":{"$error":"#NUM!"}},{"$f":"IF(ISERROR(AS9), 0, AS9)","v":0},{"$f":"MAX(F9,K9,P9,U9,Z9,AE9,AJ9,AO9)","v":0},{"$f":"AQ9-AR9-AT9-AU9","v":0},{"$f":"IF(AV9=0, \"\", AV9)","v":""},{"$f":"IF(AW9=\"\", \"\", IF(AW9>200, \"-\", AW9))","v":""},{"$f":"RANK(AW9,AW$8:AW$31,1)","v":{"$error":"#VALUE!"}},{"$f":"IF(AND(ISNUMBER(AV9),AV9<>0),RANK(AV9,AV$8:AV$31,1),99)","v":99},{"$f":"AZ9-(SMALL(AZ$8:AZ$31,1))+1","v":1},{"$f":"COUNTIF(AY$8:AY$31,AY9)","v":24},{"$error":"#VALUE!"},{"$f":"IF(ISERROR(BC9), \"\", BC9)","v":""},0,{"$f":"IF(BE9=0, \"\", BE9)","v":""},{"$f":"1+SUMPRODUCT(--($BA$8:$BA$31+$BE$8:$BE$31/1000000<$BA9+$BE9/1000000))","v":1},"",{"$f":"COUNTIF(BG$8:BG$31,BG9)","v":24},12.5,{"$f":"IF(BE9=0, \"\", BJ9)","v":""},{"$f":"AR9","v":0},{"$f":"AU9","v":0},0,{"$f":"IF(BN9=0, \"\", BN9)","v":""},{"$f":"1+SUMPRODUCT(--($BG$8:$BG$31+$BN$8:$BN$31/1000000<$BG9+$BN9/1000000))","v":1},{"$f":"IF(X9=\"\", \"\", BP9)","v":""},{"$f":"COUNTIF(BP$8:BP$31,BP9)","v":24},12.5,{"$f":"IF(BF9=\"\", \"\", BS9)","v":""},{"$f":"IF(ISNUMBER(BT9),BT9,IF(ISNUMBER(BK9),BK9,BA9))","v":1},{"$f":"IF(BU9>25, \"\", BU9)","v":1},1,{"$f":"IF(BV9=\"\", \"\", SMALL(BV$8:BV$31, 2))","v":1},{"$f":"IF(AQ9<>0, INDEX($BW$8:$BW$31,MATCH(BX9,$BV$8:$BV$31,FALSE),1), \"\")","v":""},{"$f":"IF(BV9=\"\", \"\", OFFSET(B$8,MATCH(SMALL(BV$8:BV$31,ROW()-ROW(BV$8)+1),BV$8:BV$31,0)-1,0))","v":""},{"$f":"COUNT($BV$8:$BV$31)-(RANK(BV9,$BV$8:$BV$31,0)+COUNTIF($BV$8:BV9,BV9))+2","v":23},{"$f":"IF(ISERROR(CA9), \" \", CA9)","v":23},{"$f":"OFFSET(B$8,MATCH(SMALL(CB$8:CB$31,ROW()-ROW(CC$8)+1),CB$8:CB$31,0)-1,0)","v":""},{"$f":"IF(C9=\"\", \"\", IF(ISERROR(CC9),\"\",CC9))","v":""},{"$f":"IF(COUNTIF($BX$8:$BX32,BX9)>1,\"TIE\",\"\")","v":"TIE"},{"$f":"IF(BY9=\"DQ\", \"\", CE9)","v":"TIE"},{"$f":"IF(AQ9<>0, IF(BX9=\"\", \"\", CF9), \"\")","v":""},{"$f":"OFFSET(AX$8,MATCH(SMALL(CB$8:CB$31,ROW()-ROW(CC$8)+1),CB$8:CB$31,0)-1,0)","v":""},{"$f":"IF(ISERROR(CH9), \" \", CH9)","v":""},{"$f":"IF(AND(BB9>1, BW9<>\"DQ\"), \"*\", \"\")","v":"*"},{"$f":"OFFSET(CJ$8,MATCH(SMALL(CB$8:CB$31,ROW()-ROW(CC$8)+1),CB$8:CB$31,0)-1,0)","v":"*"},{"$f":"IF(ISERROR(CK9), \" \", CK9)","v":"*"},{"$f":"IF(C9=\"\", \"\", CL9)","v":""},null,{"$f":"MIN(C9,H9,M9,R9,W9,AB9,AG9,AL9)","v":0},{"$f":"MAX(C9,H9,M9,R9,W9,AB9,AG9,AL9)","v":0},{"$f":"SUM(C9,H9,M9,R9,W9,AB9,AG9,AL9)-MIN(C9,H9,M9,R9,W9,AB9,AG9,AL9)-MAX(C9,H9,M9,R9,W9,AB9,AG9,AL9)","v":0},{"$f":"IF(CQ9=0, \"\", CQ9)","v":""},{"$f":"1+SUMPRODUCT(--($BP$8:$BP$31+1-$CQ$8:$CQ$31/1000000<$BP9+1-$CQ9/1000000))","v":1},{"$f":"IF(BQ9=\"\", \"\", CS9)","v":""},{"$f":"COUNTIF(CT$8:CT$31,CT9)","v":24},12.5,{"$f":"IF(BO9=\"\", \"\", CV9)","v":""},{"$f":"SUM(C9,H9,M9,R9,W9,AB9,AG9,AL9)","v":0},{"$f":"IF(CX9=0, \"\", CX9)","v":""},{"$f":"1+SUMPRODUCT(--($CS$8:$CS$31+1-$CX$8:$CX$31/1000000<$CS9+1-$CX9/1000000))","v":1},{"$f":"COUNTIF(CZ$8:CZ$31,CZ9)","v":24},{"$f":"(((CZ9+DA9-1)*((CZ9+DA9-1)+1)/2)-((CZ9-1)*((CZ9-1)+1)/2))/DA9","v":12.5},{"$f":"IF(BO9=\"\", \"\", DB9)","v":""},{"$f":"IF($F9=\"\", 0, $F9)","v":0},{"$f":"IF(DD9=0, \"\", DD9)","v":""},{"$f":"1+SUMPRODUCT(--($CZ$8:$CZ$31+$DD$8:$DD$31/1000000<$CZ9+$DD9/1000000))","v":1},{"$f":"COUNTIF(DF$8:DF$31,DF9)","v":24},{"$f":"(((DF9+DG9-1)*((DF9+DG9-1)+1)/2)-((DF9-1)*((DF9-1)+1)/2))/DG9","v":12.5},{"$f":"IF(BO9=\"\", \"\", DH9)","v":""},{"$f":"AQ9-F9","v":{"$error":"#VALUE!"}},{"$f":"IF(ISERROR(DJ9), 0, DJ9)","v":0},{"$f":"IF(DK9=0, \"\", DK9)","v":""},{"$f":"1+SUMPRODUCT(--($DF$8:$DF$31+$DK$8:$DK$31/1000000<$DF9+$DK9/1000000))","v":1},{"$f":"COUNTIF(DM$8:DM$31,DM9)","v":24},{"$f":"(((DM9+DN9-1)*((DM9+DN9-1)+1)/2)-((DM9-1)*((DM9-1)+1)/2))/DN9","v":12.5},{"$f":"IF(DK9=0, \"\", DO9)","v":""},{"$f":"IF(ISNUMBER(DP9),DP9,IF(ISNUMBER(DI9),DI9,BU9))","v":1},{"$f":"IF(DQ9>25, \"\", DQ9)","v":1},{"$f":"IF(C9=\"DQ\", \"DQ\", DR9 )","v":1},{"$f":"IF(DR9=\"\", \"\", SMALL(DR$8:DR$31, 2))","v":1},{"$f":"INDEX($DS$8:$DS$31,MATCH(DT9,$DR$8:$DR$31,FALSE),1)","v":1},{"$f":"IF(DU9=FALSE, \"\", DU9)","v":1},{"$f":"IF(DR9=\"\", \"\", OFFSET(B$8,MATCH(SMALL(DR$8:DR$31,ROW()-ROW(DR$8)+1),DR$8:DR$31,0)-1,0))","v":""},{"$f":"COUNT($DR$8:$DR$31)-(RANK(DR9,$DR$8:$DR$31,0)+COUNTIF($DR$8:DR9,DR9))+2","v":23},{"$f":"IF(ISERROR(DX9), \" \", DX9)","v":23},{"$f":"OFFSET(B$8,MATCH(SMALL(DY$8:DY$31,ROW()-ROW(DZ$8)+1),DY$8:DY$31,0)-1,0)","v":""},{"$f":"IF(ISERROR(DZ9), \" \", DZ9)","v":""},{"$f":"IF(COUNTIF($DT$8:$DT32,DT9)>1,\"TIE\",\"\")","v":"TIE"},{"$f":"IF(DU9=\"DQ\", \"\", EB9)","v":"TIE"},{"$f":"IF(DT9=\"\", \"\", EC9)","v":"TIE"},null,{"$f":"DU9","v":1},{"$f":"IF(AQ9<>0, EF9, \"\")","v":""},{"$f":"EA9","v":""},{"$f":"INDEX($C$8:$C$31,MATCH(EA9,$B$8:$B$31,FALSE),1)","v":""},{"$f":"IF(ISERROR(EI9), \"\", EI9)","v":""},{"$f":"INDEX($G$8:$G$31,MATCH(EA9,$B$8:$B$31,FALSE),1)","v":""},"",{"$f":"INDEX($H$8:$H$31,MATCH(EA9,$B$8:$B$31,FALSE),1)","v":""},{"$f":"IF(ISERROR(EM9), \"\", EM9)","v":""},{"$f":"INDEX($L$8:$L$31,MATCH(EA9,$B$8:$B$31,FALSE),1)","v":""},"",{"$f":"INDEX($M$8:$M$31,MATCH(EA9,$B$8:$B$31,FALSE),1)","v":""},{"$f":"IF(ISERROR(EQ9), \"\", EQ9)","v":""},{"$f":"INDEX($Q$8:$Q$31,MATCH(EA9,$B$8:$B$31,FALSE),1)","v":""},{"$f":"IF(ISERROR(ES9), \"\", ES9)","v":""},{"$f":"INDEX($R$8:$R$31,MATCH(EA9,$B$8:$B$31,FALSE),1)","v":""},"",{"$f":"INDEX($V$8:$V$31,MATCH(EA9,$B$8:$B$31,FALSE),1)","v":""},{"$f":"IF(ISERROR(EW9), \"\", EW9)","v":""},{"$f":"INDEX($W$8:$W$31,MATCH(EA9,$B$8:$B$31,FALSE),1)","v":""},{"$f":"IF(ISERROR(EY9), \"\", EY9)","v":""},{"$f":"INDEX($AA$8:$AA$31,MATCH(EA9,$B$8:$B$31,FALSE),1)","v":""},"",{"$f":"INDEX($AB$8:$AB$31,MATCH(EA9,$B$8:$B$31,FALSE),1)","v":""},{"$f":"IF(ISERROR(FC9), \"\", FC9)","v":""},{"$f":"INDEX($AF$8:$AF$31,MATCH(EA9,$B$8:$B$31,FALSE),1)","v":""},{"$f":"IF(ISERROR(FE9), \"\", FE9)","v":""},{"$f":"INDEX($AG$8:$AG$31,MATCH(EA9,$B$8:$B$31,FALSE),1)","v":""},{"$f":"IF(ISERROR(FG9), \"\", FG9)","v":""},{"$f":"INDEX($AK$8:$AK$31,MATCH(EA9,$B$8:$B$31,FALSE),1)","v":""},{"$f":"IF(ISERROR(FI9), \"\", FI9)","v":""},{"$f":"INDEX($AL$8:$AL$31,MATCH(EA9,$B$8:$B$31,FALSE),1)","v":""},{"$f":"IF(ISERROR(FK9), \"\", FK9)","v":""},{"$f":"INDEX($AP$8:$AP$31,MATCH(EA9,$B$8:$B$31,FALSE),1)","v":""},{"$f":"IF(ISERROR(FM9), \"\", FM9)","v":""},{"$f":"INDEX($AX$8:$AX$31,MATCH(EA9,$B$8:$B$31,FALSE),1)","v":""},{"$f":"IF(ISERROR(FO9), \"\", FO9)","v":""},{"$f":"INDEX($BB$8:$BB$31,MATCH(EA9,$B$8:$B$31,FALSE),1)","v":24},24,{"$f":"INDEX($BE$8:$BE$31,MATCH(EA9,$B$8:$B$31,FALSE),1)","v":0},{"$f":"IF(ISERROR(FS9), \"\", FS9)","v":0},{"$f":"IF(AQ9<>0, FT9, \"\")","v":""},{"$f":"INDEX($BK$8:$BK$31,MATCH(EA9,$B$8:$B$31,FALSE),1)","v":""},{"$f":"IF(ISERROR(FV9), \"\", FV9)","v":""},{"$f":"INDEX($BI$8:$BI$31,MATCH(EA9,$B$8:$B$31,FALSE),1)","v":24},{"$f":"IF(ISERROR(FX9), \"\", FX9)","v":24},{"$f":"INDEX($BN$8:$BN$31,MATCH(EA9,$B$8:$B$31,FALSE),1)","v":0},{"$f":"IF(ISERROR(FZ9), \"\", FZ9)","v":0},{"$f":"IF(AQ9<>0, GA9, \"\")","v":""},{"$f":"INDEX($BT$8:$BT$31,MATCH(EA9,$B$8:$B$31,FALSE),1)","v":""},{"$f":"IF(ISERROR(GC9), \"\", GC9)","v":""},null,{"$f":"INDEX($AR$8:$AR$31,MATCH(EA9,$B$8:$B$31,FALSE),1)","v":0},{"$f":"IF(EF9=\"DQ\", \"\", GF9)","v":0},{"$f":"IF(ISERROR(GG9), 0, GG9)","v":0},{"$f":"INDEX($AT$8:$AT$31,MATCH(EA9,$B$8:$B$31,FALSE),1)","v":0},0,{"$f":"IF(ISERROR(GJ9), 0, GJ9)","v":0},{"$f":"INDEX($AU$8:$AU$31,MATCH(EA9,$B$8:$B$31,FALSE),1)","v":0},0,{"$f":"IF(ISERROR(GM9), 0, GM9)","v":0},null,2,{"$f":"IF('Ranking Sheet'!B13=0, \"\", 'Ranking Sheet'!B13)","v":""},{"$f":"IF(Team2!$L$9=0, \"\", Team2!$L$9)","v":""},{"$f":"IF(Team2!$L$10=0, \"\", Team2!$L$10)","v":""},{"$f":"IF(Team2!$L$11=0, \"\", Team2!$L$11)","v":""},{"$f":"IF(Team2!$L$12=0, \"\", Team2!$L$12)","v":""},{"$f":"IF(Team2!$L$13=0, \"\", Team2!$L$13)","v":""},{"$f":"IF(Team2!$L$14=0, \"\", Team2!$L$14)","v":""},{"$f":"IF(Team2!$L$15=0, \"\", Team2!$L$15)","v":""},{"$f":"IF(Team2!$L$16=0, \"\", Team2!$L$16)","v":""},{"$f":"IF(Team2!$L$17=0, \"\", Team2!$L$17)","v":""},{"$f":"IF(Team2!$L$18=0, \"\", Team2!$L$18)","v":""},{"$f":"IF(Team2!$L$19=0, \"\", Team2!$L$19)","v":""},{"$f":"IF(Team2!$L$20=0, \"\", Team2!$L$20)","v":""},{"$f":"IF(Team2!$L$21=0, \"\", Team2!$L$21)","v":""},{"$f":"IF(Team2!$N$21=0, \"\", Team2!$N$21)","v":""},1,"","","",{"$f":"IF(AW9=\"\", \"\", OFFSET(GR$8,MATCH(SMALL(DY$8:DY$31,ROW()-ROW(DY$8)+1),DY$8:DY$31,0)-1,0))","v":""},{"$f":"IF(AW9=\"\", \"\", OFFSET(GS$8,MATCH(SMALL(DY$8:DY$31,ROW()-ROW(DY$8)+1),DY$8:DY$31,0)-1,0))","v":""},{"$f":"IF(AW9=\"\", \"\", OFFSET(GT$8,MATCH(SMALL(DY$8:DY$31,ROW()-ROW(DY$8)+1),DY$8:DY$31,0)-1,0))","v":""},{"$f":"IF(AW9=\"\", \"\", OFFSET(GU$8,MATCH(SMALL(DY$8:DY$31,ROW()-ROW(DY$8)+1),DY$8:DY$31,0)-1,0))","v":""},{"$f":"IF(AW9=\"\", \"\", OFFSET(GV$8,MATCH(SMALL(DY$8:DY$31,ROW()-ROW(DY$8)+1),DY$8:DY$31,0)-1,0))","v":""},{"$f":"IF(AW9=\"\", \"\", OFFSET(GW$8,MATCH(SMALL(DY$8:DY$31,ROW()-ROW(DY$8)+1),DY$8:DY$31,0)-1,0))","v":""},{"$f":"IF(AW9=\"\", \"\", OFFSET(GX$8,MATCH(SMALL(DY$8:DY$31,ROW()-ROW(DY$8)+1),DY$8:DY$31,0)-1,0))","v":""},{"$f":"IF(AW9=\"\", \"\", OFFSET(GY$8,MATCH(SMALL(DY$8:DY$31,ROW()-ROW(DY$8)+1),DY$8:DY$31,0)-1,0))","v":""},{"$f":"IF(AW9=\"\", \"\", OFFSET(GZ$8,MATCH(SMALL(DY$8:DY$31,ROW()-ROW(DY$8)+1),DY$8:DY$31,0)-1,0))","v":""},{"$f":"IF(AW9=\"\", \"\", OFFSET(HA$8,MATCH(SMALL(DY$8:DY$31,ROW()-ROW(DY$8)+1),DY$8:DY$31,0)-1,0))","v":""},"","","","","",null,1,"",{"$f":"IF(AW9=\"\", \"\", OFFSET(GR$8,MATCH(SMALL(DY$8:DY$31,ROW()-ROW(DY$8)+1),DY$8:DY$31,0)-1,0))","v":""},{"$f":"IF(AW9=\"\", \"\", OFFSET(GS$8,MATCH(SMALL(DY$8:DY$31,ROW()-ROW(DY$8)+1),DY$8:DY$31,0)-1,0))","v":""},{"$f":"IF(AW9=\"\", \"\", OFFSET(GT$8,MATCH(SMALL(DY$8:DY$31,ROW()-ROW(DY$8)+1),DY$8:DY$31,0)-1,0))","v":""},{"$f":"IF(AW9=\"\", \"\", OFFSET(GU$8,MATCH(SMALL(DY$8:DY$31,ROW()-ROW(DY$8)+1),DY$8:DY$31,0)-1,0))","v":""},{"$f":"IF(AW9=\"\", \"\", OFFSET(GV$8,MATCH(SMALL(DY$8:DY$31,ROW()-ROW(DY$8)+1),DY$8:DY$31,0)-1,0))","v":""},{"$f":"IF(AW9=\"\", \"\", OFFSET(GW$8,MATCH(SMALL(DY$8:DY$31,ROW()-ROW(DY$8)+1),DY$8:DY$31,0)-1,0))","v":""},{"$f":"IF(AW9=\"\", \"\", OFFSET(GX$8,MATCH(SMALL(DY$8:DY$31,ROW()-ROW(DY$8)+1),DY$8:DY$31,0)-1,0))","v":""},{"$f":"IF(AW9=\"\", \"\", OFFSET(GY$8,MATCH(SMALL(DY$8:DY$31,ROW()-ROW(DY$8)+1),DY$8:DY$31,0)-1,0))","v":""},{"$f":"IF(AW9=\"\", \"\", OFFSET(GZ$8,MATCH(SMALL(DY$8:DY$31,ROW()-ROW(DY$8)+1),DY$8:DY$31,0)-1,0))","v":""},{"$f":"IF(AW9=\"\", \"\", OFFSET(HA$8,MATCH(SMALL(DY$8:DY$31,ROW()-ROW(DY$8)+1),DY$8:DY$31,0)-1,0))","v":""},"","","",""]
[3,{"$f":"IF('Ranking Sheet'!B14=0, \"\", 'Ranking Sheet'!B14)","v":""},{"$f":"IF(Team3!$D$21=0, \"\", Team3!$D$21)","v":""},"","","","",{"$f":"IF(Team3!$E$21=0, \"\", Team3!$E$21)","v":""},"","","","",{"$f":"IF(Team3!$F$21=0, \"\", Team3!$F$21)","v":""},"","","","",{"$f":"IF(Team3!$G$21=0, \"\", Team3!$G$21)","v":""},"","","","",{"$f":"IF(Team3!$H$21=0, \"\", Team3!$H$21)","v":""},"","","","",{"$f":"IF(Team3!$I$21=0, \"\", Team3!$I$21)","v":""},"","","","",{"$f":"IF(Team3!$J$21=0, \"\", Team3!$J$21)","v":""},"","","","",{"$f":"IF(Team3!$K$21=0, \"\", Team3!$K$21)","v":""},"","","","",0,0,{"$f":"LARGE((F10,K10,P10,U10,Z10,AE10,AJ10,AO10), 2)","v":{"$error":"#NUM!"}},0,0,0,"","",{"$error":"#VALUE!"},99,1,24,{"$error":"#VALUE!"},"",0,"",1,"",24,12.5,"",0,0,0,"",1,"",24,12.5,"",1,1,1,{"$f":"IF(BV10=\"\", \"\", SMALL(BV$8:BV$31, 3))","v":1},"","",{"$f":"COUNT($BV$8:$BV$31)-(RANK(BV10,$BV$8:$BV$31,0)+COUNTIF($BV$8:BV10,BV10))+2","v":22},22,"","",{"$f":"IF(COUNTIF($BX$8:$BX33,BX10)>1,\"TIE\",\"\")","v":"TIE"},"TIE","","","","*","*","*","",null,0,0,0,"",1,"",24,12.5,"",0,"",1,24,12.5,"",0,"",1,24,12.5,"",{"$error":"#VALUE!"},0,"",1,24,12.5,"",1,1,1,{"$f":"IF(DR10=\"\", \"\", SMALL(DR$8:DR$31, 3))","v":1},1,1,"",{"$f":"COUNT($DR$8:$DR$31)-(RANK(DR10,$DR$8:$DR$31,0)+COUNTIF($DR$8:DR10,DR10))+2","v":22},22,"","",{"$f":"IF(COUNTIF($DT$8:$DT33,DT10)>1,\"TIE\",\"\")","v":"TIE"},"TIE","TIE",null,1,"","","","","","","","","","","","","","","","","","","","","","","","","","","","","","","","","","","","",24,24,0,0,"","","",24,24,0,0,"","","",null,0,0,0,0,0,0,0,0,0,null,3,{"$f":"IF('Ranking Sheet'!B14=0, \"\", 'Ranking Sheet'!B14)","v":""},{"$f":"IF(Team3!$L$9=0, \"\", Team3!$L$9)","v":""},{"$f":"IF(Team3!$L$10=0, \"\", Team3!$L$10)","v":""},{"$f":"IF(Team3!$L$11=0, \"\", Team3!$L$11)","v":""},{"$f":"IF(Team3!$L$12=0, \"\", Team3!$L$12)","v":""},{"$f":"IF(Team3!$L$13=0, \"\", Team3!$L$13)","v":""},{"$f":"IF(Team3!$L$14=0, \"\", Team3!$L$14)","v":""},{"$f":"IF(Team3!$L$15=0, \"\", Team3!$L$15)","v":""},{"$f":"IF(Team3!$L$16=0, \"\", Team3!$L$16)","v":""},{"$f":"IF(Team3!$L$17=0, \"\", Team3!$L$17)","v":""},{"$f":"IF(Team3!$L$18=0, \"\", Team3!$L$18)","v":""},{"$f":"IF(Team3!$L$19=0, \"\", Team3!$L$19)","v":""},{"$f":"IF(Team3!$L$20=0, \"\", Team3!$L$20)","v":""},{"$f":"IF(Team3!$L$21=0, \"\", Team3!$L$21)","v":""},{"$f":"IF(Team3!$N$21=0, \"\", Team3!$N$21)","v":""},1,"","","","","","","","","","","","","","","","","","",null,1,"",{"$f":"IF(AW10=\"\", \"\", OFFSET(GR$8,MATCH(SMALL(DY$8:DY$31,ROW()-ROW(DY$8)+1),DY$8:DY$31,0)-1,0))","v":""},{"$f":"IF(AW10=\"\", \"\", OFFSET(GS$8,MATCH(SMALL(DY$8:DY$31,ROW()-ROW(DY$8)+1),DY$8:DY$31,0)-1,0))","v":""},{"$f":"IF(AW10=\"\", \"\", OFFSET(GT$8,MATCH(SMALL(DY$8:DY$31,ROW()-ROW(DY$8)+1),DY$8:DY$31,0)-1,0))","v":""},{"$f":"IF(AW10=\"\", \"\", OFFSET(GU$8,MATCH(SMALL(DY$8:DY$31,ROW()-ROW(DY$8)+1),DY$8:DY$31,0)-1,0))","v":""},{"$f":"IF(AW10=\"\", \"\", OFFSET(GV$8,MATCH(SMALL(DY$8:DY$31,ROW()-ROW(DY$8)+1),DY$8:DY$31,0)-1,0))","v":""},{"$f":"IF(AW10=\"\", \"\", OFFSET(GW$8,MATCH(SMALL(DY$8:DY$31,ROW()-ROW(DY$8)+1),DY$8:DY$31,0)-1,0))","v":""},{"$f":"IF(AW10=\"\", \"\", OFFSET(GX$8,MATCH(SMALL(DY$8:DY$31,ROW()-ROW(DY$8)+1),DY$8:DY$31,0)-1,0))","v":""},{"$f":"IF(AW10=\"\", \"\", OFFSET(GY$8,MATCH(SMALL(DY$8:DY$31,ROW()-ROW(DY$8)+1),DY$8:DY$31,0)-1,0))","v":""},{"$f":"IF(AW10=\"\", \"\", OFFSET(GZ$8,MATCH(SMALL(DY$8:DY$31,ROW()-ROW(DY$8)+1),DY$8:DY$31,0)-1,0))","v":""},{"$f":"IF(AW10=\"\", \"\", OFFSET(HA$8,MATCH(SMALL(DY$8:DY$31,ROW()-ROW(DY$8)+1),DY$8:DY$31,0)-1,0))","v":""},"","","",""]
[4,{"$f":"IF('Ranking Sheet'!B15=0, \"\", 'Ranking Sheet'!B15)","v":""},{"$f":"IF(Team4!$D$21=0,\"\", Team4!$D$21)","v":""},"","","","",{"$f":"IF(Team4!$E$21=0,\"\", Team4!$E$21)","v":""},"","","","",{"$f":"IF(Team4!$F$21=0,\"\", Team4!$F$21)","v":""},"","","","",{"$f":"IF(Team4!$G$21=0,\"\", Team4!$G$21)","v":""},"","","","",{"$f":"IF(Team4!$H$21=0,\"\", Team4!$H$21)","v":""},"","","","",{"$f":"IF(Team4!$I$21=0,\"\", Team4!$I$21)","v":""},"","","","",{"$f":"IF(Team4!$J$21=0,\"\", Team4!$J$21)","v":""},"","","","",{"$f":"IF(Team4!$K$21=0,\"\", Team4!$K$21)","v":""},"","","","",0,0,{"$f":"LARGE((F11,K11,P11,U11,Z11,AE11,AJ11,AO11), 2)","v":{"$error":"#NUM!"}},0,0,0,"","",{"$error":"#VALUE!"},99,1,24,{"$error":"#VALUE!"},"",0,"",1,"",24,12.5,"",0,0,0,"",1,"",24,12.5,"",1,1,1,{"$f":"IF(BV11=\"\", \"\", SMALL(BV$8:BV$31, 4))","v":1},"","",{"$f":"COUNT($BV$8:$BV$31)-(RANK(BV11,$BV$8:$BV$31,0)+COUNTIF($BV$8:BV11,BV11))+2","v":21},21,"","",{"$f":"IF(COUNTIF($BX$8:$BX34,BX11)>1,\"TIE\",\"\")","v":"TIE"},"TIE","","","","*","*","*","",null,0,0,0,"",1,"",24,12.5,"",0,"",1,24,12.5,"",0,"",1,24,12.5,"",{"$error":"#VALUE!"},0,"",1,24,12.5,"",1,1,1,{"$f":"IF(DR11=\"\", \"\", SMALL(DR$8:DR$31, 4))","v":1},1,1,"",{"$f":"COUNT($DR$8:$DR$31)-(RANK(DR11,$DR$8:$DR$31,0)+COUNTIF($DR$8:DR11,DR11))+2","v":21},21,"","",{"$f":"IF(COUNTIF($DT$8:$DT34,DT11)>1,\"TIE\",\"\")","v":"TIE"},"TIE","TIE",null,1,"","","","","","","","","","","","","","","","","","","","","","","","","","","","","","","","","","","","",24,24,0,0,"","","",24,24,0,0,"","","",null,0,0,0,0,0,0,0,0,0,null,4,{"$f":"IF('Ranking Sheet'!B15=0, \"\", 'Ranking Sheet'!B15)","v":""},{"$f":"IF(Team4!$L$9=0, \"\", Team4!$L$9)","v":""},{"$f":"IF(Team4!$L$10=0, \"\", Team4!$L$10)","v":""},{"$f":"IF(Team4!$L$11=0, \"\", Team4!$L$11)","v":""},{"$f":"IF(Team4!$L$12=0, \"\", Team4!$L$12)","v":""},{"$f":"IF(Team4!$L$13=0, \"\", Team4!$L$13)","v":""},{"$f":"IF(Team4!$L$14=0, \"\", Team4!$L$14)","v":""},{"$f":"IF(Team4!$L$15=0, \"\", Team4!$L$15)","v":""},{"$f":"IF(Team4!$L$16=0, \"\", Team4!$L$16)","v":""},{"$f":"IF(Team4!$L$17=0, \"\", Team4!$L$17)","v":""},{"$f":"IF(Team4!$L$18=0, \"\", Team4!$L$18)","v":""},{"$f":"IF(Team4!$L$19=0, \"\", Team4!$L$19)","v":""},{"$f":"IF(Team4!$L$20=0, \"\", Team4!$L$20)","v":""},{"$f":"IF(Team4!$L$21=0, \"\", Team4!$L$21)","v":""},{"$f":"IF(Team4!$N$21=0, \"\", Team4!$N$21)","v":""},1,"","","","","","","","","","","","","","","","","","",null,1,"",{"$f":"IF(AW11=\"\", \"\", OFFSET(GR$8,MATCH(SMALL(DY$8:DY$31,ROW()-ROW(DY$8)+1),DY$8:DY$31,0)-1,0))","v":""},{"$f":"IF(AW11=\"\", \"\", OFFSET(GS$8,MATCH(SMALL(DY$8:DY$31,ROW()-ROW(DY$8)+1),DY$8:DY$31,0)-1,0))","v":""},{"$f":"IF(AW11=\"\", \"\", OFFSET(GT$8,MATCH(SMALL(DY$8:DY$31,ROW()-ROW(DY$8)+1),DY$8:DY$31,0)-1,0))","v":""},{"$f":"IF(AW11=\"\", \"\", OFFSET(GU$8,MATCH(SMALL(DY$8:DY$31,ROW()-ROW(DY$8)+1),DY$8:DY$31,0)-1,0))","v":""},{"$f":"IF(AW11=\"\", \"\", OFFSET(GV$8,MATCH(SMALL(DY$8:DY$31,ROW()-ROW(DY$8)+1),DY$8:DY$31,0)-1,0))","v":""},{"$f":"IF(AW11=\"\", \"\", OFFSET(GW$8,MATCH(SMALL(DY$8:DY$31,ROW()-ROW(DY$8)+1),DY$8:DY$31,0)-1,0))","v":""},{"$f":"IF(AW11=\"\", \"\", OFFSET(GX$8,MATCH(SMALL(DY$8:DY$31,ROW()-ROW(DY$8)+1),DY$8:DY$31,0)-1,0))","v":""},{"$f":"IF(AW11=\"\", \"\", OFFSET(GY$8,MATCH(SMALL(DY$8:DY$31,ROW()-ROW(DY$8)+1),DY$8:DY$31,0)-1,0))","v":""},{"$f":"IF(AW11=\"\", \"\", OFFSET(GZ$8,MATCH(SMALL(DY$8:DY$31,ROW()-ROW(DY$8)+1),DY$8:DY$31,0)-1,0))","v":""},{"$f":"IF(AW11=\"\", \"\", OFFSET(HA$8,MATCH(SMALL(DY$8:DY$31,ROW()-ROW(DY$8)+1),DY$8:DY$31,0)-1,0))","v":""},"","","",""]
[5,{"$f":"IF('Ranking Sheet'!B16=0, \"\", 'Ranking Sheet'!B16)","v":""},{"$f":"IF(Team5!$D$21=0, \"\", Team5!$D$21)","v":""},"","","","",{"$f":"IF(Team5!$E$21=0, \"\", Team5!$E$21)","v":""},"","","","",{"$f":"IF(Team5!$F$21=0, \"\", Team5!$F$21)","v":""},"","","","",{"$f":"IF(Team5!$G$21=0, \"\", Team5!$G$21)","v":""},"","","","",{"$f":"IF(Team5!$H$21=0, \"\", Team5!$H$21)","v":""},"","","","",{"$f":"IF(Team5!$I$21=0, \"\", Team5!$I$21)","v":""},"","","","",{"$f":"IF(Team5!$J$21=0, \"\", Team5!$J$21)","v":""},"","","","",{"$f":"IF(Team5!$K$21=0, \"\", Team5!$K$21)","v":""},"","","","",0,0,{"$f":"LARGE((F12,K12,P12,U12,Z12,AE12,AJ12,AO12), 2)","v":{"$error":"#NUM!"}},0,0,0,"","",{"$error":"#VALUE!"},99,1,24,{"$error":"#VALUE!"},"",0,"",1,"",24,12.5,"",0,0,0,"",1,"",24,12.5,"",1,1,1,{"$f":"IF(BV12=\"\", \"\", SMALL(BV$8:BV$31, 5))","v":1},"","",{"$f":"COUNT($BV$8:$BV$31)-(RANK(BV12,$BV$8:$BV$31,0)+COUNTIF($BV$8:BV12,BV12))+2","v":20},20,"","",{"$f":"IF(COUNTIF($BX$8:$BX35,BX12)>1,\"TIE\",\"\")","v":"TIE"},"TIE","","","","*","*",{"$f":"IF(ISERROR(CK12), \" \", CK12)","v":"*"},"",null,0,0,0,"",1,"",24,12.5,"",0,"",1,24,12.5,"",0,"",1,24,12.5,"",{"$error":"#VALUE!"},0,"",1,24,12.5,"",1,1,1,{"$f":"IF(DR12=\"\", \"\", SMALL(DR$8:DR$31, 5))","v":1},1,1,"",{"$f":"COUNT($DR$8:$DR$31)-(RANK(DR12,$DR$8:$DR$31,0)+COUNTIF($DR$8:DR12,DR12))+2","v":20},20,"","",{"$f":"IF(COUNTIF($DT$8:$DT35,DT12)>1,\"TIE\",\"\")","v":"TIE"},"TIE","TIE",null,1,"","","","","","","","","","","","","","","","","","","","","","","","","","","","","","","","","","","","",24,24,0,0,"","","",24,24,0,0,"","","",null,0,0,0,0,0,0,0,0,0,null,5,{"$f":"IF('Ranking Sheet'!B16=0, \"\", 'Ranking Sheet'!B16)","v":""},{"$f":"IF(Team5!$L$9=0, \"\", Team5!$L$9)","v":""},{"$f":"IF(Team5!$L$10=0, \"\", Team5!$L$10)","v":""},{"$f":"IF(Team5!$L$11=0, \"\", Team5!$L$11)","v":""},{"$f":"IF(Team5!$L$12=0, \"\", Team5!$L$12)","v":""},{"$f":"IF(Team5!$L$13=0, \"\", Team5!$L$13)","v":""},{"$f":"IF(Team5!$L$14=0, \"\", Team5!$L$14)","v":""},{"$f":"IF(Team5!$L$15=0, \"\", Team5!$L$15)","v":""},{"$f":"IF(Team5!$L$16=0, \"\", Team5!$L$16)","v":""},{"$f":"IF(Team5!$L$17=0, \"\", Team5!$L$17)","v":""},{"$f":"IF(Team5!$L$18=0, \"\", Team5!$L$18)","v":""},{"$f":"IF(Team5!$L$19=0, \"\", Team5!$L$19)","v":""},{"$f":"IF(Team5!$L$20=0, \"\", Team5!$L$20)","v":""},{"$f":"IF(Team5!$L$21=0, \"\", Team5!$L$21)","v":""},{"$f":"IF(Team5!$N$21=0, \"\", Team5!$N$21)","v":""},1,"","","","","","","","","","","","","","","","","","",null,1,"","","","","","","","","","","","","","",""]
[6,{"$f":"IF('Ranking Sheet'!B17=0, \"\", 'Ranking Sheet'!B17)","v":""},{"$f":"IF(Team6!$D$21=0, \"\", Team6!$D$21)","v":""},"","","","",{"$f":"IF(Team6!$E$21=0, \"\", Team6!$E$21)","v":""},"","","","",{"$f":"IF(Team6!$F$21=0, \"\", Team6!$F$21)","v":""},"","","","",{"$f":"IF(Team6!$G$21=0, \"\", Team6!$G$21)","v":""},"","","","",{"$f":"IF(Team6!$H$21=0, \"\", Team6!$H$21)","v":""},"","","","",{"$f":"IF(Team6!$I$21=0, \"\", Team6!$I$21)","v":""},"","","","",{"$f":"IF(Team6!$J$21=0, \"\", Team6!$J$21)","v":""},"","","","",{"$f":"IF(Team6!$K$21=0, \"\", Team6!$K$21)","v":""},"","","","",0,0,{"$f":"LARGE((F13,K13,P13,U13,Z13,AE13,AJ13,AO13), 2)","v":{"$error":"#NUM!"}},0,0,{"$f":"AQ13-AR13-AT13-AU13","v":0},"","",{"$error":"#VALUE!"},99,1,24,{"$error":"#VALUE!"},"",0,"",1,"",24,12.5,"",0,0,0,"",1,"",24,12.5,"",1,1,1,{"$f":"IF(BV13=\"\", \"\", SMALL(BV$8:BV$31, 6))","v":1},"","",{"$f":"COUNT($BV$8:$BV$31)-(RANK(BV13,$BV$8:$BV$31,0)+COUNTIF($BV$8:BV13,BV13))+2","v":19},19,"","",{"$f":"IF(COUNTIF($BX$8:$BX36,BX13)>1,\"TIE\",\"\")","v":"TIE"},"TIE","","","","*","*","*","",null,0,0,0,"",1,"",24,12.5,"",0,"",1,24,12.5,"",0,"",1,24,12.5,"",{"$error":"#VALUE!"},0,"",1,24,12.5,"",1,1,1,{"$f":"IF(DR13=\"\", \"\", SMALL(DR$8:DR$31, 6))","v":1},1,1,"",{"$f":"COUNT($DR$8:$DR$31)-(RANK(DR13,$DR$8:$DR$31,0)+COUNTIF($DR$8:DR13,DR13))+2","v":19},19,"","",{"$f":"IF(COUNTIF($DT$8:$DT36,DT13)>1,\"TIE\",\"\")","v":"TIE"},"TIE","TIE",null,1,"","","","","","","","","","","","","","","","","","","","","","","","","","","","","","","","","","","","",24,24,0,0,"","","",24,24,0,0,"","","",null,0,0,0,0,0,0,0,0,0,null,6,{"$f":"IF('Ranking Sheet'!B17=0, \"\", 'Ranking Sheet'!B17)","v":""},{"$f":"IF(Team6!$L$9=0, \"\", Team6!$L$9)","v":""},{"$f":"IF(Team6!$L$10=0, \"\", Team6!$L$10)","v":""},{"$f":"IF(Team6!$L$11=0, \"\", Team6!$L$11)","v":""},{"$f":"IF(Team6!$L$12=0, \"\", Team6!$L$12)","v":""},{"$f":"IF(Team6!$L$13=0, \"\", Team6!$L$13)","v":""},{"$f":"IF(Team6!$L$14=0, \"\", Team6!$L$14)","v":""},{"$f":"IF(Team6!$L$15=0, \"\", Team6!$L$15)","v":""},{"$f":"IF(Team6!$L$16=0, \"\", Team6!$L$16)","v":""},{"$f":"IF(Team6!$L$17=0, \"\", Team6!$L$17)","v":""},{"$f":"IF(Team6!$L$18=0, \"\", Team6!$L$18)","v":""},{"$f":"IF(Team6!$L$19=0, \"\", Team6!$L$19)","v":""},{"$f":"IF(Team6!$L$20=0, \"\", Team6!$L$20)","v":""},{"$f":"IF(Team6!$L$21=0, \"\", Team6!$L$21)","v":""},{"$f":"IF(Team6!$N$21=0, \"\", Team6!$N$21)","v":""},1,"","","","","","","","","","","","","","","","","","",null,1,"","","","","","","","","","","","","","",""]
[7,{"$f":"IF('Ranking Sheet'!B18=0, \"\", 'Ranking Sheet'!B18)","v":""},{"$f":"IF(Team7!$D$21=0, \"\", Team7!$D$21)","v":""},"","","","",{"$f":"IF(Team7!$E$21=0, \"\", Team7!$E$21)","v":""},"","","","",{"$f":"IF(Team7!$F$21=0, \"\", Team7!$F$21)","v":""},"","","","",{"$f":"IF(Team7!$G$21=0, \"\", Team7!$G$21)","v":""},"","","","",{"$f":"IF(Team7!$H$21=0, \"\", Team7!$H$21)","v":""},"","","","",{"$f":"IF(Team7!$I$21=0, \"\", Team7!$I$21)","v":""},"","","","",{"$f":"IF(Team7!$J$21=0, \"\", Team7!$J$21)","v":""},"","","","",{"$f":"IF(Team7!$K$21=0, \"\", Team7!$K$21)","v":""},"","","","",0,0,{"$f":"LARGE((F14,K14,P14,U14,Z14,AE14,AJ14,AO14), 2)","v":{"$error":"#NUM!"}},0,0,0,"","",{"$error":"#VALUE!"},99,1,24,{"$error":"#VALUE!"},"",0,"",1,"",24,{"$f":"(((BG14+BI14-1)*((BG14+BI14-1)+1)/2)-((BG14-1)*((BG14-1)+1)/2))/BI14","v":12.5},"",0,0,0,"",1,"",24,12.5,"",1,1,1,{"$f":"IF(BV14=\"\", \"\", SMALL(BV$8:BV$31, 7))","v":1},"","",{"$f":"COUNT($BV$8:$BV$31)-(RANK(BV14,$BV$8:$BV$31,0)+COUNTIF($BV$8:BV14,BV14))+2","v":18},18,"","",{"$f":"IF(COUNTIF($BX$8:$BX37,BX14)>1,\"TIE\",\"\")","v":"TIE"},"TIE","","","","*","*","*","",null,0,0,0,"",1,"",24,12.5,"",0,"",1,24,12.5,"",0,"",1,24,12.5,"",{"$error":"#VALUE!"},0,"",1,24,12.5,"",1,1,1,{"$f":"IF(DR14=\"\", \"\", SMALL(DR$8:DR$31, 7))","v":1},1,1,"",{"$f":"COUNT($DR$8:$DR$31)-(RANK(DR14,$DR$8:$DR$31,0)+COUNTIF($DR$8:DR14,DR14))+2","v":18},18,"","",{"$f":"IF(COUNTIF($DT$8:$DT37,DT14)>1,\"TIE\",\"\")","v":"TIE"},"TIE","TIE",null,1,"","","","","","","","","","","","","","","","","","","","","","","","","","","","","","","","","","","","",24,24,0,0,"","","",24,24,0,0,"","","",null,0,0,0,0,0,0,0,0,0,null,7,{"$f":"IF('Ranking Sheet'!B18=0, \"\", 'Ranking Sheet'!B18)","v":""},{"$f":"IF(Team7!$L$9=0, \"\", Team7!$L$9)","v":""},{"$f":"IF(Team7!$L$10=0, \"\", Team7!$L$10)","v":""},{"$f":"IF(Team7!$L$11=0, \"\", Team7!$L$11)","v":""},{"$f":"IF(Team7!$L$12=0, \"\", Team7!$L$12)","v":""},{"$f":"IF(Team7!$L$13=0, \"\", Team7!$L$13)","v":""},{"$f":"IF(Team7!$L$14=0, \"\", Team7!$L$14)","v":""},{"$f":"IF(Team7!$L$15=0, \"\", Team7!$L$15)","v":""},{"$f":"IF(Team7!$L$16=0, \"\", Team7!$L$16)","v":""},{"$f":"IF(Team7!$L$17=0, \"\", Team7!$L$17)","v":""},{"$f":"IF(Team7!$L$18=0, \"\", Team7!$L$18)","v":""},{"$f":"IF(Team7!$L$19=0, \"\", Team7!$L$19)","v":""},{"$f":"IF(Team7!$L$20=0, \"\", Team7!$L$20)","v":""},{"$f":"IF(Team7!$L$21=0, \"\", Team7!$L$21)","v":""},{"$f":"IF(Team7!$N$21=0, \"\", Team7!$N$21)","v":""},1,"","","","","","","","","","","","","","","","","","",null,1,"","","","","","","","","","","","","","",""]
[8,{"$f":"IF('Ranking Sheet'!B19=0, \"\", 'Ranking Sheet'!B19)","v":""},{"$f":"IF(Team8!$D$21=0, \"\", Team8!$D$21)","v":""},"","","","",{"$f":"IF(Team8!$E$21=0, \"\", Team8!$E$21)","v":""},"","","","",{"$f":"IF(Team8!$F$21=0, \"\", Team8!$F$21)","v":""},"","","","",{"$f":"IF(Team8!$G$21=0, \"\", Team8!$G$21)","v":""},"","","","",{"$f":"IF(Team8!$H$21=0, \"\", Team8!$H$21)","v":""},"","","","",{"$f":"IF(Team8!$I$21=0, \"\", Team8!$I$21)","v":""},"","","","",{"$f":"IF(Team8!$J$21=0, \"\", Team8!$J$21)","v":""},"","","","",{"$f":"IF(Team8!$K$21=0, \"\", Team8!$K$21)","v":""},"","","","",0,0,{"$f":"LARGE((F15,K15,P15,U15,Z15,AE15,AJ15,AO15), 2)","v":{"$error":"#NUM!"}},{"$f":"IF(ISERROR(AS15), 0, AS15)","v":0},0,0,"","",{"$error":"#VALUE!"},99,{"$f":"AZ15-(SMALL(AZ$8:AZ$31,1))+1","v":1},24,{"$error":"#VALUE!"},"",0,"",1,"",24,12.5,"",0,0,0,"",1,"",24,12.5,"",1,1,1,{"$f":"IF(BV15=\"\", \"\", SMALL(BV$8:BV$31, 8))","v":1},"","",{"$f":"COUNT($BV$8:$BV$31)-(RANK(BV15,$BV$8:$BV$31,0)+COUNTIF($BV$8:BV15,BV15))+2","v":17},17,"","",{"$f":"IF(COUNTIF($BX$8:$BX38,BX15)>1,\"TIE\",\"\")","v":"TIE"},"TIE","","","","*","*","*","",null,0,0,0,"",1,"",24,12.5,"",0,"",1,24,12.5,"",0,"",1,24,12.5,"",{"$error":"#VALUE!"},0,"",1,24,12.5,"",1,1,1,{"$f":"IF(DR15=\"\", \"\", SMALL(DR$8:DR$31, 8))","v":1},1,1,"",{"$f":"COUNT($DR$8:$DR$31)-(RANK(DR15,$DR$8:$DR$31,0)+COUNTIF($DR$8:DR15,DR15))+2","v":17},17,"","",{"$f":"IF(COUNTIF($DT$8:$DT38,DT15)>1,\"TIE\",\"\")","v":"TIE"},"TIE","TIE",null,1,"","","","","","","","","","","","","","","","","","","","","","","","","","","","","","","","","","","","",24,24,0,0,"","","",24,24,0,0,"","","",null,0,0,0,0,0,0,0,0,0,null,8,{"$f":"IF('Ranking Sheet'!B19=0, \"\", 'Ranking Sheet'!B19)","v":""},{"$f":"IF(Team8!$L$9=0, \"\", Team8!$L$9)","v":""},{"$f":"IF(Team8!$L$10=0, \"\", Team8!$L$10)","v":""},{"$f":"IF(Team8!$L$11=0, \"\", Team8!$L$11)","v":""},{"$f":"IF(Team8!$L$12=0, \"\", Team8!$L$12)","v":""},{"$f":"IF(Team8!$L$13=0, \"\", Team8!$L$13)","v":""},{"$f":"IF(Team8!$L$14=0, \"\", Team8!$L$14)","v":""},{"$f":"IF(Team8!$L$15=0, \"\", Team8!$L$15)","v":""},{"$f":"IF(Team8!$L$16=0, \"\", Team8!$L$16)","v":""},{"$f":"IF(Team8!$L$17=0, \"\", Team8!$L$17)","v":""},{"$f":"IF(Team8!$L$18=0, \"\", Team8!$L$18)","v":""},{"$f":"IF(Team8!$L$19=0, \"\", Team8!$L$19)","v":""},{"$f":"IF(Team8!$L$20=0, \"\", Team8!$L$20)","v":""},{"$f":"IF(Team8!$L$21=0, \"\", Team8!$L$21)","v":""},{"$f":"IF(Team8!$N$21=0, \"\", Team8!$N$21)","v":""},1,"","","","","","","","","","","","","","","","","","",null,1,"","","","","","","","","","","","","","",""]
[9,{"$f":"IF('Ranking Sheet'!B20=0, \"\", 'Ranking Sheet'!B20)","v":""},{"$f":"IF(Team9!$D$21=0, \"\", Team9!$D$21)","v":""},"","","","",{"$f":"IF(Team9!$E$21=0, \"\", Team9!$E$21)","v":""},"","","","",{"$f":"IF(Team9!$F$21=0, \"\", Team9!$F$21)","v":""},"","","","",{"$f":"IF(Team9!$G$21=0, \"\", Team9!$G$21)","v":""},"","","","",{"$f":"IF(Team9!$H$21=0, \"\", Team9!$H$21)","v":""},"","","","",{"$f":"IF(Team9!$I$21=0, \"\", Team9!$I$21)","v":""},"","","","",{"$f":"IF(Team9!$J$21=0, \"\", Team9!$J$21)","v":""},"","","","",{"$f":"IF(Team9!$K$21=0, \"\", Team9!$K$21)","v":""},"","","","",0,0,{"$f":"LARGE((F16,K16,P16,U16,Z16,AE16,AJ16,AO16), 2)","v":{"$error":"#NUM!"}},0,0,0,"","",{"$error":"#VALUE!"},99,1,24,{"$error":"#VALUE!"},"",0,"",1,"",24,12.5,"",0,0,0,"",1,"",24,12.5,"",1,1,1,{"$f":"IF(BV16=\"\", \"\", SMALL(BV$8:BV$31, 9))","v":1},"","",{"$f":"COUNT($BV$8:$BV$31)-(RANK(BV16,$BV$8:$BV$31,0)+COUNTIF($BV$8:BV16,BV16))+2","v":16},16,"","",{"$f":"IF(COUNTIF($BX$8:$BX39,BX16)>1,\"TIE\",\"\")","v":"TIE"},"TIE","","","","*","*","*","",null,0,0,0,"",1,"",24,12.5,"",0,"",1,24,12.5,"",0,"",1,24,12.5,"",{"$error":"#VALUE!"},0,"",1,24,12.5,"",1,1,1,{"$f":"IF(DR16=\"\", \"\", SMALL(DR$8:DR$31, 9))","v":1},1,1,"",{"$f":"COUNT($DR$8:$DR$31)-(RANK(DR16,$DR$8:$DR$31,0)+COUNTIF($DR$8:DR16,DR16))+2","v":16},16,"","",{"$f":"IF(COUNTIF($DT$8:$DT39,DT16)>1,\"TIE\",\"\")","v":"TIE"},"TIE","TIE",null,1,"","","","","","","","","","","","","","","","","","","","","","","","","","","","","","","","","","","","",24,24,0,0,"","","",24,24,0,0,"","","",null,0,0,0,0,0,0,0,0,0,null,9,{"$f":"IF('Ranking Sheet'!B20=0, \"\", 'Ranking Sheet'!B20)","v":""},{"$f":"IF(Team9!$L$9=0, \"\", Team9!$L$9)","v":""},{"$f":"IF(Team9!$L$10=0, \"\", Team9!$L$10)","v":""},{"$f":"IF(Team9!$L$11=0, \"\", Team9!$L$11)","v":""},{"$f":"IF(Team9!$L$12=0, \"\", Team9!$L$12)","v":""},{"$f":"IF(Team9!$L$13=0, \"\", Team9!$L$13)","v":""},{"$f":"IF(Team9!$L$14=0, \"\", Team9!$L$14)","v":""},{"$f":"IF(Team9!$L$15=0, \"\", Team9!$L$15)","v":""},{"$f":"IF(Team9!$L$16=0, \"\", Team9!$L$16)","v":""},{"$f":"IF(Team9!$L$17=0, \"\", Team9!$L$17)","v":""},{"$f":"IF(Team9!$L$18=0, \"\", Team9!$L$18)","v":""},{"$f":"IF(Team9!$L$19=0, \"\", Team9!$L$19)","v":""},{"$f":"IF(Team9!$L$20=0, \"\", Team9!$L$20)","v":""},{"$f":"IF(Team9!$L$21=0, \"\", Team9!$L$21)","v":""},{"$f":"IF(Team9!$N$21=0, \"\", Team9!$N$21)","v":""},1,"","","","","","","","","","","","","","","","","","",null,1,"","","","","","","","","","","","","","",""]
[10,{"$f":"IF('Ranking Sheet'!B21=0, \"\", 'Ranking Sheet'!B21)","v":""},{"$f":"IF(Team10!$D$21=0, \"\", Team10!$D$21)","v":""},"","","","",{"$f":"IF(Team10!$E$21=0, \"\", Team10!$E$21)","v":""},"","","","",{"$f":"IF(Team10!$F$21=0, \"\", Team10!$F$21)","v":""},"","","","",{"$f":"IF(Team10!$G$21=0, \"\", Team10!$G$21)","v":""},"","","","",{"$f":"IF(Team10!$H$21=0, \"\", Team10!$H$21)","v":""},"","","","",{"$f":"IF(Team10!$I$21=0, \"\", Team10!$I$21)","v":""},"","","","",{"$f":"IF(Team10!$J$21=0, \"\", Team10!$J$21)","v":""},"","","","",{"$f":"IF(Team10!$K$21=0, \"\", Team10!$K$21)","v":""},"","","","",0,0,{"$f":"LARGE((F17,K17,P17,U17,Z17,AE17,AJ17,AO17), 2)","v":{"$error":"#NUM!"}},0,0,0,"","",{"$error":"#VALUE!"},99,1,24,{"$error":"#VALUE!"},"",0,"",1,"",24,12.5,"",0,0,0,"",1,"",24,12.5,"",1,1,1,{"$f":"IF(BV17=\"\", \"\", SMALL(BV$8:BV$31, 10))","v":1},"","",{"$f":"COUNT($BV$8:$BV$31)-(RANK(BV17,$BV$8:$BV$31,0)+COUNTIF($BV$8:BV17,BV17))+2","v":15},15,"","",{"$f":"IF(COUNTIF($BX$8:$BX40,BX17)>1,\"TIE\",\"\")","v":"TIE"},"TIE","","","","*","*","*","",null,0,0,0,"",1,"",24,12.5,"",0,"",1,24,12.5,"",0,"",1,24,12.5,"",{"$error":"#VALUE!"},0,"",1,24,12.5,"",1,1,1,{"$f":"IF(DR17=\"\", \"\", SMALL(DR$8:DR$31, 10))","v":1},1,1,"",{"$f":"COUNT($DR$8:$DR$31)-(RANK(DR17,$DR$8:$DR$31,0)+COUNTIF($DR$8:DR17,DR17))+2","v":15},15,"","",{"$f":"IF(COUNTIF($DT$8:$DT40,DT17)>1,\"TIE\",\"\")","v":"TIE"},"TIE","TIE",null,1,"","","","","","","","","","","","","","","","","","","","","","","","","","","","","","","","","","","","",24,24,0,0,"","","",24,24,0,0,"","","",null,0,0,0,0,0,0,0,0,0,null,10,{"$f":"IF('Ranking Sheet'!B21=0, \"\", 'Ranking Sheet'!B21)","v":""},{"$f":"IF(Team10!$L$9=0, \"\", Team10!$L$9)","v":""},{"$f":"IF(Team10!$L$10=0, \"\", Team10!$L$10)","v":""},{"$f":"IF(Team10!$L$11=0, \"\", Team10!$L$11)","v":""},{"$f":"IF(Team10!$L$12=0, \"\", Team10!$L$12)","v":""},{"$f":"IF(Team10!$L$13=0, \"\", Team10!$L$13)","v":""},{"$f":"IF(Team10!$L$14=0, \"\", Team10!$L$14)","v":""},{"$f":"IF(Team10!$L$15=0, \"\", Team10!$L$15)","v":""},{"$f":"IF(Team10!$L$16=0, \"\", Team10!$L$16)","v":""},{"$f":"IF(Team10!$L$17=0, \"\", Team10!$L$17)","v":""},{"$f":"IF(Team10!$L$18=0, \"\", Team10!$L$18)","v":""},{"$f":"IF(Team10!$L$19=0, \"\", Team10!$L$19)","v":""},{"$f":"IF(Team10!$L$20=0, \"\", Team10!$L$20)","v":""},{"$f":"IF(Team10!$L$21=0, \"\", Team10!$L$21)","v":""},{"$f":"IF(Team10!$N$21=0, \"\", Team10!$N$21)","v":""},1,"","","","","","","","","","","","","","","","","","",null,1,"","","","","","","","","","","","","","",""]
[11,{"$f":"IF('Ranking Sheet'!B22=0, \"\", 'Ranking Sheet'!B22)","v":""},{"$f":"IF(Team11!$D$21=0, \"\", Team11!$D$21)","v":""},"","","","",{"$f":"IF(Team11!$E$21=0, \"\", Team11!$E$21)","v":""},"","","","",{"$f":"IF(Team11!$F$21=0, \"\", Team11!$F$21)","v":""},"","","","",{"$f":"IF(Team11!$G$21=0, \"\", Team11!$G$21)","v":""},"","","","",{"$f":"IF(Team11!$H$21=0, \"\", Team11!$H$21)","v":""},"","","","",{"$f":"IF(Team11!$I$21=0, \"\", Team11!$I$21)","v":""},"","","","",{"$f":"IF(Team11!$J$21=0, \"\", Team11!$J$21)","v":""},"","","","",{"$f":"IF(Team11!$K$21=0, \"\", Team11!$K$21)","v":""},"","","","",0,0,{"$f":"LARGE((F18,K18,P18,U18,Z18,AE18,AJ18,AO18), 2)","v":{"$error":"#NUM!"}},0,0,0,"","",{"$error":"#VALUE!"},99,1,24,{"$error":"#VALUE!"},"",0,"",1,"",24,12.5,"",0,0,0,"",1,"",24,12.5,"",1,1,1,{"$f":"IF(BV18=\"\",\"\",SMALL(BV$8:BV$31,11))","v":1},"","",{"$f":"COUNT($BV$8:$BV$31)-(RANK(BV18,$BV$8:$BV$31,0)+COUNTIF($BV$8:BV18,BV18))+2","v":14},14,"","",{"$f":"IF(COUNTIF($BX$8:$BX41,BX18)>1,\"TIE\",\"\")","v":"TIE"},"TIE","","","","*","*","*","",null,0,0,0,"",1,"",24,12.5,"",0,"",1,24,12.5,"",0,"",1,24,12.5,"",{"$error":"#VALUE!"},0,"",1,24,12.5,"",1,1,1,{"$f":"IF(DR18=\"\",\"\",SMALL(DR$8:DR$31,11))","v":1},1,1,"",{"$f":"COUNT($DR$8:$DR$31)-(RANK(DR18,$DR$8:$DR$31,0)+COUNTIF($DR$8:DR18,DR18))+2","v":14},14,"","",{"$f":"IF(COUNTIF($DT$8:$DT41,DT18)>1,\"TIE\",\"\")","v":"TIE"},"TIE","TIE",null,1,"","","","","","","","","","","","","","","","","","","","","","","","","","","","","","","","","","","","",24,24,0,0,"","","",24,24,0,0,"","","",null,0,0,0,0,0,0,0,0,0,null,11,{"$f":"IF('Ranking Sheet'!B22=0, \"\", 'Ranking Sheet'!B22)","v":""},{"$f":"IF(Team11!$L$9=0, \"\", Team11!$L$9)","v":""},{"$f":"IF(Team11!$L$10=0, \"\", Team11!$L$10)","v":""},{"$f":"IF(Team11!$L$11=0, \"\", Team11!$L$11)","v":""},{"$f":"IF(Team11!$L$12=0, \"\", Team11!$L$12)","v":""},{"$f":"IF(Team11!$L$13=0, \"\", Team11!$L$13)","v":""},{"$f":"IF(Team11!$L$14=0, \"\", Team11!$L$14)","v":""},{"$f":"IF(Team11!$L$15=0, \"\", Team11!$L$15)","v":""},{"$f":"IF(Team11!$L$16=0, \"\", Team11!$L$16)","v":""},{"$f":"IF(Team11!$L$17=0, \"\", Team11!$L$17)","v":""},{"$f":"IF(Team11!$L$18=0, \"\", Team11!$L$18)","v":""},{"$f":"IF(Team11!$L$19=0, \"\", Team11!$L$19)","v":""},{"$f":"IF(Team11!$L$20=0, \"\", Team11!$L$20)","v":""},{"$f":"IF(Team11!$L$21=0, \"\", Team11!$L$21)","v":""},{"$f":"IF(Team11!$N$21=0, \"\", Team11!$N$21)","v":""},1,"","","","","","","","","","","","","","","","","","",null,1,"","","","","","","","","","","","","","",""]
[12,{"$f":"IF('Ranking Sheet'!B23=0, \"\", 'Ranking Sheet'!B23)","v":""},{"$f":"IF(Team12!$D$21=0, \"\", Team12!$D$21)","v":""},"","","","",{"$f":"IF(Team12!$E$21=0, \"\", Team12!$E$21)","v":""},"","","","",{"$f":"IF(Team12!$F$21=0, \"\", Team12!$F$21)","v":""},"","","","",{"$f":"IF(Team12!$G$21=0, \"\", Team12!$G$21)","v":""},"","","","",{"$f":"IF(Team12!$H$21=0, \"\", Team12!$H$21)","v":""},"","","","",{"$f":"IF(Team12!$I$21=0, \"\", Team12!$I$21)","v":""},"","","","",{"$f":"IF(Team12!$J$21=0, \"\", Team12!$J$21)","v":""},"","","","",{"$f":"IF(Team12!$K$21=0, \"\", Team12!$K$21)","v":""},"","","","",0,0,{"$f":"LARGE((F19,K19,P19,U19,Z19,AE19,AJ19,AO19), 2)","v":{"$error":"#NUM!"}},0,0,0,"","",{"$error":"#VALUE!"},99,1,24,{"$error":"#VALUE!"},"",0,"",1,"",24,12.5,"",0,0,0,"",1,"",24,12.5,"",1,1,1,{"$f":"IF(BV19=\"\", \"\", SMALL(BV$8:BV$31, 12))","v":1},"","",{"$f":"COUNT($BV$8:$BV$31)-(RANK(BV19,$BV$8:$BV$31,0)+COUNTIF($BV$8:BV19,BV19))+2","v":13},13,"","",{"$f":"IF(COUNTIF($BX$8:$BX42,BX19)>1,\"TIE\",\"\")","v":"TIE"},"TIE","","","","*","*","*","",null,0,0,0,"",1,"",24,12.5,"",0,"",1,24,12.5,"",0,"",1,24,12.5,"",{"$error":"#VALUE!"},0,"",1,24,12.5,"",1,1,1,{"$f":"IF(DR19=\"\", \"\", SMALL(DR$8:DR$31, 12))","v":1},1,1,"",{"$f":"COUNT($DR$8:$DR$31)-(RANK(DR19,$DR$8:$DR$31,0)+COUNTIF($DR$8:DR19,DR19))+2","v":13},13,"","",{"$f":"IF(COUNTIF($DT$8:$DT42,DT19)>1,\"TIE\",\"\")","v":"TIE"},"TIE","TIE",null,1,"","","","","","","","","","","","","","","","","","","","","","","","","","","","","","","","","","","","",24,24,0,0,"","","",24,24,0,0,"","","",null,0,0,0,0,0,0,0,0,0,null,12,{"$f":"IF('Ranking Sheet'!B23=0, \"\", 'Ranking Sheet'!B23)","v":""},{"$f":"IF(Team12!$L$9=0, \"\", Team12!$L$9)","v":""},{"$f":"IF(Team12!$L$10=0, \"\", Team12!$L$10)","v":""},{"$f":"IF(Team12!$L$11=0, \"\", Team12!$L$11)","v":""},{"$f":"IF(Team12!$L$12=0, \"\", Team12!$L$12)","v":""},{"$f":"IF(Team12!$L$13=0, \"\", Team12!$L$13)","v":""},{"$f":"IF(Team12!$L$14=0, \"\", Team12!$L$14)","v":""},{"$f":"IF(Team12!$L$15=0, \"\", Team12!$L$15)","v":""},{"$f":"IF(Team12!$L$16=0, \"\", Team12!$L$16)","v":""},{"$f":"IF(Team12!$L$17=0, \"\", Team12!$L$17)","v":""},{"$f":"IF(Team12!$L$18=0, \"\", Team12!$L$18)","v":""},{"$f":"IF(Team12!$L$19=0, \"\", Team12!$L$19)","v":""},{"$f":"IF(Team12!$L$20=0, \"\", Team12!$L$20)","v":""},{"$f":"IF(Team12!$L$21=0, \"\", Team12!$L$21)","v":""},{"$f":"IF(Team12!$N$21=0, \"\", Team12!$N$21)","v":""},1,"","","","","","","","","","","","","","","","","","",null,1,"","","","","","","","","","","","","","",""]
[13,{"$f":"IF('Ranking Sheet'!B24=0, \"\", 'Ranking Sheet'!B24)","v":""},{"$f":"IF(Team13!$D$21=0, \"\", Team13!$D$21)","v":""},"","","","",{"$f":"IF(Team13!$E$21=0, \"\", Team13!$E$21)","v":""},"","","","",{"$f":"IF(Team13!$F$21=0, \"\", Team13!$F$21)","v":""},"","","","",{"$f":"IF(Team13!$G$21=0, \"\", Team13!$G$21)","v":""},"","","","",{"$f":"IF(Team13!$H$21=0, \"\", Team13!$H$21)","v":""},"","","","",{"$f":"IF(Team13!$I$21=0, \"\", Team13!$I$21)","v":""},"","","","",{"$f":"IF(Team13!$J$21=0, \"\", Team13!$J$21)","v":""},"","","","",{"$f":"IF(Team13!$K$21=0, \"\", Team13!$K$21)","v":""},"","","","",0,0,{"$f":"LARGE((F20,K20,P20,U20,Z20,AE20,AJ20,AO20), 2)","v":{"$error":"#NUM!"}},0,0,0,"","",{"$error":"#VALUE!"},99,1,24,{"$error":"#VALUE!"},"",0,"",1,"",24,12.5,"",0,0,0,"",1,"",24,12.5,"",1,1,1,{"$f":"IF(BV20=\"\", \"\", SMALL(BV$8:BV$31, 13))","v":1},"","",{"$f":"COUNT($BV$8:$BV$31)-(RANK(BV20,$BV$8:$BV$31,0)+COUNTIF($BV$8:BV20,BV20))+2","v":12},12,"","",{"$f":"IF(COUNTIF($BX$8:$BX43,BX20)>1,\"TIE\",\"\")","v":"TIE"},"TIE","","","","*","*","*","",null,0,0,0,"",1,"",24,12.5,"",0,"",1,24,12.5,"",0,"",1,24,12.5,"",{"$error":"#VALUE!"},0,"",1,24,12.5,"",1,1,1,{"$f":"IF(DR20=\"\", \"\", SMALL(DR$8:DR$31, 13))","v":1},1,1,"",{"$f":"COUNT($DR$8:$DR$31)-(RANK(DR20,$DR$8:$DR$31,0)+COUNTIF($DR$8:DR20,DR20))+2","v":12},12,"","",{"$f":"IF(COUNTIF($DT$8:$DT43,DT20)>1,\"TIE\",\"\")","v":"TIE"},"TIE","TIE",null,1,"","","","","","","","","","","","","","","","","","","","","","","","","","","","","","","","","","","","",24,24,0,0,"","","",24,24,0,0,"","","",null,0,0,0,0,0,0,0,0,0,null,13,{"$f":"IF('Ranking Sheet'!B24=0, \"\", 'Ranking Sheet'!B24)","v":""},{"$f":"IF(Team13!$L$9=0, \"\", Team13!$L$9)","v":""},{"$f":"IF(Team13!$L$10=0, \"\", Team13!$L$10)","v":""},{"$f":"IF(Team13!$L$11=0, \"\", Team13!$L$11)","v":""},{"$f":"IF(Team13!$L$12=0, \"\", Team13!$L$12)","v":""},{"$f":"IF(Team13!$L$13=0, \"\", Team13!$L$13)","v":""},{"$f":"IF(Team13!$L$14=0, \"\", Team13!$L$14)","v":""},{"$f":"IF(Team13!$L$15=0, \"\", Team13!$L$15)","v":""},{"$f":"IF(Team13!$L$16=0, \"\", Team13!$L$16)","v":""},{"$f":"IF(Team13!$L$17=0, \"\", Team13!$L$17)","v":""},{"$f":"IF(Team13!$L$18=0, \"\", Team13!$L$18)","v":""},{"$f":"IF(Team13!$L$19=0, \"\", Team13!$L$19)","v":""},{"$f":"IF(Team13!$L$20=0, \"\", Team13!$L$20)","v":""},{"$f":"IF(Team13!$L$21=0, \"\", Team13!$L$21)","v":""},{"$f":"IF(Team13!$N$21=0, \"\", Team13!$N$21)","v":""},1,"","","","","","","","","","","","","","","","","","",null,1,"","","","","","","","","","","","","","",""]
[14,{"$f":"IF('Ranking Sheet'!B25=0, \"\", 'Ranking Sheet'!B25)","v":""},{"$f":"IF(Team14!$D$21=0, \"\", Team14!$D$21)","v":""},"","","","",{"$f":"IF(Team14!$E$21=0, \"\", Team14!$E$21)","v":""},"","","","",{"$f":"IF(Team14!$F$21=0, \"\", Team14!$F$21)","v":""},"","","","",{"$f":"IF(Team14!$G$21=0, \"\", Team14!$G$21)","v":""},"","","","",{"$f":"IF(Team14!$H$21=0, \"\", Team14!$H$21)","v":""},"","","","",{"$f":"IF(Team14!$I$21=0, \"\", Team14!$I$21)","v":""},"","","","",{"$f":"IF(Team14!$J$21=0, \"\", Team14!$J$21)","v":""},"","","","",{"$f":"IF(Team14!$K$21=0, \"\", Team14!$K$21)","v":""},"","","","",0,0,{"$f":"LARGE((F21,K21,P21,U21,Z21,AE21,AJ21,AO21), 2)","v":{"$error":"#NUM!"}},0,0,0,"","",{"$error":"#VALUE!"},99,1,24,{"$error":"#VALUE!"},"",0,"",1,"",24,12.5,"",0,0,0,"",1,"",24,12.5,"",1,1,1,{"$f":"IF(BV21=\"\", \"\", SMALL(BV$8:BV$31, 14))","v":1},"","",{"$f":"COUNT($BV$8:$BV$31)-(RANK(BV21,$BV$8:$BV$31,0)+COUNTIF($BV$8:BV21,BV21))+2","v":11},11,"","",{"$f":"IF(COUNTIF($BX$8:$BX44,BX21)>1,\"TIE\",\"\")","v":"TIE"},"TIE","","","","*","*","*","",null,0,0,0,"",1,"",24,12.5,"",0,"",1,24,12.5,"",0,"",1,24,12.5,"",{"$error":"#VALUE!"},0,"",1,24,12.5,"",1,1,1,{"$f":"IF(DR21=\"\", \"\", SMALL(DR$8:DR$31, 14))","v":1},1,1,"",{"$f":"COUNT($DR$8:$DR$31)-(RANK(DR21,$DR$8:$DR$31,0)+COUNTIF($DR$8:DR21,DR21))+2","v":11},11,"","",{"$f":"IF(COUNTIF($DT$8:$DT44,DT21)>1,\"TIE\",\"\")","v":"TIE"},"TIE","TIE",null,1,"","","","","","","","","","","","","","","","","","","","","","","","","","","","","","","","","","","","",24,24,0,0,"","","",24,24,0,0,"","","",null,0,0,0,0,0,0,0,0,0,null,14,{"$f":"IF('Ranking Sheet'!B25=0, \"\", 'Ranking Sheet'!B25)","v":""},{"$f":"IF(Team14!$L$9=0, \"\", Team14!$L$9)","v":""},{"$f":"IF(Team14!$L$10=0, \"\", Team14!$L$10)","v":""},{"$f":"IF(Team14!$L$11=0, \"\", Team14!$L$11)","v":""},{"$f":"IF(Team14!$L$12=0, \"\", Team14!$L$12)","v":""},{"$f":"IF(Team14!$L$13=0, \"\", Team14!$L$13)","v":""},{"$f":"IF(Team14!$L$14=0, \"\", Team14!$L$14)","v":""},{"$f":"IF(Team14!$L$15=0, \"\", Team14!$L$15)","v":""},{"$f":"IF(Team14!$L$16=0, \"\", Team14!$L$16)","v":""},{"$f":"IF(Team14!$L$17=0, \"\", Team14!$L$17)","v":""},{"$f":"IF(Team14!$L$18=0, \"\", Team14!$L$18)","v":""},{"$f":"IF(Team14!$L$19=0, \"\", Team14!$L$19)","v":""},{"$f":"IF(Team14!$L$20=0, \"\", Team14!$L$20)","v":""},{"$f":"IF(Team14!$L$21=0, \"\", Team14!$L$21)","v":""},{"$f":"IF(Team14!$N$21=0, \"\", Team14!$N$21)","v":""},1,"","","","","","","","","","","","","","","","","","",null,1,"","","","","","","","","","","","","","",""]
[15,{"$f":"IF('Ranking Sheet'!B26=0, \"\", 'Ranking Sheet'!B26)","v":""},{"$f":"IF(Team15!$D$21=0, \"\", Team15!$D$21)","v":""},"","","","",{"$f":"IF(Team15!$E$21=0, \"\", Team15!$E$21)","v":""},"","","","",{"$f":"IF(Team15!$F$21=0, \"\", Team15!$F$21)","v":""},"","","","",{"$f":"IF(Team15!$G$21=0, \"\", Team15!$G$21)","v":""},"","","","",{"$f":"IF(Team15!$H$21=0, \"\", Team15!$H$21)","v":""},"","","","",{"$f":"IF(Team15!$I$21=0, \"\", Team15!$I$21)","v":""},"","","","",{"$f":"IF(Team15!$J$21=0, \"\", Team15!$J$21)","v":""},"","","","",{"$f":"IF(Team15!$K$21=0, \"\", Team15!$K$21)","v":""},"","","","",0,0,{"$f":"LARGE((F22,K22,P22,U22,Z22,AE22,AJ22,AO22), 2)","v":{"$error":"#NUM!"}},0,0,0,"","",{"$error":"#VALUE!"},99,1,24,{"$error":"#VALUE!"},"",0,"",1,"",24,12.5,"",0,0,0,"",1,"",24,12.5,"",1,1,1,{"$f":"IF(BV22=\"\", \"\", SMALL(BV$8:BV$31, 15))","v":1},"","",{"$f":"COUNT($BV$8:$BV$31)-(RANK(BV22,$BV$8:$BV$31,0)+COUNTIF($BV$8:BV22,BV22))+2","v":10},10,"","",{"$f":"IF(COUNTIF($BX$8:$BX45,BX22)>1,\"TIE\",\"\")","v":"TIE"},"TIE","","","","*","*","*","",null,0,0,0,"",1,"",24,12.5,"",0,"",1,24,12.5,"",0,"",1,24,12.5,"",{"$error":"#VALUE!"},0,"",1,24,12.5,"",1,1,1,{"$f":"IF(DR22=\"\", \"\", SMALL(DR$8:DR$31, 15))","v":1},1,1,"",{"$f":"COUNT($DR$8:$DR$31)-(RANK(DR22,$DR$8:$DR$31,0)+COUNTIF($DR$8:DR22,DR22))+2","v":10},10,"","",{"$f":"IF(COUNTIF($DT$8:$DT45,DT22)>1,\"TIE\",\"\")","v":"TIE"},"TIE","TIE",null,1,"","","","","","","","","","","","","","","","","","","","","","","","","","","","","","","","","","","","",24,24,0,0,"","","",24,24,0,0,"","","",null,0,0,0,0,0,0,0,0,0,null,15,{"$f":"IF('Ranking Sheet'!B26=0, \"\", 'Ranking Sheet'!B26)","v":""},{"$f":"IF(Team15!$L$9=0, \"\", Team15!$L$9)","v":""},{"$f":"IF(Team15!$L$10=0, \"\", Team15!$L$10)","v":""},{"$f":"IF(Team15!$L$11=0, \"\", Team15!$L$11)","v":""},{"$f":"IF(Team15!$L$12=0, \"\", Team15!$L$12)","v":""},{"$f":"IF(Team15!$L$13=0, \"\", Team15!$L$13)","v":""},{"$f":"IF(Team15!$L$14=0, \"\", Team15!$L$14)","v":""},{"$f":"IF(Team15!$L$15=0, \"\", Team15!$L$15)","v":""},{"$f":"IF(Team15!$L$16=0, \"\", Team15!$L$16)","v":""},{"$f":"IF(Team15!$L$17=0, \"\", Team15!$L$17)","v":""},{"$f":"IF(Team15!$L$18=0, \"\", Team15!$L$18)","v":""},{"$f":"IF(Team15!$L$19=0, \"\", Team15!$L$19)","v":""},{"$f":"IF(Team15!$L$20=0, \"\", Team15!$L$20)","v":""},{"$f":"IF(Team15!$L$21=0, \"\", Team15!$L$21)","v":""},{"$f":"IF(Team15!$N$21=0, \"\", Team15!$N$21)","v":""},1,"","","","","","","","","","","","","","","","","","",null,1,"","","","","","","","","","","","","","",""]
[16,{"$f":"IF('Ranking Sheet'!B27=0, \"\", 'Ranking Sheet'!B27)","v":""},{"$f":"IF(Team16!$D$21=0, \"\", Team16!$D$21)","v":""},"","","","",{"$f":"IF(Team16!$E$21=0, \"\", Team16!$E$21)","v":""},"","","","",{"$f":"IF(Team16!$F$21=0, \"\", Team16!$F$21)","v":""},"","","","",{"$f":"IF(Team16!$G$21=0, \"\", Team16!$G$21)","v":""},"","","","",{"$f":"IF(Team16!$H$21=0, \"\", Team16!$H$21)","v":""},"","","","",{"$f":"IF(Team16!$I$21=0, \"\", Team16!$I$21)","v":""},"","","","",{"$f":"IF(Team16!$J$21=0, \"\", Team16!$J$21)","v":""},"","","","",{"$f":"IF(Team16!$K$21=0, \"\", Team16!$K$21)","v":""},"","","","",0,0,{"$f":"LARGE((F23,K23,P23,U23,Z23,AE23,AJ23,AO23), 2)","v":{"$error":"#NUM!"}},0,0,0,"","",{"$error":"#VALUE!"},99,1,24,{"$error":"#VALUE!"},"",0,"",1,"",24,12.5,"",0,0,0,"",1,"",24,12.5,"",1,1,1,{"$f":"IF(BV23=\"\", \"\", SMALL(BV$8:BV$31, 16))","v":1},"","",{"$f":"COUNT($BV$8:$BV$31)-(RANK(BV23,$BV$8:$BV$31,0)+COUNTIF($BV$8:BV23,BV23))+2","v":9},9,"","",{"$f":"IF(COUNTIF($BX$8:$BX46,BX23)>1,\"TIE\",\"\")","v":"TIE"},"TIE","",{"$f":"OFFSET(AX$8,MATCH(SMALL(CB$8:CB$31,ROW()-ROW(CC$8)+1),CB$8:CB$31,0)-1,0)","v":""},"","*","*","*","",null,0,0,0,"",1,"",24,12.5,"",0,"",1,24,12.5,"",0,"",1,24,12.5,"",{"$error":"#VALUE!"},0,"",1,24,12.5,"",1,1,1,{"$f":"IF(DR23=\"\", \"\", SMALL(DR$8:DR$31, 16))","v":1},1,1,"",{"$f":"COUNT($DR$8:$DR$31)-(RANK(DR23,$DR$8:$DR$31,0)+COUNTIF($DR$8:DR23,DR23))+2","v":9},9,"","",{"$f":"IF(COUNTIF($DT$8:$DT46,DT23)>1,\"TIE\",\"\")","v":"TIE"},"TIE","TIE",null,1,"","","","","","","","","","","","","","","","","","","","","","","","","","","","","","","","","","","","",24,24,0,0,"","","",24,24,0,0,"","","",null,0,0,0,0,0,0,0,0,0,null,16,{"$f":"IF('Ranking Sheet'!B27=0, \"\", 'Ranking Sheet'!B27)","v":""},{"$f":"IF(Team16!$L$9=0, \"\", Team16!$L$9)","v":""},{"$f":"IF(Team16!$L$10=0, \"\", Team16!$L$10)","v":""},{"$f":"IF(Team16!$L$11=0, \"\", Team16!$L$11)","v":""},{"$f":"IF(Team16!$L$12=0, \"\", Team16!$L$12)","v":""},{"$f":"IF(Team16!$L$13=0, \"\", Team16!$L$13)","v":""},{"$f":"IF(Team16!$L$14=0, \"\", Team16!$L$14)","v":""},{"$f":"IF(Team16!$L$15=0, \"\", Team16!$L$15)","v":""},{"$f":"IF(Team16!$L$16=0, \"\", Team16!$L$16)","v":""},{"$f":"IF(Team16!$L$17=0, \"\", Team16!$L$17)","v":""},{"$f":"IF(Team16!$L$18=0, \"\", Team16!$L$18)","v":""},{"$f":"IF(Team16!$L$19=0, \"\", Team16!$L$19)","v":""},{"$f":"IF(Team16!$L$20=0, \"\", Team16!$L$20)","v":""},{"$f":"IF(Team16!$L$21=0, \"\", Team16!$L$21)","v":""},{"$f":"IF(Team16!$N$21=0, \"\", Team16!$N$21)","v":""},1,"","","","","","","","","","","","","","","","","","",null,1,"","","","","","","","","","","","","","",""]
[17,{"$f":"IF('Ranking Sheet'!B28=0, \"\", 'Ranking Sheet'!B28)","v":""},{"$f":"IF(Team17!$D$21=0, \"\", Team17!$D$21)","v":""},"","","","",{"$f":"IF(Team17!$E$21=0, \"\", Team17!$E$21)","v":""},"","","","",{"$f":"IF(Team17!$F$21=0, \"\", Team17!$F$21)","v":""},"","","","",{"$f":"IF(Team17!$G$21=0, \"\", Team17!$G$21)","v":""},"","","","",{"$f":"IF(Team17!$H$21=0, \"\", Team17!$H$21)","v":""},"","","","",{"$f":"IF(Team17!$I$21=0, \"\", Team17!$I$21)","v":""},"","","","",{"$f":"IF(Team17!$J$21=0, \"\", Team17!$J$21)","v":""},"","","","",{"$f":"IF(Team17!$K$21=0, \"\", Team17!$K$21)","v":""},"","","","",0,0,{"$f":"LARGE((F24,K24,P24,U24,Z24,AE24,AJ24,AO24), 2)","v":{"$error":"#NUM!"}},0,0,0,"","",{"$error":"#VALUE!"},99,1,24,{"$error":"#VALUE!"},"",0,"",1,"",24,12.5,"",0,0,0,"",1,"",24,12.5,"",1,1,1,{"$f":"IF(BV24=\"\", \"\", SMALL(BV$8:BV$31, 17))","v":1},"","",{"$f":"COUNT($BV$8:$BV$31)-(RANK(BV24,$BV$8:$BV$31,0)+COUNTIF($BV$8:BV24,BV24))+2","v":8},8,"","",{"$f":"IF(COUNTIF($BX$8:$BX47,BX24)>1,\"TIE\",\"\")","v":"TIE"},"TIE","","","","*","*","*","",null,0,0,0,"",1,"",24,12.5,"",0,"",1,24,12.5,"",0,"",1,24,12.5,"",{"$error":"#VALUE!"},0,"",1,24,12.5,"",1,1,1,{"$f":"IF(DR24=\"\", \"\", SMALL(DR$8:DR$31, 17))","v":1},1,1,"",{"$f":"COUNT($DR$8:$DR$31)-(RANK(DR24,$DR$8:$DR$31,0)+COUNTIF($DR$8:DR24,DR24))+2","v":8},8,"","",{"$f":"IF(COUNTIF($DT$8:$DT47,DT24)>1,\"TIE\",\"\")","v":"TIE"},"TIE","TIE",null,1,"","","","","","","","","","","","","","","","","","","","","","","","","","","","","","","","","","","","",24,24,0,0,"","","",24,24,0,0,"","","",null,0,0,0,0,0,0,0,0,0,null,17,{"$f":"IF('Ranking Sheet'!B28=0, \"\", 'Ranking Sheet'!B28)","v":""},{"$f":"IF(Team17!$L$9=0, \"\", Team17!$L$9)","v":""},{"$f":"IF(Team17!$L$10=0, \"\", Team17!$L$10)","v":""},{"$f":"IF(Team17!$L$11=0, \"\", Team17!$L$11)","v":""},{"$f":"IF(Team17!$L$12=0, \"\", Team17!$L$12)","v":""},{"$f":"IF(Team17!$L$13=0, \"\", Team17!$L$13)","v":""},{"$f":"IF(Team17!$L$14=0, \"\", Team17!$L$14)","v":""},{"$f":"IF(Team17!$L$15=0, \"\", Team17!$L$15)","v":""},{"$f":"IF(Team17!$L$16=0, \"\", Team17!$L$16)","v":""},{"$f":"IF(Team17!$L$17=0, \"\", Team17!$L$17)","v":""},{"$f":"IF(Team17!$L$18=0, \"\", Team17!$L$18)","v":""},{"$f":"IF(Team17!$L$19=0, \"\", Team17!$L$19)","v":""},{"$f":"IF(Team17!$L$20=0, \"\", Team17!$L$20)","v":""},{"$f":"IF(Team17!$L$21=0, \"\", Team17!$L$21)","v":""},{"$f":"IF(Team17!$N$21=0, \"\", Team17!$N$21)","v":""},1,"","","","","","","","","","","","","","","","","","",null,1,"","","","","","","","","","","","","","",""]
[18,{"$f":"IF('Ranking Sheet'!B29=0, \"\", 'Ranking Sheet'!B29)","v":""},{"$f":"IF(Team18!$D$21=0, \"\", Team18!$D$21)","v":""},"","","","",{"$f":"IF(Team18!$E$21=0, \"\", Team18!$E$21)","v":""},"","","","",{"$f":"IF(Team18!$F$21=0, \"\", Team18!$F$21)","v":""},"","","","",{"$f":"IF(Team18!$G$21=0, \"\", Team18!$G$21)","v":""},"","","","",{"$f":"IF(Team18!$H$21=0, \"\", Team18!$H$21)","v":""},"","","","",{"$f":"IF(Team18!$I$21=0, \"\", Team18!$I$21)","v":""},"","","","",{"$f":"IF(Team18!$J$21=0, \"\", Team18!$J$21)","v":""},"","","","",{"$f":"IF(Team18!$K$21=0, \"\", Team18!$K$21)","v":""},"","","","",0,0,{"$f":"LARGE((F25,K25,P25,U25,Z25,AE25,AJ25,AO25), 2)","v":{"$error":"#NUM!"}},0,0,0,"","",{"$error":"#VALUE!"},99,1,24,{"$error":"#VALUE!"},"",0,"",1,"",24,12.5,"",0,0,0,"",1,"",24,12.5,"",1,1,1,{"$f":"IF(BV25=\"\", \"\", SMALL(BV$8:BV$31, 18))","v":1},"","",{"$f":"COUNT($BV$8:$BV$31)-(RANK(BV25,$BV$8:$BV$31,0)+COUNTIF($BV$8:BV25,BV25))+2","v":7},7,"","",{"$f":"IF(COUNTIF($BX$8:$BX48,BX25)>1,\"TIE\",\"\")","v":"TIE"},"TIE","","","","*","*","*","",null,0,0,0,"",1,"",24,12.5,"",0,"",1,24,12.5,"",0,"",1,24,12.5,"",{"$error":"#VALUE!"},0,"",1,24,12.5,"",1,1,1,{"$f":"IF(DR25=\"\", \"\", SMALL(DR$8:DR$31, 18))","v":1},1,1,"",{"$f":"COUNT($DR$8:$DR$31)-(RANK(DR25,$DR$8:$DR$31,0)+COUNTIF($DR$8:DR25,DR25))+2","v":7},7,"","",{"$f":"IF(COUNTIF($DT$8:$DT48,DT25)>1,\"TIE\",\"\")","v":"TIE"},"TIE","TIE",null,1,"","","","","","","",{"$f":"IF(ISERROR(EM25), \"\", EM25)","v":""},"","","","","",{"$f":"IF(ISERROR(ES25), \"\", ES25)","v":""},"","","","","",{"$f":"IF(ISERROR(EY25), \"\", EY25)","v":""},"","","","","","","","","","","","","","","","",24,24,0,0,"","","",24,24,0,0,"","","",null,0,0,0,0,0,0,0,0,0,null,18,{"$f":"IF('Ranking Sheet'!B29=0, \"\", 'Ranking Sheet'!B29)","v":""},{"$f":"IF(Team18!$L$9=0, \"\", Team18!$L$9)","v":""},{"$f":"IF(Team18!$L$10=0, \"\", Team18!$L$10)","v":""},{"$f":"IF(Team18!$L$11=0, \"\", Team18!$L$11)","v":""},{"$f":"IF(Team18!$L$12=0, \"\", Team18!$L$12)","v":""},{"$f":"IF(Team18!$L$13=0, \"\", Team18!$L$13)","v":""},{"$f":"IF(Team18!$L$14=0, \"\", Team18!$L$14)","v":""},{"$f":"IF(Team18!$L$15=0, \"\", Team18!$L$15)","v":""},{"$f":"IF(Team18!$L$16=0, \"\", Team18!$L$16)","v":""},{"$f":"IF(Team18!$L$17=0, \"\", Team18!$L$17)","v":""},{"$f":"IF(Team18!$L$18=0, \"\", Team18!$L$18)","v":""},{"$f":"IF(Team18!$L$19=0, \"\", Team18!$L$19)","v":""},{"$f":"IF(Team18!$L$20=0, \"\", Team18!$L$20)","v":""},{"$f":"IF(Team18!$L$21=0, \"\", Team18!$L$21)","v":""},{"$f":"IF(Team18!$N$21=0, \"\", Team18!$N$21)","v":""},1,"","","","","","","","","","","","","","","","","","",null,1,"","","","","","","","","","","","","","",""]
[19,{"$f":"IF('Ranking Sheet'!B30=0, \"\", 'Ranking Sheet'!B30)","v":""},{"$f":"IF(Team19!$D$21=0, \"\", Team19!$D$21)","v":""},"","","","",{"$f":"IF(Team19!$E$21=0, \"\", Team19!$E$21)","v":""},"","","","",{"$f":"IF(Team19!$F$21=0, \"\", Team19!$F$21)","v":""},"","","","",{"$f":"IF(Team19!$G$21=0, \"\", Team19!$G$21)","v":""},"","","","",{"$f":"IF(Team19!$H$21=0, \"\", Team19!$H$21)","v":""},"","","","",{"$f":"IF(Team19!$I$21=0, \"\", Team19!$I$21)","v":""},"","","","",{"$f":"IF(Team19!$J$21=0, \"\", Team19!$J$21)","v":""},"","","","",{"$f":"IF(Team19!$K$21=0, \"\", Team19!$K$21)","v":""},"","","","",0,0,{"$f":"LARGE((F26,K26,P26,U26,Z26,AE26,AJ26,AO26), 2)","v":{"$error":"#NUM!"}},{"$f":"IF(ISERROR(AS26), 0, AS26)","v":0},0,0,"","",{"$error":"#VALUE!"},99,1,24,{"$error":"#VALUE!"},"",0,"",1,"",24,{"$f":"(((BG26+BI26-1)*((BG26+BI26-1)+1)/2)-((BG26-1)*((BG26-1)+1)/2))/BI26","v":12.5},"",0,0,0,"",1,"",24,12.5,"",1,1,1,{"$f":"IF(BV26=\"\", \"\", SMALL(BV$8:BV$31, 19))","v":1},"","",{"$f":"COUNT($BV$8:$BV$31)-(RANK(BV26,$BV$8:$BV$31,0)+COUNTIF($BV$8:BV26,BV26))+2","v":6},6,"","",{"$f":"IF(COUNTIF($BX$8:$BX49,BX26)>1,\"TIE\",\"\")","v":"TIE"},"TIE","","","","*","*","*","",null,0,0,0,"",1,"",24,12.5,"",0,"",1,24,12.5,"",0,"",1,24,12.5,"",{"$error":"#VALUE!"},0,"",1,24,12.5,"",1,1,1,{"$f":"IF(DR26=\"\", \"\", SMALL(DR$8:DR$31, 19))","v":1},1,1,"",{"$f":"COUNT($DR$8:$DR$31)-(RANK(DR26,$DR$8:$DR$31,0)+COUNTIF($DR$8:DR26,DR26))+2","v":6},6,"","",{"$f":"IF(COUNTIF($DT$8:$DT49,DT26)>1,\"TIE\",\"\")","v":"TIE"},"TIE","TIE",null,1,"","","","","","","","","","","","","","","","","","","","","","","","","","","","","","","","","","","","",24,24,0,0,"","","",24,24,0,0,"","","",null,0,0,0,0,0,0,0,0,0,null,19,{"$f":"IF('Ranking Sheet'!B30=0, \"\", 'Ranking Sheet'!B30)","v":""},{"$f":"IF(Team19!$L$9=0, \"\", Team19!$L$9)","v":""},{"$f":"IF(Team19!$L$10=0, \"\", Team19!$L$10)","v":""},{"$f":"IF(Team19!$L$11=0, \"\", Team19!$L$11)","v":""},{"$f":"IF(Team19!$L$12=0, \"\", Team19!$L$12)","v":""},{"$f":"IF(Team19!$L$13=0, \"\", Team19!$L$13)","v":""},{"$f":"IF(Team19!$L$14=0, \"\", Team19!$L$14)","v":""},{"$f":"IF(Team19!$L$15=0, \"\", Team19!$L$15)","v":""},{"$f":"IF(Team19!$L$16=0, \"\", Team19!$L$16)","v":""},{"$f":"IF(Team19!$L$17=0, \"\", Team19!$L$17)","v":""},{"$f":"IF(Team19!$L$18=0, \"\", Team19!$L$18)","v":""},{"$f":"IF(Team19!$L$19=0, \"\", Team19!$L$19)","v":""},{"$f":"IF(Team19!$L$20=0, \"\", Team19!$L$20)","v":""},{"$f":"IF(Team19!$L$21=0, \"\", Team19!$L$21)","v":""},{"$f":"IF(Team19!$N$21=0, \"\", Team19!$N$21)","v":""},1,"","","","","","","","","","","","","","","","","","",null,1,"","","","","","","","","","","","","","",""]
[20,{"$f":"IF('Ranking Sheet'!B31=0, \"\", 'Ranking Sheet'!B31)","v":""},{"$f":"IF(Team20!$D$21=0, \"\", Team20!$D$21)","v":""},"","","","",{"$f":"IF(Team20!$E$21=0, \"\", Team20!$E$21)","v":""},"","","","",{"$f":"IF(Team20!$F$21=0, \"\", Team20!$F$21)","v":""},"","","","",{"$f":"IF(Team20!$G$21=0, \"\", Team20!$G$21)","v":""},"","","","",{"$f":"IF(Team20!$H$21=0, \"\", Team20!$H$21)","v":""},"","","","",{"$f":"IF(Team20!$I$21=0, \"\", Team20!$I$21)","v":""},"","","","",{"$f":"IF(Team20!$J$21=0, \"\", Team20!$J$21)","v":""},"","","","",{"$f":"IF(Team20!$K$21=0, \"\", Team20!$K$21)","v":""},"","","","",0,0,{"$f":"LARGE((F27,K27,P27,U27,Z27,AE27,AJ27,AO27), 2)","v":{"$error":"#NUM!"}},0,0,0,"","",{"$error":"#VALUE!"},99,1,24,{"$error":"#VALUE!"},"",0,"",1,"",24,12.5,"",0,0,0,"",1,"",24,12.5,"",1,1,1,{"$f":"IF(BV27=\"\", \"\", SMALL(BV$8:BV$31, 20))","v":1},"","",{"$f":"COUNT($BV$8:$BV$31)-(RANK(BV27,$BV$8:$BV$31,0)+COUNTIF($BV$8:BV27,BV27))+2","v":5},5,"","",{"$f":"IF(COUNTIF($BX$8:$BX50,BX27)>1,\"TIE\",\"\")","v":"TIE"},"TIE","","","","*","*","*","",null,0,0,0,"",1,"",24,12.5,"",0,"",1,24,12.5,"",0,"",1,24,12.5,"",{"$error":"#VALUE!"},0,"",1,24,12.5,"",1,1,1,{"$f":"IF(DR27=\"\", \"\", SMALL(DR$8:DR$31, 20))","v":1},1,1,"",{"$f":"COUNT($DR$8:$DR$31)-(RANK(DR27,$DR$8:$DR$31,0)+COUNTIF($DR$8:DR27,DR27))+2","v":5},5,"","",{"$f":"IF(COUNTIF($DT$8:$DT50,DT27)>1,\"TIE\",\"\")","v":"TIE"},"TIE","TIE",null,1,"","","","","","","","","","","","","","","","","","","","","","","","","","","","","","","","","","","","",24,24,0,0,"","","",24,24,0,0,"","","",null,0,0,0,0,0,0,0,0,0,null,20,{"$f":"IF('Ranking Sheet'!B31=0, \"\", 'Ranking Sheet'!B31)","v":""},{"$f":"IF(Team20!$L$9=0, \"\", Team20!$L$9)","v":""},{"$f":"IF(Team20!$L$10=0, \"\", Team20!$L$10)","v":""},{"$f":"IF(Team20!$L$11=0, \"\", Team20!$L$11)","v":""},{"$f":"IF(Team20!$L$12=0, \"\", Team20!$L$12)","v":""},{"$f":"IF(Team20!$L$13=0, \"\", Team20!$L$13)","v":""},{"$f":"IF(Team20!$L$14=0, \"\", Team20!$L$14)","v":""},{"$f":"IF(Team20!$L$15=0, \"\", Team20!$L$15)","v":""},{"$f":"IF(Team20!$L$16=0, \"\", Team20!$L$16)","v":""},{"$f":"IF(Team20!$L$17=0, \"\", Team20!$L$17)","v":""},{"$f":"IF(Team20!$L$18=0, \"\", Team20!$L$18)","v":""},{"$f":"IF(Team20!$L$19=0, \"\", Team20!$L$19)","v":""},{"$f":"IF(Team20!$L$20=0, \"\", Team20!$L$20)","v":""},{"$f":"IF(Team20!$L$21=0, \"\", Team20!$L$21)","v":""},{"$f":"IF(Team20!$N$21=0, \"\", Team20!$N$21)","v":""},1,"","","","","","","","","","","","","","","","","","",null,1,"","","","","","","","","","","","","","",""]
[21,{"$f":"IF('Ranking Sheet'!B32=0, \"\", 'Ranking Sheet'!B32)","v":""},{"$f":"IF(Team21!D$21=0, \"\", Team21!D$21)","v":""},"","","","",{"$f":"IF(Team21!$E$21=0, \"\", Team21!$E$21)","v":""},"","","","",{"$f":"IF(Team21!$F$21=0, \"\", Team21!$F$21)","v":""},"","","","",{"$f":"IF(Team21!$G$21=0, \"\", Team21!$G$21)","v":""},"","","","",{"$f":"IF(Team21!$H$21=0, \"\", Team21!$H$21)","v":""},"","","","",{"$f":"IF(Team21!$I$21=0, \"\", Team21!$I$21)","v":""},"","","","",{"$f":"IF(Team21!$J$21=0, \"\", Team21!$J$21)","v":""},"","","","",{"$f":"IF(Team21!$K$21=0, \"\", Team21!$K$21)","v":""},"","","","",{"$f":"SUM(F28,K28,P28,U28,Z28,AE28,AJ28,AO28)","v":0},{"$f":"MIN(F28,K28,P28,U28,Z28,AE28,AJ28,AO28)","v":0},{"$f":"LARGE((F28,K28,P28,U28,Z28,AE28,AJ28,AO28), 2)","v":{"$error":"#NUM!"}},{"$f":"IF(ISERROR(AS28), 0, AS28)","v":0},{"$f":"MAX(F28,K28,P28,U28,Z28,AE28,AJ28,AO28)","v":0},{"$f":"AQ28-AR28-AT28-AU28","v":0},{"$f":"IF(AV28=0, \"\", AV28)","v":""},"",{"$error":"#VALUE!"},99,1,24,{"$f":"(((AY28+BB28-1)*((AY28+BB28-1)+1)/2)-((AY28-1)*((AY28-1)+1)/2))/BB28","v":{"$error":"#VALUE!"}},"",0,{"$f":"IF(BE28=0, \"\", BE28)","v":""},1,"",24,12.5,"",{"$f":"AR28","v":0},{"$f":"AU28","v":0},0,{"$f":"IF(BN28=0, \"\", BN28)","v":""},1,"",24,{"$f":"(((BP28+BR28-1)*((BP28+BR28-1)+1)/2)-((BP28-1)*((BP28-1)+1)/2))/BR28","v":12.5},"",1,1,1,{"$f":"IF(BV28=\"\", \"\", SMALL(BV$8:BV$31, 21))","v":1},"","",{"$f":"COUNT($BV$8:$BV$31)-(RANK(BV28,$BV$8:$BV$31,0)+COUNTIF($BV$8:BV28,BV28))+2","v":4},{"$f":"IF(ISERROR(CA28), \" \", CA28)","v":4},"","",{"$f":"IF(COUNTIF($BX$8:$BX51,BX28)>1,\"TIE\",\"\")","v":"TIE"},"TIE","","","","*","*","*","",null,0,0,0,"",1,"",24,12.5,"",0,"",1,24,12.5,"",0,"",1,24,12.5,"",{"$error":"#VALUE!"},0,"",1,24,12.5,"",1,1,1,{"$f":"IF(DR28=\"\", \"\", SMALL(DR$8:DR$31, 21))","v":1},1,1,"",{"$f":"COUNT($DR$8:$DR$31)-(RANK(DR28,$DR$8:$DR$31,0)+COUNTIF($DR$8:DR28,DR28))+2","v":4},4,"","",{"$f":"IF(COUNTIF($DT$8:$DT51,DT28)>1,\"TIE\",\"\")","v":"TIE"},"TIE","TIE",null,1,"","","","","","","","","","","","","","","","","","","","","","","","","","","","","","","","","","","","",24,24,0,0,"","","",24,24,0,0,"","","",null,0,0,0,0,0,0,0,0,0,null,21,{"$f":"IF('Ranking Sheet'!B32=0, \"\", 'Ranking Sheet'!B32)","v":""},{"$f":"IF(Team21!$L$9=0, \"\", Team21!$L$9)","v":""},{"$f":"IF(Team21!$L$10=0, \"\", Team21!$L$10)","v":""},{"$f":"IF(Team21!$L$11=0, \"\", Team21!$L$11)","v":""},{"$f":"IF(Team21!$L$12=0, \"\", Team21!$L$12)","v":""},{"$f":"IF(Team21!$L$13=0, \"\", Team21!$L$13)","v":""},{"$f":"IF(Team21!$L$14=0, \"\", Team21!$L$14)","v":""},{"$f":"IF(Team21!$L$15=0, \"\", Team21!$L$15)","v":""},{"$f":"IF(Team21!$L$16=0, \"\", Team21!$L$16)","v":""},{"$f":"IF(Team21!$L$17=0, \"\", Team21!$L$17)","v":""},{"$f":"IF(Team21!$L$18=0, \"\", Team21!$L$18)","v":""},{"$f":"IF(Team21!$L$19=0, \"\", Team21!$L$19)","v":""},{"$f":"IF(Team21!$L$20=0, \"\", Team21!$L$20)","v":""},{"$f":"IF(Team21!$L$21=0, \"\", Team21!$L$21)","v":""},{"$f":"IF(Team21!$N$21=0, \"\", Team21!$N$21)","v":""},1,"","","","","","","","","","","","","","","","","","",null,1,"","","","","","","","","","","","","","",""]
[22,{"$f":"IF('Ranking Sheet'!B33=0, \"\", 'Ranking Sheet'!B33)","v":""},{"$f":"IF(Team22!D$21=0, \"\", Team22!D$21)","v":""},"","","","",{"$f":"IF(Team22!$E$21=0, \"\", Team22!$E$21)","v":""},"","","","",{"$f":"IF(Team22!$F$21=0, \"\", Team22!$F$21)","v":""},"","","","",{"$f":"IF(Team22!$G$21=0, \"\", Team22!$G$21)","v":""},"","","","",{"$f":"IF(Team22!$H$21=0, \"\", Team22!$H$21)","v":""},"","","","",{"$f":"IF(Team22!$I$21=0, \"\", Team22!$I$21)","v":""},"","","","",{"$f":"IF(Team22!$J$21=0, \"\", Team22!$J$21)","v":""},"","","","",{"$f":"IF(Team22!$K$21=0, \"\", Team22!$K$21)","v":""},"","","","",{"$f":"SUM(F29,K29,P29,U29,Z29,AE29,AJ29,AO29)","v":0},{"$f":"MIN(F29,K29,P29,U29,Z29,AE29,AJ29,AO29)","v":0},{"$f":"LARGE((F29,K29,P29,U29,Z29,AE29,AJ29,AO29), 2)","v":{"$error":"#NUM!"}},{"$f":"IF(ISERROR(AS29), 0, AS29)","v":0},{"$f":"MAX(F29,K29,P29,U29,Z29,AE29,AJ29,AO29)","v":0},{"$f":"AQ29-AR29-AT29-AU29","v":0},{"$f":"IF(AV29=0, \"\", AV29)","v":""},"",{"$error":"#VALUE!"},99,1,24,{"$f":"(((AY29+BB29-1)*((AY29+BB29-1)+1)/2)-((AY29-1)*((AY29-1)+1)/2))/BB29","v":{"$error":"#VALUE!"}},"",0,{"$f":"IF(BE29=0, \"\", BE29)","v":""},1,"",24,12.5,"",{"$f":"AR29","v":0},{"$f":"AU29","v":0},0,{"$f":"IF(BN29=0, \"\", BN29)","v":""},1,"",24,{"$f":"(((BP29+BR29-1)*((BP29+BR29-1)+1)/2)-((BP29-1)*((BP29-1)+1)/2))/BR29","v":12.5},"",1,1,1,{"$f":"IF(BV29=\"\", \"\", SMALL(BV$8:BV$31, 22))","v":1},"","",{"$f":"COUNT($BV$8:$BV$31)-(RANK(BV29,$BV$8:$BV$31,0)+COUNTIF($BV$8:BV29,BV29))+2","v":3},{"$f":"IF(ISERROR(CA29), \" \", CA29)","v":3},"","",{"$f":"IF(COUNTIF($BX$8:$BX52,BX29)>1,\"TIE\",\"\")","v":"TIE"},"TIE","","","","*","*","*","",null,0,0,0,"",1,"",24,12.5,"",0,"",1,24,12.5,"",0,"",1,24,12.5,"",{"$error":"#VALUE!"},0,"",1,24,12.5,"",1,1,1,{"$f":"IF(DR29=\"\", \"\", SMALL(DR$8:DR$31, 22))","v":1},1,1,"",{"$f":"COUNT($DR$8:$DR$31)-(RANK(DR29,$DR$8:$DR$31,0)+COUNTIF($DR$8:DR29,DR29))+2","v":3},3,"","",{"$f":"IF(COUNTIF($DT$8:$DT52,DT29)>1,\"TIE\",\"\")","v":"TIE"},"TIE","TIE",null,1,"","","","","","","","","","","","","","","","","","","","","","","","","","","","","","","","","","","","",24,24,0,0,"","","",24,24,0,0,"","","",null,0,0,0,0,0,0,0,0,0,null,22,{"$f":"IF('Ranking Sheet'!B33=0, \"\", 'Ranking Sheet'!B33)","v":""},{"$f":"IF(Team22!$L$9=0, \"\", Team22!$L$9)","v":""},{"$f":"IF(Team22!$L$10=0, \"\", Team22!$L$10)","v":""},{"$f":"IF(Team22!$L$11=0, \"\", Team22!$L$11)","v":""},{"$f":"IF(Team22!$L$12=0, \"\", Team22!$L$12)","v":""},{"$f":"IF(Team22!$L$13=0, \"\", Team22!$L$13)","v":""},{"$f":"IF(Team22!$L$14=0, \"\", Team22!$L$14)","v":""},{"$f":"IF(Team22!$L$15=0, \"\", Team22!$L$15)","v":""},{"$f":"IF(Team22!$L$16=0, \"\", Team22!$L$16)","v":""},{"$f":"IF(Team22!$L$17=0, \"\", Team22!$L$17)","v":""},{"$f":"IF(Team22!$L$18=0, \"\", Team22!$L$18)","v":""},{"$f":"IF(Team22!$L$19=0, \"\", Team22!$L$19)","v":""},{"$f":"IF(Team22!$L$20=0, \"\", Team22!$L$20)","v":""},{"$f":"IF(Team22!$L$21=0, \"\", Team22!$L$21)","v":""},{"$f":"IF(Team22!$N$21=0, \"\", Team22!$N$21)","v":""},1,"","","","","","","","","","","","","","","","","","",null,1,"","","","","","","","","","","","","","",""]
[23,{"$f":"IF('Ranking Sheet'!B34=0, \"\", 'Ranking Sheet'!B34)","v":""},{"$f":"IF(Team23!D$21=0, \"\", Team23!D$21)","v":""},"","","","",{"$f":"IF(Team23!$E$21=0, \"\", Team23!$E$21)","v":""},"","","","",{"$f":"IF(Team23!$F$21=0, \"\", Team23!$F$21)","v":""},"","","","",{"$f":"IF(Team23!$G$21=0, \"\", Team23!$G$21)","v":""},"","","","",{"$f":"IF(Team23!$H$21=0, \"\", Team23!$H$21)","v":""},"","","","",{"$f":"IF(Team23!$I$21=0, \"\", Team23!$I$21)","v":""},"","","","",{"$f":"IF(Team23!$J$21=0, \"\", Team23!$J$21)","v":""},"","","","",{"$f":"IF(Team23!$K$21=0, \"\", Team23!$K$21)","v":""},"","","","",{"$f":"SUM(F30,K30,P30,U30,Z30,AE30,AJ30,AO30)","v":0},{"$f":"MIN(F30,K30,P30,U30,Z30,AE30,AJ30,AO30)","v":0},{"$f":"LARGE((F30,K30,P30,U30,Z30,AE30,AJ30,AO30), 2)","v":{"$error":"#NUM!"}},{"$f":"IF(ISERROR(AS30), 0, AS30)","v":0},{"$f":"MAX(F30,K30,P30,U30,Z30,AE30,AJ30,AO30)","v":0},{"$f":"AQ30-AR30-AT30-AU30","v":0},{"$f":"IF(AV30=0, \"\", AV30)","v":""},"",{"$error":"#VALUE!"},99,1,24,{"$f":"(((AY30+BB30-1)*((AY30+BB30-1)+1)/2)-((AY30-1)*((AY30-1)+1)/2))/BB30","v":{"$error":"#VALUE!"}},"",0,{"$f":"IF(BE30=0, \"\", BE30)","v":""},1,"",24,12.5,"",{"$f":"AR30","v":0},{"$f":"AU30","v":0},0,{"$f":"IF(BN30=0, \"\", BN30)","v":""},1,"",24,{"$f":"(((BP30+BR30-1)*((BP30+BR30-1)+1)/2)-((BP30-1)*((BP30-1)+1)/2))/BR30","v":12.5},"",1,1,1,{"$f":"IF(BV30=\"\", \"\", SMALL(BV$8:BV$31, 23))","v":1},"","",{"$f":"COUNT($BV$8:$BV$31)-(RANK(BV30,$BV$8:$BV$31,0)+COUNTIF($BV$8:BV30,BV30))+2","v":2},{"$f":"IF(ISERROR(CA30), \" \", CA30)","v":2},"","",{"$f":"IF(COUNTIF($BX$8:$BX53,BX30)>1,\"TIE\",\"\")","v":"TIE"},"TIE","","","","*","*","*","",null,0,0,0,"",1,"",24,12.5,"",0,"",1,24,12.5,"",0,"",1,24,12.5,"",{"$error":"#VALUE!"},0,"",1,24,12.5,"",1,1,1,{"$f":"IF(DR30=\"\", \"\", SMALL(DR$8:DR$31, 23))","v":1},1,1,"",{"$f":"COUNT($DR$8:$DR$31)-(RANK(DR30,$DR$8:$DR$31,0)+COUNTIF($DR$8:DR30,DR30))+2","v":2},2,"","",{"$f":"IF(COUNTIF($DT$8:$DT53,DT30)>1,\"TIE\",\"\")","v":"TIE"},"TIE","TIE",null,1,"","","","","","","","","","","","","","","","","","","","","","","","","","","","","","","","","","","","",24,24,0,0,"","","",24,24,0,0,"","","",null,0,0,0,0,0,0,0,0,0,null,23,{"$f":"IF('Ranking Sheet'!B34=0, \"\", 'Ranking Sheet'!B34)","v":""},{"$f":"IF(Team23!$L$9=0, \"\", Team23!$L$9)","v":""},{"$f":"IF(Team23!$L$10=0, \"\", Team23!$L$10)","v":""},{"$f":"IF(Team23!$L$11=0, \"\", Team23!$L$11)","v":""},{"$f":"IF(Team23!$L$12=0, \"\", Team23!$L$12)","v":""},{"$f":"IF(Team23!$L$13=0, \"\", Team23!$L$13)","v":""},{"$f":"IF(Team23!$L$14=0, \"\", Team23!$L$14)","v":""},{"$f":"IF(Team23!$L$15=0, \"\", Team23!$L$15)","v":""},{"$f":"IF(Team23!$L$16=0, \"\", Team23!$L$16)","v":""},{"$f":"IF(Team23!$L$17=0, \"\", Team23!$L$17)","v":""},{"$f":"IF(Team23!$L$18=0, \"\", Team23!$L$18)","v":""},{"$f":"IF(Team23!$L$19=0, \"\", Team23!$L$19)","v":""},{"$f":"IF(Team23!$L$20=0, \"\", Team23!$L$20)","v":""},{"$f":"IF(Team23!$L$21=0, \"\", Team23!$L$21)","v":""},{"$f":"IF(Team23!$N$21=0, \"\", Team23!$N$21)","v":""},1,"","","","","","","","","","","","","","","","","","",null,1,"","","","","","","","","","","","","","",""]
[24,{"$f":"IF('Ranking Sheet'!B35=0, \"\", 'Ranking Sheet'!B35)","v":""},{"$f":"IF(Team24!D$21=0, \"\", Team24!D$21)","v":""},"","","","",{"$f":"IF(Team24!$E$21=0, \"\", Team24!$E$21)","v":""},"","","","",{"$f":"IF(Team24!$F$21=0, \"\", Team24!$F$21)","v":""},"","","","",{"$f":"IF(Team24!$G$21=0, \"\", Team24!$G$21)","v":""},"","","","",{"$f":"IF(Team24!$H$21=0, \"\", Team24!$H$21)","v":""},"","","","",{"$f":"IF(Team24!$I$21=0, \"\", Team24!$I$21)","v":""},"","","","",{"$f":"IF(Team24!$J$21=0, \"\", Team24!$J$21)","v":""},"","","","",{"$f":"IF(Team24!$K$21=0, \"\", Team24!$K$21)","v":""},"","","","",{"$f":"SUM(F31,K31,P31,U31,Z31,AE31,AJ31,AO31)","v":0},{"$f":"MIN(F31,K31,P31,U31,Z31,AE31,AJ31,AO31)","v":0},{"$f":"LARGE((F31,K31,P31,U31,Z31,AE31,AJ31,AO31), 2)","v":{"$error":"#NUM!"}},{"$f":"IF(ISERROR(AS31), 0, AS31)","v":0},{"$f":"MAX(F31,K31,P31,U31,Z31,AE31,AJ31,AO31)","v":0},{"$f":"AQ31-AR31-AT31-AU31","v":0},{"$f":"IF(AV31=0, \"\", AV31)","v":""},"",{"$error":"#VALUE!"},99,1,24,{"$f":"(((AY31+BB31-1)*((AY31+BB31-1)+1)/2)-((AY31-1)*((AY31-1)+1)/2))/BB31","v":{"$error":"#VALUE!"}},"",0,{"$f":"IF(BE31=0, \"\", BE31)","v":""},1,"",24,12.5,"",{"$f":"AR31","v":0},{"$f":"AU31","v":0},0,{"$f":"IF(BN31=0, \"\", BN31)","v":""},1,"",24,{"$f":"(((BP31+BR31-1)*((BP31+BR31-1)+1)/2)-((BP31-1)*((BP31-1)+1)/2))/BR31","v":12.5},"",1,1,1,{"$f":"IF(BV31=\"\", \"\", SMALL(BV$8:BV$31, 24))","v":1},"","",{"$f":"COUNT($BV$8:$BV$31)-(RANK(BV31,$BV$8:$BV$31,0)+COUNTIF($BV$8:BV31,BV31))+2","v":1},{"$f":"IF(ISERROR(CA31), \" \", CA31)","v":1},"","",{"$f":"IF(COUNTIF($BX$8:$BX54,BX31)>1,\"TIE\",\"\")","v":"TIE"},"TIE","","","","*","*","*","",null,0,0,0,"",1,"",24,12.5,"",0,"",1,24,12.5,"",0,"",1,24,12.5,"",{"$error":"#VALUE!"},0,"",1,24,12.5,"",1,1,1,{"$f":"IF(DR31=\"\", \"\", SMALL(DR$8:DR$31, 24))","v":1},1,1,"",{"$f":"COUNT($DR$8:$DR$31)-(RANK(DR31,$DR$8:$DR$31,0)+COUNTIF($DR$8:DR31,DR31))+2","v":1},1,"","",{"$f":"IF(COUNTIF($DT$8:$DT54,DT31)>1,\"TIE\",\"\")","v":"TIE"},"TIE","TIE",null,1,"","","","","","","","","","","","","","","","","","","","","","","","","","","","","","","","","","","","",24,24,0,0,"","","",24,24,0,0,"","","",null,0,0,0,0,0,0,0,0,0,null,24,{"$f":"IF('Ranking Sheet'!B35=0, \"\", 'Ranking Sheet'!B35)","v":""},{"$f":"IF(Team24!$L$9=0, \"\", Team24!$L$9)","v":""},{"$f":"IF(Team24!$L$10=0, \"\", Team24!$L$10)","v":""},{"$f":"IF(Team24!$L$11=0, \"\", Team24!$L$11)","v":""},{"$f":"IF(Team24!$L$12=0, \"\", Team24!$L$12)","v":""},{"$f":"IF(Team24!$L$13=0, \"\", Team24!$L$13)","v":""},{"$f":"IF(Team24!$L$14=0, \"\", Team24!$L$14)","v":""},{"$f":"IF(Team24!$L$15=0, \"\", Team24!$L$15)","v":""},{"$f":"IF(Team24!$L$16=0, \"\", Team24!$L$16)","v":""},{"$f":"IF(Team24!$L$17=0, \"\", Team24!$L$17)","v":""},{"$f":"IF(Team24!$L$18=0, \"\", Team24!$L$18)","v":""},{"$f":"IF(Team24!$L$19=0, \"\", Team24!$L$19)","v":""},{"$f":"IF(Team24!$L$20=0, \"\", Team24!$L$20)","v":""},{"$f":"IF(Team24!$L$21=0, \"\", Team24!$L$21)","v":""},{"$f":"IF(Team24!$N$21=0, \"\", Team24!$N$21)","v":""},1,"","","","","","","","","","","","","","","","","","",null,1,"","","","","","","","","","","","","","",""]
[]
[]
[]
[]
[]
[null,"The formula for summation of “1 + 2 + 3 + .. + n” is “n * (n + 1) / 2” so the summation of 4 would be “4 * (4 + 1) / 2 = 10”."]
[null,"To compute the summation of 3 teams tied for third (ranks 3 thru 5) we just subtract the summation of 2 from the the summation of 5."]
[]
[null,"Rank Calculation “((sum of tied ranks – sum of all previous ranks) / # tied)”:"]
[null,3,"< Enter Rank"]
[null,3,"< Enter Ties"]
[null,{"$f":"(((B41+B42-1)*((B41+B42-1)+1)/2)-((B41-1)*((B41-1)+1)/2))/B42","v":4},"< Result"]
[]
[null,"Calculation Breakdown:"]
[null,{"$f":"B41+B42-1","v":5},"< Last rank for these ties"]
[null,{"$f":"B41-1","v":2},"< Last previous rank"]
[]
[null,{"$f":"(B46)*(B46+1)/2","v":15},"< Summation of tied ranks"]
[null,{"$f":"(B47)*(B47+1)/2","v":3},"< Summation of all previous ranks"]
[null,{"$f":"(B49-B50)/B42","v":4},"< Resulting rank for these tied ranks"]
[]
[null,"Team Score Summary Sheet",null,null,null,null,null,null,null,null,null,null,null,null,null,null,null,null,null,null,null,null,null,null,"Tie Announcers Sheet",null,null,null,null,null,null,null,null,null,null,null,null,null,"Superior Judge Sheet"]
[null,null,null,null,null,null,null,null,null,null,null,null,null,null,null,null,null,null,null,null,null,null,null,null,null,null,null,null,null,null,null,null,null,null,null,null,null,null,"Ranks",null,null,null,null,null,null,null,null,null,null,null,null,null,null,"Scores"]
[null,"School","Judges Scores",null,null,null,null,null,null,null,"Judges Scores (Low to High)",null,null,null,null,null,null,null,null,null,null,null,null,null,null,null,null,null,null,null,null,null,null,null,null,null,null,null,null,null,null,null,null,null,null,null,null,null,null,null,null,null,null,null,null,null,null,null,null,null,null,null,null,null,null,null,null,null,null,"Website"]
["Team",null,"Judge 1 Score","Judge 2 Score","Judge 3 Score","Judge 4 Score","Judge 5 Score","Judge 6 Score","Judge 7 Score","Judge 8 Score","Score 1 (lowest)","Score 2","Score 3","Score 4","Score 5","Score 6 ","Score 7 ","Score 8 (Highest - if applicable)","SubTotal","(Deductions)","Total","Out of Total Points",null,null,"Team in order of final placements","School - in final placement order","If tie-breaker used","Final Ranking for announcers form","For tie-breaker announcer form","1st tie","2nd place for 1st tie","Tie for 2nd place","3rd place team","Tie for 3rd","4th place team","Rank for tie sheet ",null,null,"Judge 1 rank","Judge 2 rank","Judge 3 rank","Judge 4 rank","Judge 5 rank","Judge 6 rank","Judge 7 rank","Judge 8 rank","Min Rank (Best)","Max Rank (Worst)","Rank Spread","2nd best rank","Rank Spread with 2nd best rank","2nd worst rank","Rank Spread with 2nd worst rank","Judge 1 Score","Judge 2 Score","Judge 3 Score","Judge 4 Score","Judge 5 Score","Judge 6 Score","Judge 7 Score","Judge 8 Score","Low Points","High Points","Point Spread","2nd Lowest Points","Point Spread with 2nd lowest points","2nd Highest Points","Point Spread with 2nd highest points",null,"Putting the information together on one line"]
[1,{"$f":"IF('Ranking Sheet'!B12=0, \"\", 'Ranking Sheet'!B12)","v":""},{"$f":"C8","v":""},{"$f":"H8","v":""},{"$f":"M8","v":""},{"$f":"R8","v":""},{"$f":"W8","v":""},{"$f":"AB8","v":""},{"$f":"AG8","v":""},{"$f":"AL8","v":""},{"$f":"IF(C57=\"DQ\", \"DQ\", IF(C57=\"\", \"\", SMALL(C57:J57,1)))","v":""},{"$f":"IF(C57=\"DQ\", \"DQ\", IF(C57=\"\", \"\",SMALL(C57:J57,2)))","v":""},{"$f":"IF(C57=\"DQ\", \"DQ\", IF(C57=\"\", \"\",SMALL(C57:J57,3)))","v":""},{"$f":"IF(C57=\"DQ\", \"DQ\", IF(C57=\"\", \"\",SMALL(C57:J57,4)))","v":""},{"$f":"IF(C57=\"DQ\", \"DQ\", IF(C57=\"\", \"\",SMALL(C57:J57,5)))","v":""},{"$f":"IF(C57=\"DQ\", \"DQ\", IF(H57=\"\", \"\", SMALL(C57:J57,6)))","v":""},{"$f":"IF(C57=\"DQ\", \"DQ\", IF(H57=\"\", \"\", SMALL(C57:J57,7)))","v":""},{"$f":"IF(C57=\"DQ\", \"DQ\", IF(J57=\"\", \"\", SMALL(C57:J57,8)))","v":""},{"$f":"HB8","v":""},{"$f":"HC8","v":""},{"$f":"HD8","v":""},{"$f":"HE8","v":""},null,null,{"$f":"DV8","v":1},{"$f":"EA8","v":""},{"$f":"CM8","v":""},{"$f":"CI8","v":""},{"$f":"AND(AB57=AB58, AA57=AA58)","v":true},{"$f":"IF(AC57=TRUE, Z57, \"\")","v":""},{"$f":"IF(AC57=TRUE,Z58,\"\")","v":""},null,null,null,null,{"$f":"IF(AC57=TRUE,AB57, \"\")","v":""},null,null,{"$f":" IF(BW8=\"DQ\", \"DQ\",F8)","v":""},{"$f":" IF(BW8=\"DQ\", \"DQ\",K8)","v":""},{"$f":" IF(BW8=\"DQ\", \"DQ\",P8)","v":""},{"$f":" IF(BW8=\"DQ\", \"DQ\",U8)","v":""},{"$f":" IF(BW8=\"DQ\", \"DQ\",Z8)","v":""},{"$f":" IF(BW8=\"DQ\", \"DQ\",AE8)","v":""},{"$f":" IF(BW8=\"DQ\", \"DQ\",AJ8)","v":""},{"$f":" IF(BW8=\"DQ\", \"DQ\",AO8)","v":""},{"$f":"IF(BW8=\"DQ\", \"DQ\", IF(AM57=\"\", \"\", MIN(AM57,AN57,AO57,AP57,AQ57,AR57,AS57,AT57)))","v":""},{"$f":"IF(BW8=\"DQ\", \"DQ\", IF(AM57=\"\", \"\", MAX(AM57,AN57,AO57,AP57,AQ57,AR57,AS57,AT57)))","v":""},{"$f":"IF(BW8=\"DQ\", \"DQ\", IF(AM57=\"\", \"\", AV57-AU57))","v":""},{"$f":"IF(BW8=\"DQ\", \"DQ\", IF(AM57=\"\", \"\", SMALL(AM57:AT57,2)))","v":""},{"$f":"IF(BW8=\"DQ\", \"DQ\", IF(AM57=\"\", \"\", AV57-AX57))","v":""},{"$f":"IF(BW8=\"DQ\", \"DQ\", IF(AM57=\"\", \"\", IF(AT57=\"\", SMALL(AM57:AT57,6), SMALL(AM57:AT57,7))))","v":""},{"$f":"IF(BW8=\"DQ\", \"DQ\", IF(AM57=\"\", \"\",AZ57-AU57))","v":""},{"$f":" IF(BW8=\"DQ\", \"DQ\",C8)","v":""},{"$f":" IF(BW8=\"DQ\", \"DQ\",H8)","v":""},{"$f":" IF(BW8=\"DQ\", \"DQ\",M8)","v":""},{"$f":" IF(BW8=\"DQ\", \"DQ\",R8)","v":""},{"$f":" IF(BW8=\"DQ\", \"DQ\",W8)","v":""},{"$f":" IF(BW8=\"DQ\", \"DQ\",AB8)","v":""},{"$f":" IF(BW8=\"DQ\", \"DQ\",AG8)","v":""},{"$f":" IF(BW8=\"DQ\", \"DQ\",AL8)","v":""},{"$f":"IF(BW8=\"DQ\", \"DQ\", IF(AM57=\"\", \"\",CO8))","v":""},{"$f":"IF(BW8=\"DQ\", \"DQ\", IF(AM57=\"\", \"\",CP8))","v":""},{"$f":"IF(BW8=\"DQ\", \"DQ\", IF(AM57=\"\", \"\", BK57-BJ57))","v":""},{"$f":"IF(BW8=\"DQ\", \"DQ\", IF(BB57=\"\", \"\", SMALL(BB57:BI57,2)))","v":""},{"$f":"IF(BW8=\"DQ\", \"DQ\", IF(BB57=\"\", \"\", BK57-BM57))","v":""},{"$f":"IF(BW8=\"DQ\", \"DQ\", IF(BB57=\"\", \"\", IF(BI57=\"\", SMALL(BB57:BI57,6), SMALL(BB57:BI57,7))))","v":""},{"$f":"IF(BW8=\"DQ\", \"DQ\", IF(BB57=\"\", \"\",BO57-BJ57))","v":""},null,{"$f":"CONCATENATE(HG8,\",\",HH8,\",\",HI8,\",\",HJ8,\",\",HK8,\",\",HL8,\",\",HM8,\",\",HN8,\",\",)","v":",,,,,,,,"},{"$f":"CONCATENATE(HO8,\",\",HP8,\",\",HQ8,\",\",HR8,\",\",HS8,\",\",HT8,\",\",HU8,\",\",HV8,\",\",\"/\",\",\",HW8,\",\",HX8)","v":",,,,,,,,/,,"},{"$f":"CONCATENATE(BR57,BS57)","v":",,,,,,,,,,,,,,,,/,,"}]
[2,{"$f":"IF('Ranking Sheet'!B13=0, \"\", 'Ranking Sheet'!B13)","v":""},{"$f":"C9","v":""},{"$f":"H9","v":""},{"$f":"M9","v":""},{"$f":"R9","v":""},{"$f":"W9","v":""},{"$f":"AB9","v":""},{"$f":"AG9","v":""},{"$f":"AL9","v":""},{"$f":"IF(C58=\"DQ\", \"DQ\", IF(C58=\"\", \"\", SMALL(C58:J58,1)))","v":""},{"$f":"IF(C58=\"DQ\", \"DQ\", IF(C58=\"\", \"\",SMALL(C58:J58,2)))","v":""},{"$f":"IF(C58=\"DQ\", \"DQ\", IF(C58=\"\", \"\",SMALL(C58:J58,3)))","v":""},{"$f":"IF(C58=\"DQ\", \"DQ\", IF(C58=\"\", \"\",SMALL(C58:J58,4)))","v":""},{"$f":"IF(C58=\"DQ\", \"DQ\", IF(C58=\"\", \"\",SMALL(C58:J58,5)))","v":""},{"$f":"IF(C58=\"DQ\", \"DQ\", IF(H58=\"\", \"\", SMALL(C58:J58,6)))","v":""},{"$f":"IF(C58=\"DQ\", \"DQ\", IF(H58=\"\", \"\", SMALL(C58:J58,7)))","v":""},{"$f":"IF(C58=\"DQ\", \"DQ\", IF(J58=\"\", \"\", SMALL(C58:J58,8)))","v":""},{"$f":"HB9","v":""},"","","",null,null,{"$f":"DV9","v":1},{"$f":"EA9","v":""},{"$f":"CM9","v":""},{"$f":"CI9","v":""},{"$f":"AND(AB58=AB59, AA58=AA59)","v":true},null,null,{"$f":"IF(AC58=TRUE, Z58, \"\")","v":""},{"$f":"IF(AC58=TRUE, Z59, \"\")","v":""},null,null,{"$f":"IF(AC58=TRUE,AB58, \"\")","v":""},null,null,{"$f":" IF(BW9=\"DQ\", \"DQ\",F9)","v":""},{"$f":" IF(BW9=\"DQ\", \"DQ\",K9)","v":""},{"$f":" IF(BW9=\"DQ\", \"DQ\",P9)","v":""},{"$f":" IF(BW9=\"DQ\", \"DQ\",U9)","v":""},{"$f":" IF(BW9=\"DQ\", \"DQ\",Z9)","v":""},{"$f":" IF(BW9=\"DQ\", \"DQ\",AE9)","v":""},{"$f":" IF(BW9=\"DQ\", \"DQ\",AJ9)","v":""},{"$f":" IF(BW9=\"DQ\", \"DQ\",AO9)","v":""},{"$f":"IF(BW9=\"DQ\", \"DQ\", IF(AM58=\"\", \"\", MIN(AM58,AN58,AO58,AP58,AQ58,AR58,AS58,AT58)))","v":""},{"$f":"IF(BW9=\"DQ\", \"DQ\", IF(AM58=\"\", \"\", MAX(AM58,AN58,AO58,AP58,AQ58,AR58,AS58,AT58)))","v":""},{"$f":"IF(BW9=\"DQ\", \"DQ\", IF(AM58=\"\", \"\", AV58-AU58))","v":""},{"$f":"IF(BW9=\"DQ\", \"DQ\", IF(AM58=\"\", \"\", SMALL(AM58:AT58,2)))","v":""},{"$f":"IF(BW9=\"DQ\", \"DQ\", IF(AM58=\"\", \"\", AV58-AX58))","v":""},{"$f":"IF(BW9=\"DQ\", \"DQ\", IF(AM58=\"\", \"\", IF(AT58=\"\", SMALL(AM58:AT58,6), SMALL(AM58:AT58,7))))","v":""},{"$f":"IF(BW9=\"DQ\", \"DQ\", IF(AM58=\"\", \"\",AZ58-AU58))","v":""},{"$f":" IF(BW9=\"DQ\", \"DQ\",C9)","v":""},{"$f":" IF(BW9=\"DQ\", \"DQ\",H9)","v":""},{"$f":" IF(BW9=\"DQ\", \"DQ\",M9)","v":""},{"$f":" IF(BW9=\"DQ\", \"DQ\",R9)","v":""},{"$f":" IF(BW9=\"DQ\", \"DQ\",W9)","v":""},{"$f":" IF(BW9=\"DQ\", \"DQ\",AB9)","v":""},{"$f":" IF(BW9=\"DQ\", \"DQ\",AG9)","v":""},{"$f":" IF(BW9=\"DQ\", \"DQ\",AL9)","v":""},{"$f":"IF(BW9=\"DQ\", \"DQ\", IF(AM58=\"\", \"\",CO9))","v":""},{"$f":"IF(BW9=\"DQ\", \"DQ\", IF(AM58=\"\", \"\",CP9))","v":""},{"$f":"IF(BW9=\"DQ\", \"DQ\", IF(AM58=\"\", \"\", BK58-BJ58))","v":""},{"$f":"IF(BW9=\"DQ\", \"DQ\", IF(BB58=\"\", \"\", SMALL(BB58:BI58,2)))","v":""},{"$f":"IF(BW9=\"DQ\", \"DQ\", IF(BB58=\"\", \"\", BK58-BM58))","v":""},{"$f":"IF(BW9=\"DQ\", \"DQ\", IF(BB58=\"\", \"\", IF(BI58=\"\", SMALL(BB58:BI58,6), SMALL(BB58:BI58,7))))","v":""},{"$f":"IF(BW9=\"DQ\", \"DQ\", IF(BB58=\"\", \"\",BO58-BJ58))","v":""},null,{"$f":"CONCATENATE(HG9,\",\",HH9,\",\",HI9,\",\",HJ9,\",\",HK9,\",\",HL9,\",\",HM9,\",\",HN9,\",\",)","v":",,,,,,,,"},{"$f":"CONCATENATE(HO9,\",\",HP9,\",\",HQ9,\",\",HR9,\",\",HS9,\",\",HT9,\",\",HU9,\",\",HV9,\",\",\"/\",\",\",HW9,\",\",HX9)","v":",,,,,,,,/,,"},{"$f":"CONCATENATE(BR58,BS58)","v":",,,,,,,,,,,,,,,,/,,"}]
[3,{"$f":"IF('Ranking Sheet'!B14=0, \"\", 'Ranking Sheet'!B14)","v":""},"","","","","","","","","","","","","","","","","","","","",null,null,{"$f":"DV10","v":1},{"$f":"EA10","v":""},{"$f":"CM10","v":""},{"$f":"CI10","v":""},{"$f":"AND(AB59=AB60, AA59=AA60)","v":true},null,null,null,null,{"$f":"IF(AC59=TRUE, Z59, \"\")","v":""},{"$f":"IF(AC59=TRUE,Z60,\"\")","v":""},{"$f":"IF(AC59=TRUE,AB59, \"\")","v":""},null,null,"","","","","","","","","","","","","","","","","","","","","","","","","","","","","","",null,",,,,,,,,",",,,,,,,,/,,",",,,,,,,,,,,,,,,,/,,"]
[4,{"$f":"IF('Ranking Sheet'!B15=0, \"\", 'Ranking Sheet'!B15)","v":""},"","","","","","","","","","","","","","","","","","","","",null,null,{"$f":"DV11","v":1},{"$f":"EA11","v":""},{"$f":"CM11","v":""},{"$f":"CI11","v":""},null,null,null,null,null,null,null,null,null,null,"","","","","","","","","","","","","","","","","","","","","","","","","","","","","","",null,",,,,,,,,",",,,,,,,,/,,",",,,,,,,,,,,,,,,,/,,"]
[5,{"$f":"IF('Ranking Sheet'!B16=0, \"\", 'Ranking Sheet'!B16)","v":""},"","","","","","","","","","","","","","","","","","","","",null,null,null,null,null,null,null,null,null,null,null,null,null,null,null,null,"","","","","","","","","","","","","","","","","","","","","","","","","","","","","","",null,",,,,,,,,",",,,,,,,,/,,",",,,,,,,,,,,,,,,,/,,"]
[6,{"$f":"IF('Ranking Sheet'!B17=0, \"\", 'Ranking Sheet'!B17)","v":""},"","","","","","","","","","","","","","","","","","","","",null,null,null,null,null,null,null,null,null,null,null,null,null,null,null,null,"","","","","","","","","","","","","","","","","","","","","","","","","","","","","","",null,",,,,,,,,",",,,,,,,,/,,",",,,,,,,,,,,,,,,,/,,"]
[7,{"$f":"IF('Ranking Sheet'!B18=0, \"\", 'Ranking Sheet'!B18)","v":""},"","","","","","","","","","","","","","","","","","","","",null,null,null,null,null,null,null,null,null,null,null,null,null,null,null,null,"","","","","","","","","","","","","","","","","","","","","","","","","","","","","","",null,",,,,,,,,",",,,,,,,,/,,",",,,,,,,,,,,,,,,,/,,"]
[8,{"$f":"IF('Ranking Sheet'!B19=0, \"\", 'Ranking Sheet'!B19)","v":""},"","","","","","","","","","","","","","","","","","","","",null,null,null,null,null,null,null,null,null,null,null,null,null,null,null,null,"","","","","","","","","","","","","","","","","","","","","","","","","","","","","","",null,",,,,,,,,",",,,,,,,,/,,",",,,,,,,,,,,,,,,,/,,"]
[9,{"$f":"IF('Ranking Sheet'!B20=0, \"\", 'Ranking Sheet'!B20)","v":""},"","","","","","","","","","","","","","","","","","","","",null,null,null,null,null,null,null,null,null,null,null,null,null,null,null,null,"","","","","","","","","","","","","","","","","","","","","","","","","","","","","","",null,",,,,,,,,",",,,,,,,,/,,",",,,,,,,,,,,,,,,,/,,"]
[10,{"$f":"IF('Ranking Sheet'!B21=0, \"\", 'Ranking Sheet'!B21)","v":""},"","","","","","","","","","","","","","","","","","","","",null,null,null,null,null,null,null,null,null,null,null,null,null,null,null,null,"","","","","","","","","","","","","","","","","","","","","","","","","","","","","","",null,",,,,,,,,",",,,,,,,,/,,",",,,,,,,,,,,,,,,,/,,"]
[11,{"$f":"IF('Ranking Sheet'!B22=0, \"\", 'Ranking Sheet'!B22)","v":""},"","","","","","","","","","","","","","","","","","","","",null,null,null,null,null,null,null,null,null,null,null,null,null,null,null,null,"","","","","","","","","","","","","","","","","","","","","","","","","","","","","","",null,",,,,,,,,",",,,,,,,,/,,",",,,,,,,,,,,,,,,,/,,"]
[12,{"$f":"IF('Ranking Sheet'!B23=0, \"\", 'Ranking Sheet'!B23)","v":""},"","","","","","","","","","","","","","","","","","","","",null,null,null,null,null,null,null,null,null,null,null,null,null,null,null,null,"","","","","","","","","","","","","","","","","","","","","","","","","","","","","","",null,",,,,,,,,",",,,,,,,,/,,",",,,,,,,,,,,,,,,,/,,"]
[13,{"$f":"IF('Ranking Sheet'!B24=0, \"\", 'Ranking Sheet'!B24)","v":""},"","","","","","","","","","","","","","","","","","","","",null,null,null,null,null,null,null,null,null,null,null,null,null,null,null,null,"","","","","","","","","","","","","","","","","","","","","","","","","","","","","","",null,",,,,,,,,",",,,,,,,,/,,",",,,,,,,,,,,,,,,,/,,"]
[14,{"$f":"IF('Ranking Sheet'!B25=0, \"\", 'Ranking Sheet'!B25)","v":""},"","","","","","","","","","","","","","","","","","","","",null,null,null,null,null,null,null,null,null,null,null,null,null,null,null,null,"","","","","","","","","","","","","","","","","","","","","","","","","","","","","","",null,",,,,,,,,",",,,,,,,,/,,",",,,,,,,,,,,,,,,,/,,"]
[15,{"$f":"IF('Ranking Sheet'!B26=0, \"\", 'Ranking Sheet'!B26)","v":""},"","","","","","","","","","","","","","","","","","","","",null,null,null,null,null,null,null,null,null,null,null,null,null,null,null,null,"","","","","","","","","","","","","","","","","","","","","","","","","","","","","","",null,",,,,,,,,",",,,,,,,,/,,",",,,,,,,,,,,,,,,,/,,"]
[16,{"$f":"IF('Ranking Sheet'!B27=0, \"\", 'Ranking Sheet'!B27)","v":""},"","","","","","","","","","","","","","","","","","","","",null,null,null,null,null,null,null,null,null,null,null,null,null,null,null,null,"","","","","","","","","","","","","","","","","","","","","","","","","","","","","","",null,",,,,,,,,",",,,,,,,,/,,",",,,,,,,,,,,,,,,,/,,"]
[17,{"$f":"IF('Ranking Sheet'!B28=0, \"\", 'Ranking Sheet'!B28)","v":""},"","","","","","","","","","","","","","","","","","","","",null,null,null,null,null,null,null,null,null,null,null,null,null,null,null,null,"","","","","","","","","","","","","","","","","","","","","","","","","","","","","","",null,",,,,,,,,",",,,,,,,,/,,",",,,,,,,,,,,,,,,,/,,"]
[18,{"$f":"IF('Ranking Sheet'!B29=0, \"\", 'Ranking Sheet'!B29)","v":""},"","","","","","","","","","","","","","","","",{"$f":"HB25","v":""},"","","",null,null,null,null,null,null,null,null,null,null,null,null,null,null,null,null,"","","","","","","","","","","","","","","","","","","","","","","","","","","","","","",null,",,,,,,,,",",,,,,,,,/,,",",,,,,,,,,,,,,,,,/,,"]
[19,{"$f":"IF('Ranking Sheet'!B30=0, \"\", 'Ranking Sheet'!B30)","v":""},"","","","","","","","","","","","","","","","","","","","",null,null,null,null,null,null,null,null,null,null,null,null,null,null,null,null,"","","","","","","","","","","","","","","","","","","","","","","","","","","","","","",null,",,,,,,,,",",,,,,,,,/,,",",,,,,,,,,,,,,,,,/,,"]
[20,{"$f":"IF('Ranking Sheet'!B31=0, \"\", 'Ranking Sheet'!B31)","v":""},"","","","","","","","","","","","","","","","","","","","",null,null,null,null,null,null,null,null,null,null,null,null,null,null,null,null,"","","","","","","","","","","","","","","","","","","","","","","","","","","","","","",null,",,,,,,,,",",,,,,,,,/,,",",,,,,,,,,,,,,,,,/,,"]
[21,{"$f":"IF('Ranking Sheet'!B32=0, \"\", 'Ranking Sheet'!B32)","v":""},"","","","","","","","","","","","","","","","","","","","",null,null,null,null,null,null,null,null,null,null,null,null,null,null,null,null,"","","","","","","","","","","","","","","","","","","","","","","","","","","","","","",null,",,,,,,,,",",,,,,,,,/,,",",,,,,,,,,,,,,,,,/,,"]
[22,{"$f":"IF('Ranking Sheet'!B33=0, \"\", 'Ranking Sheet'!B33)","v":""},"","","","","","","","","","","","","","","","","","","","",null,null,null,null,null,null,null,null,null,null,null,null,null,null,null,null,"","","","","","","","","","","","","","","","","","","","","","","","","","","","","","",null,",,,,,,,,",",,,,,,,,/,,",",,,,,,,,,,,,,,,,/,,"]
[23,{"$f":"IF('Ranking Sheet'!B34=0, \"\", 'Ranking Sheet'!B34)","v":""},"","","","","","","","","","","","","","","","","","","","",null,null,null,null,null,null,null,null,null,null,null,null,null,null,null,null,"","","","","","","","","","","","","","","","","","","","","","","","","","","","","","",null,",,,,,,,,",",,,,,,,,/,,",",,,,,,,,,,,,,,,,/,,"]
[24,{"$f":"IF('Ranking Sheet'!B35=0, \"\", 'Ranking Sheet'!B35)","v":""},"","","","","","","","","","","","","","","","","","","","",null,null,null,null,null,null,null,null,null,null,null,null,null,null,null,null,"","","","","","","","","","","","","","","","","","","","","","","","","","","","","","",null,",,,,,,,,",",,,,,,,,/,,",",,,,,,,,,,,,,,,,/,,"]

{"sheet":"Final Placement","index":2,"n_rows":37,"n_cols":13,"rows_kept":37,"cut":false,"hidden":false,"merged":[[32,3,32,8],[23,3,23,8],[24,3,24,8],[25,3,25,8],[26,3,26,8],[14,3,14,8],[15,3,15,8],[17,3,17,8],[18,3,18,8],[19,3,19,8],[16,3,16,8],[10,3,10,8],[11,3,11,8],[12,3,12,8],[13,3,13,8],[8,0,8,1],[8,2,8,9],[9,3,9,8],[1,12,2,17],[2,0,2,10],[4,8,4,10],[6,8,6,10],[4,0,4,1],[1,0,1,10],[4,2,4,4],[6,2,6,4],[6,0,6,1],[34,0,34,3],[36,0,36,2],[20,3,20,8],[21,3,21,8],[22,3,22,8],[29,3,29,8],[27,3,27,8],[28,3,28,8],[30,3,30,8],[31,3,31,8]]}
[]
["Minnesota State High School League Dance Team Competition",null,null,null,null,null,null,null,null,null,null,null,"For Sections and State only:  If Extra Tie-breaker Sheet is used, put \"x\" in box below for new Final Placements"]
["Final Placements"]
[]
["MEET DATE:",null,{"$f":"IF(DATE=0, \"\", DATE)","v":""},null,null,null,"MEET SITE:",null,{"$f":"IF(Site=0, \"\", Site)","v":""}]
[]
["CLASS:",null,{"$f":"IF(Class=0, \"\", Class)","v":""},null,null,null,"CATEGORY:",null,{"$f":"CATEGORY","v":"Jazz Category"}]
[]
["Final \nPlace",null,"School",null,null,null,null,null,null,null,"Ranking Point Total"]
[{"$f":"IF($N$4=\"x\", 'Rank Wkst'!DV8, 'Rank Wkst'!BY8)","v":""},{"$f":"IF($N$4=\"x\", 'Rank Wkst'!ED8, 'Rank Wkst'!CG8)","v":""},null,{"$f":"IF($N$4=\"x\", 'Rank Wkst'!EA8, 'Rank Wkst'!CD8)","v":""},null,null,null,null,null,{"$f":"IF('Rank Wkst'!CM8=\"*\",\"Tie-breaker used\", \"\")","v":""},{"$f":"'Rank Wkst'!CI8","v":""}]
[{"$f":"IF($N$4=\"x\", 'Rank Wkst'!DV9, 'Rank Wkst'!BY9)","v":""},{"$f":"IF($N$4=\"x\", 'Rank Wkst'!ED9, 'Rank Wkst'!CG9)","v":""},null,{"$f":"IF($N$4=\"x\", 'Rank Wkst'!EA9, 'Rank Wkst'!CD9)","v":""},null,null,null,null,null,{"$f":"IF('Rank Wkst'!CM9=\"*\",\"Tie-breaker used\", \"\")","v":""},{"$f":"'Rank Wkst'!CI9","v":""}]
[{"$f":"IF($N$4=\"x\", 'Rank Wkst'!DV10, 'Rank Wkst'!BY10)","v":""},{"$f":"IF($N$4=\"x\", 'Rank Wkst'!ED10, 'Rank Wkst'!CG10)","v":""},null,{"$f":"IF($N$4=\"x\", 'Rank Wkst'!EA10, 'Rank Wkst'!CD10)","v":""},null,null,null,null,null,{"$f":"IF('Rank Wkst'!CM10=\"*\",\"Tie-breaker used\", \"\")","v":""},{"$f":"'Rank Wkst'!CI10","v":""}]
[{"$f":"IF($N$4=\"x\", 'Rank Wkst'!DV11, 'Rank Wkst'!BY11)","v":""},{"$f":"IF($N$4=\"x\", 'Rank Wkst'!ED11, 'Rank Wkst'!CG11)","v":""},null,{"$f":"IF($N$4=\"x\", 'Rank Wkst'!EA11, 'Rank Wkst'!CD11)","v":""},null,null,null,null,null,{"$f":"IF('Rank Wkst'!CM11=\"*\",\"Tie-breaker used\", \"\")","v":""},{"$f":"'Rank Wkst'!CI11","v":""}]
[{"$f":"IF($N$4=\"x\", 'Rank Wkst'!DV12, 'Rank Wkst'!BY12)","v":""},{"$f":"IF($N$4=\"x\", 'Rank Wkst'!ED12, 'Rank Wkst'!CG12)","v":""},null,{"$f":"IF($N$4=\"x\", 'Rank Wkst'!EA12, 'Rank Wkst'!CD12)","v":""},null,null,null,null,null,{"$f":"IF('Rank Wkst'!CM12=\"*\",\"Tie-breaker used\", \"\")","v":""},{"$f":"'Rank Wkst'!CI12","v":""}]
[{"$f":"IF($N$4=\"x\", 'Rank Wkst'!DV13, 'Rank Wkst'!BY13)","v":""},{"$f":"IF($N$4=\"x\", 'Rank Wkst'!ED13, 'Rank Wkst'!CG13)","v":""},null,{"$f":"IF($N$4=\"x\", 'Rank Wkst'!EA13, 'Rank Wkst'!CD13)","v":""},null,null,null,null,null,{"$f":"IF('Rank Wkst'!CM13=\"*\",\"Tie-breaker used\", \"\")","v":""},{"$f":"'Rank Wkst'!CI13","v":""}]
[{"$f":"IF($N$4=\"x\", 'Rank Wkst'!DV14, 'Rank Wkst'!BY14)","v":""},{"$f":"IF($N$4=\"x\", 'Rank Wkst'!ED14, 'Rank Wkst'!CG14)","v":""},null,{"$f":"IF($N$4=\"x\", 'Rank Wkst'!EA14, 'Rank Wkst'!CD14)","v":""},null,null,null,null,null,{"$f":"IF('Rank Wkst'!CM14=\"*\",\"Tie-breaker used\", \"\")","v":""},{"$f":"'Rank Wkst'!CI14","v":""}]
[{"$f":"IF($N$4=\"x\", 'Rank Wkst'!DV15, 'Rank Wkst'!BY15)","v":""},{"$f":"IF($N$4=\"x\", 'Rank Wkst'!ED15, 'Rank Wkst'!CG15)","v":""},null,{"$f":"IF($N$4=\"x\", 'Rank Wkst'!EA15, 'Rank Wkst'!CD15)","v":""},null,null,null,null,null,{"$f":"IF('Rank Wkst'!CM15=\"*\",\"Tie-breaker used\", \"\")","v":""},{"$f":"'Rank Wkst'!CI15","v":""}]
[{"$f":"IF($N$4=\"x\", 'Rank Wkst'!DV16, 'Rank Wkst'!BY16)","v":""},{"$f":"IF($N$4=\"x\", 'Rank Wkst'!ED16, 'Rank Wkst'!CG16)","v":""},null,{"$f":"IF($N$4=\"x\", 'Rank Wkst'!EA16, 'Rank Wkst'!CD16)","v":""},null,null,null,null,null,{"$f":"IF('Rank Wkst'!CM16=\"*\",\"Tie-breaker used\", \"\")","v":""},{"$f":"'Rank Wkst'!CI16","v":""}]
[{"$f":"IF($N$4=\"x\", 'Rank Wkst'!DV17, 'Rank Wkst'!BY17)","v":""},{"$f":"IF($N$4=\"x\", 'Rank Wkst'!ED17, 'Rank Wkst'!CG17)","v":""},null,{"$f":"IF($N$4=\"x\", 'Rank Wkst'!EA17, 'Rank Wkst'!CD17)","v":""},null,null,null,null,null,{"$f":"IF('Rank Wkst'!CM17=\"*\",\"Tie-breaker used\", \"\")","v":""},{"$f":"'Rank Wkst'!CI17","v":""}]
[{"$f":"IF($N$4=\"x\", 'Rank Wkst'!DV18, 'Rank Wkst'!BY18)","v":""},{"$f":"IF($N$4=\"x\", 'Rank Wkst'!ED18, 'Rank Wkst'!CG18)","v":""},null,{"$f":"IF($N$4=\"x\", 'Rank Wkst'!EA18, 'Rank Wkst'!CD18)","v":""},null,null,null,null,null,{"$f":"IF('Rank Wkst'!CM18=\"*\",\"Tie-breaker used\", \"\")","v":""},{"$f":"'Rank Wkst'!CI18","v":""}]
[{"$f":"IF($N$4=\"x\", 'Rank Wkst'!DV19, 'Rank Wkst'!BY19)","v":""},{"$f":"IF($N$4=\"x\", 'Rank Wkst'!ED19, 'Rank Wkst'!CG19)","v":""},null,{"$f":"IF($N$4=\"x\", 'Rank Wkst'!EA19, 'Rank Wkst'!CD19)","v":""},null,null,null,null,null,{"$f":"IF('Rank Wkst'!CM19=\"*\",\"Tie-breaker used\", \"\")","v":""},{"$f":"'Rank Wkst'!CI19","v":""}]
[{"$f":"IF($N$4=\"x\", 'Rank Wkst'!DV20, 'Rank Wkst'!BY20)","v":""},{"$f":"IF($N$4=\"x\", 'Rank Wkst'!ED20, 'Rank Wkst'!CG20)","v":""},null,{"$f":"IF($N$4=\"x\", 'Rank Wkst'!EA20, 'Rank Wkst'!CD20)","v":""},null,null,null,null,null,{"$f":"IF('Rank Wkst'!CM20=\"*\",\"Tie-breaker used\", \"\")","v":""},{"$f":"'Rank Wkst'!CI20","v":""}]
[{"$f":"IF($N$4=\"x\", 'Rank Wkst'!DV21, 'Rank Wkst'!BY21)","v":""},{"$f":"IF($N$4=\"x\", 'Rank Wkst'!ED21, 'Rank Wkst'!CG21)","v":""},null,{"$f":"IF($N$4=\"x\", 'Rank Wkst'!EA21, 'Rank Wkst'!CD21)","v":""},null,null,null,null,null,{"$f":"IF('Rank Wkst'!CM21=\"*\",\"Tie-breaker used\", \"\")","v":""},{"$f":"'Rank Wkst'!CI21","v":""}]
[{"$f":"IF($N$4=\"x\", 'Rank Wkst'!DV22, 'Rank Wkst'!BY22)","v":""},{"$f":"IF($N$4=\"x\", 'Rank Wkst'!ED22, 'Rank Wkst'!CG22)","v":""},null,{"$f":"IF($N$4=\"x\", 'Rank Wkst'!EA22, 'Rank Wkst'!CD22)","v":""},null,null,null,null,null,{"$f":"IF('Rank Wkst'!CM22=\"*\",\"Tie-breaker used\", \"\")","v":""},{"$f":"'Rank Wkst'!CI22","v":""}]
[{"$f":"IF($N$4=\"x\", 'Rank Wkst'!DV23, 'Rank Wkst'!BY23)","v":""},{"$f":"IF($N$4=\"x\", 'Rank Wkst'!ED23, 'Rank Wkst'!CG23)","v":""},null,{"$f":"IF($N$4=\"x\", 'Rank Wkst'!EA23, 'Rank Wkst'!CD23)","v":""},null,null,null,null,null,{"$f":"IF('Rank Wkst'!CM23=\"*\",\"Tie-breaker used\", \"\")","v":""},{"$f":"'Rank Wkst'!CI23","v":""}]
[{"$f":"IF($N$4=\"x\", 'Rank Wkst'!DV24, 'Rank Wkst'!BY24)","v":""},{"$f":"IF($N$4=\"x\", 'Rank Wkst'!ED24, 'Rank Wkst'!CG24)","v":""},null,{"$f":"IF($N$4=\"x\", 'Rank Wkst'!EA24, 'Rank Wkst'!CD24)","v":""},null,null,null,null,null,{"$f":"IF('Rank Wkst'!CM24=\"*\",\"Tie-breaker used\", \"\")","v":""},{"$f":"'Rank Wkst'!CI24","v":""}]
[{"$f":"IF($N$4=\"x\", 'Rank Wkst'!DV25, 'Rank Wkst'!BY25)","v":""},{"$f":"IF($N$4=\"x\", 'Rank Wkst'!ED25, 'Rank Wkst'!CG25)","v":""},null,{"$f":"IF($N$4=\"x\", 'Rank Wkst'!EA25, 'Rank Wkst'!CD25)","v":""},null,null,null,null,null,{"$f":"IF('Rank Wkst'!CM25=\"*\",\"Tie-breaker used\", \"\")","v":""},{"$f":"'Rank Wkst'!CI25","v":""}]
[{"$f":"IF($N$4=\"x\", 'Rank Wkst'!DV26, 'Rank Wkst'!BY26)","v":""},{"$f":"IF($N$4=\"x\", 'Rank Wkst'!ED26, 'Rank Wkst'!CG26)","v":""},null,{"$f":"IF($N$4=\"x\", 'Rank Wkst'!EA26, 'Rank Wkst'!CD26)","v":""},null,null,null,null,null,{"$f":"IF('Rank Wkst'!CM26=\"*\",\"Tie-breaker used\", \"\")","v":""},{"$f":"'Rank Wkst'!CI26","v":""}]
[{"$f":"IF($N$4=\"x\", 'Rank Wkst'!DV27, 'Rank Wkst'!BY27)","v":""},{"$f":"IF($N$4=\"x\", 'Rank Wkst'!ED27, 'Rank Wkst'!CG27)","v":""},null,{"$f":"IF($N$4=\"x\", 'Rank Wkst'!EA27, 'Rank Wkst'!CD27)","v":""},null,null,null,null,null,{"$f":"IF('Rank Wkst'!CM27=\"*\",\"Tie-breaker used\", \"\")","v":""},{"$f":"'Rank Wkst'!CI27","v":""}]
[{"$f":"IF($N$4=\"x\", 'Rank Wkst'!DV28, 'Rank Wkst'!BY28)","v":""},{"$f":"IF($N$4=\"x\", 'Rank Wkst'!ED28, 'Rank Wkst'!CG28)","v":""},null,{"$f":"IF($N$4=\"x\", 'Rank Wkst'!EA28, 'Rank Wkst'!CD28)","v":""},null,null,null,null,null,{"$f":"IF('Rank Wkst'!CM28=\"*\",\"Tie-breaker used\", \"\")","v":""},{"$f":"'Rank Wkst'!CI28","v":""}]
[{"$f":"IF($N$4=\"x\", 'Rank Wkst'!DV29, 'Rank Wkst'!BY29)","v":""},{"$f":"IF($N$4=\"x\", 'Rank Wkst'!ED29, 'Rank Wkst'!CG29)","v":""},null,{"$f":"IF($N$4=\"x\", 'Rank Wkst'!EA29, 'Rank Wkst'!CD29)","v":""},null,null,null,null,null,{"$f":"IF('Rank Wkst'!CM29=\"*\",\"Tie-breaker used\", \"\")","v":""},{"$f":"'Rank Wkst'!CI29","v":""}]
[{"$f":"IF($N$4=\"x\", 'Rank Wkst'!DV30, 'Rank Wkst'!BY30)","v":""},{"$f":"IF($N$4=\"x\", 'Rank Wkst'!ED30, 'Rank Wkst'!CG30)","v":""},null,{"$f":"IF($N$4=\"x\", 'Rank Wkst'!EA30, 'Rank Wkst'!CD30)","v":""},null,null,null,null,null,{"$f":"IF('Rank Wkst'!CM30=\"*\",\"Tie-breaker used\", \"\")","v":""},{"$f":"'Rank Wkst'!CI30","v":""}]
[{"$f":"IF($N$4=\"x\", 'Rank Wkst'!DV31, 'Rank Wkst'!BY31)","v":""},{"$f":"IF($N$4=\"x\", 'Rank Wkst'!ED31, 'Rank Wkst'!CG31)","v":""},null,{"$f":"IF($N$4=\"x\", 'Rank Wkst'!EA31, 'Rank Wkst'!CD31)","v":""},null,null,null,null,null,{"$f":"IF('Rank Wkst'!CM31=\"*\",\"Tie-breaker used\", \"\")","v":""},{"$f":"'Rank Wkst'!CI31","v":""}]
[]
["Superior Judge Signature"]
[]
["Tabulator Signature"]

{"sheet":"Announcers Form","index":3,"n_rows":38,"n_cols":14,"rows_kept":38,"cut":false,"hidden":false,"merged":[[37,4,37,5],[37,6,37,7],[28,11,28,15],[29,11,29,15],[32,4,32,15],[20,0,20,1],[37,11,37,12],[37,13,37,14],[26,11,26,15],[33,4,33,15],[9,0,13,1],[22,11,22,15],[20,3,20,15],[23,11,23,15],[24,11,24,15],[25,11,25,15],[34,4,34,15],[35,4,35,15],[1,3,1,15],[2,3,2,15],[12,3,12,15],[18,3,18,5],[18,10,18,13],[27,11,27,15]]}
[]
[null,null,null,"Minnesota State High School League Dance Team Competition"]
[null,null,null,"ANNOUNCER RESULTS FORM"]
[]
[null,null,null,"TABULATORS AND SUPERIOR JUDGES:"]
[null,null,null,"Please use this form to fill out the results and both sign to verify that the results are accurate."]
[]
[null,null,null,"ANNOUNCER:"]
[null,null,null,"Do not announce the results unless this form is signed on the bottom."]
["For Sections and State only: If Extra Tie-breaker Sheet is used, put \"x\" in box below for new Final Placements"]
[null,null,null,"Please announce: "]
[null,null,null,"\"The team packets will be available to pick up after the awards ceremony in:\""]
[]
[null,null,null,"Superior/Tabulator: fill this in and write the time the packets are available on the envelopes"]
[]
[null,null,null,"FINAL RESULTS FROM:"]
[null,null,null,"CLASS:",null,null,{"$f":"IF(Class=0, \"\", Class)","v":""}]
[]
[null,null,null,"CATEGORY:",null,null,{"$f":"CATEGORY","v":"Jazz Category"}]
[]
["Place \"x\" in Box if Announcing place:",null,null,"ANNOUNCER - Please announce ranking point total and announce that the lowest rank score wins."]
[]
["1st","x",null,{"$f":"IF(B23=\"x\", IF($B$16=\"x\",'Rank Wkst'!ED8, 'Rank Wkst'!CG8), \"\")","v":""},{"$f":"IF(B23=\"x\", IF($B$16=\"x\",'Rank Wkst'!DV8, 'Rank Wkst'!BY8), \"\")","v":""},"Place:","with a ranking point total of:",{"$f":"IF(B23= \"x\", 'Rank Wkst'!CI8, \"\")","v":""},{"$f":"IF(B23=\"x\",'Rank Wkst'!CM8, \"\")","v":""},":",null,{"$f":"IF(B23=\"x\",IF($B$16=\"x\",'Rank Wkst'!EA8, 'Rank Wkst'!CD8), \"\")","v":""}]
["2nd","x",null,{"$f":"IF(B24=\"x\", IF($B$16=\"x\",'Rank Wkst'!ED9, 'Rank Wkst'!CG9), \"\")","v":""},{"$f":"IF(B24=\"x\", IF($B$16=\"x\",'Rank Wkst'!DV9, 'Rank Wkst'!BY9), \"\")","v":""},"Place:","with a ranking point total of:",{"$f":"IF(B24= \"x\", 'Rank Wkst'!CI9, \"\")","v":""},{"$f":"IF(B24=\"x\",'Rank Wkst'!CM9, \"\")","v":""},":",null,{"$f":"IF(B24=\"x\",IF($B$16=\"x\",'Rank Wkst'!EA9, 'Rank Wkst'!CD9), \"\")","v":""}]
["3rd","x",null,{"$f":"IF(B25=\"x\", IF($B$16=\"x\",'Rank Wkst'!ED10, 'Rank Wkst'!CG10), \"\")","v":""},{"$f":"IF(B25=\"x\", IF($B$16=\"x\",'Rank Wkst'!DV10, 'Rank Wkst'!BY10), \"\")","v":""},"Place:","with a ranking point total of:",{"$f":"IF(B25= \"x\", 'Rank Wkst'!CI10, \"\")","v":""},{"$f":"IF(B25=\"x\",'Rank Wkst'!CM10, \"\")","v":""},":",null,{"$f":"IF(B25=\"x\",IF($B$16=\"x\",'Rank Wkst'!EA10, 'Rank Wkst'!CD10), \"\")","v":""}]
["4th","x",null,{"$f":"IF(B26=\"x\", IF($B$16=\"x\",'Rank Wkst'!ED11, 'Rank Wkst'!CG11), \"\")","v":""},{"$f":"IF(B26=\"x\", IF($B$16=\"x\",'Rank Wkst'!DV11, 'Rank Wkst'!BY11), \"\")","v":""},"Place:","with a ranking point total of:",{"$f":"IF(B26= \"x\", 'Rank Wkst'!CI11, \"\")","v":""},{"$f":"IF(B26=\"x\",'Rank Wkst'!CM11, \"\")","v":""},":",null,{"$f":"IF(B26=\"x\",IF($B$16=\"x\",'Rank Wkst'!EA11, 'Rank Wkst'!CD11), \"\")","v":""}]
["5th","x",null,{"$f":"IF(B27=\"x\", IF($B$16=\"x\",'Rank Wkst'!ED12, 'Rank Wkst'!CG12), \"\")","v":""},{"$f":"IF(B27=\"x\", IF($B$16=\"x\",'Rank Wkst'!DV12, 'Rank Wkst'!BY12), \"\")","v":""},"Place:","with a ranking point total of:",{"$f":"IF(B27= \"x\", 'Rank Wkst'!CI12, \"\")","v":""},{"$f":"IF(B27=\"x\",'Rank Wkst'!CM12, \"\")","v":""},":",null,{"$f":"IF(B27=\"x\",IF($B$16=\"x\",'Rank Wkst'!EA12, 'Rank Wkst'!CD12), \"\")","v":""}]
["6th","x",null,{"$f":"IF(B28=\"x\", IF($B$16=\"x\",'Rank Wkst'!ED13, 'Rank Wkst'!CG13), \"\")","v":""},{"$f":"IF(B28=\"x\", IF($B$16=\"x\",'Rank Wkst'!DV13, 'Rank Wkst'!BY13), \"\")","v":""},"Place:","with a ranking point total of:",{"$f":"IF(B28= \"x\", 'Rank Wkst'!CI13, \"\")","v":""},{"$f":"IF(B28=\"x\",'Rank Wkst'!CM13, \"\")","v":""},":",null,{"$f":"IF(B28=\"x\",IF($B$16=\"x\",'Rank Wkst'!EA13, 'Rank Wkst'!CD13), \"\")","v":""}]
["7th","x",null,{"$f":"IF(B29=\"x\", IF($B$16=\"x\",'Rank Wkst'!ED14, 'Rank Wkst'!CG14), \"\")","v":""},{"$f":"IF(B29=\"x\", IF($B$16=\"x\",'Rank Wkst'!DV14, 'Rank Wkst'!BY14), \"\")","v":""},"Place:","with a ranking point total of:",{"$f":"IF(B29= \"x\", 'Rank Wkst'!CI14, \"\")","v":""},{"$f":"IF(B29=\"x\",'Rank Wkst'!CM14, \"\")","v":""},":",null,{"$f":"IF(B29=\"x\",IF($B$16=\"x\",'Rank Wkst'!EA14, 'Rank Wkst'!CD14), \"\")","v":""}]
["8th",null,null,{"$f":"IF(B30=\"x\", IF($B$16=\"x\",'Rank Wkst'!ED15, 'Rank Wkst'!CG15), \"\")","v":""},{"$f":"IF(B30=\"x\", IF($B$16=\"x\",'Rank Wkst'!DV15, 'Rank Wkst'!BY15), \"\")","v":""},"Place:","with a ranking point total of:",{"$f":"IF(B30= \"x\", 'Rank Wkst'!CI15, \"\")","v":""},{"$f":"IF(B30=\"x\",'Rank Wkst'!CM15, \"\")","v":""},":",null,{"$f":"IF(B30=\"x\",IF($B$16=\"x\",'Rank Wkst'!EA15, 'Rank Wkst'!CD15), \"\")","v":""}]
[]
[]
[]
[null,null,null,null,"Superior Judge Signature"]
[]
[null,null,null,null,"Tabulator Signature"]
[]
[null,null,null,null,"Meet Site:",null,{"$f":"IF(Site=0, \"\", Site)","v":""},null,null,null,null,"Meet Date:",null,{"$f":"IF(DATE=0, \"\", DATE)","v":""}]

{"sheet":"Point Summary","index":4,"n_rows":35,"n_cols":25,"rows_kept":35,"cut":false,"hidden":false,"merged":[[28,24,28,29],[29,24,29,29],[30,24,30,29],[31,24,31,29],[32,24,32,29],[33,24,33,29],[18,24,18,29],[19,24,19,29],[20,24,20,29],[21,24,21,29],[34,24,34,29],[23,24,23,29],[24,24,24,29],[25,24,25,29],[26,24,26,29],[27,24,27,29],[12,24,12,29],[13,24,13,29],[14,24,14,29],[15,24,15,29],[16,24,16,29],[17,24,17,29],[32,2,32,3],[15,2,15,3],[16,2,16,3],[17,2,17,3],[18,2,18,3],[19,2,19,3],[22,2,22,3],[29,2,29,3],[21,2,21,3],[34,2,34,3],[8,19,8,21],[9,11,9,12],[11,2,11,3],[12,2,12,3],[13,2,13,3],[14,2,14,3],[23,2,23,3],[30,2,30,3],[31,2,31,3],[1,0,1,21],[2,0,2,21],[10,2,10,3],[9,4,9,5],[9,6,9,7],[8,4,8,13],[8,14,8,18],[10,0,10,1],[10,17,10,18],[10,20,10,21],[2,24,3,29],[4,8,4,16],[6,0,6,2],[6,6,6,7],[6,8,6,16],[4,0,4,2],[4,6,4,7],[22,24,22,29],[11,24,11,29],[20,2,20,3],[9,8,9,10],[33,2,33,3],[24,2,24,3],[25,2,25,3],[26,2,26,3],[27,2,27,3],[28,2,28,3]]}
[]
["Minnesota State High School League Dance Team Competition"]
["Point and Rank Summary",null,null,null,null,null,null,null,null,null,null,null,null,null,null,null,null,null,null,null,null,null,null,null,"For Sections and State only:  If Extra Tie-breaker Sheet is used, put \"x\" in box below for new Final Placements"]
[]
["MEET DATE:",null,null,{"$f":"IF(DATE=0, \"\", DATE)","v":""},null,null,"MEET SITE:",null,{"$f":"IF(Site=0, \"\", Site)","v":""}]
[]
["CLASS:",null,null,{"$f":"IF(Class=0, \"\", Class)","v":""},null,null,"CATEGORY:",null,{"$f":"CATEGORY","v":"Jazz Category"}]
[]
[null,null,null,null,"Category Points Breakdown",null,null,null,null,null,null,null,null,null,"Category Points Total",null,null,null,null,"Rank"]
[null,null,null,null,"Skills",null,"Choreography",null,"Difficulty",null,null,"Execution",null,"Routine Eff."]
["Final Rank",null,"School",null,"Technique of Turns","Technique of Leaps & Jumps","Creativity","Visual Effectiveness","Difficulty of Routine Choreography","Difficulty of Formations & Transitions","Difficulty of Skills","Placement & Control","Degree of Accuracy","Routine Effectiveness","SubTotal Points","(Deductions)","Total Points","Out of Total Points Possible",null,"Rank Points","Final \nRank",null,null,null,"Website"]
[{"$f":"IF($Z$5=\"x\", 'Rank Wkst'!HZ8, 'Rank Wkst'!HG8)","v":""},{"$f":"IF($Z$5=\"x\", 'Rank Wkst'!ED8, 'Rank Wkst'!HH8)","v":""},{"$f":"IF($Z$5=\"x\", 'Rank Wkst'!EA8, 'Rank Wkst'!HI8)","v":""},null,{"$f":"IF($Z$5=\"x\", 'Rank Wkst'!IB8,'Rank Wkst'!HJ8)","v":""},{"$f":"IF($Z$5=\"x\", 'Rank Wkst'!IC8,'Rank Wkst'!HK8)","v":""},{"$f":"IF($Z$5=\"x\", 'Rank Wkst'!ID8,'Rank Wkst'!HL8)","v":""},{"$f":"IF($Z$5=\"x\", 'Rank Wkst'!IE8,'Rank Wkst'!HM8)","v":""},{"$f":"IF($Z$5=\"x\", 'Rank Wkst'!IF8,'Rank Wkst'!HN8)","v":""},{"$f":"IF($Z$5=\"x\", 'Rank Wkst'!IG8,'Rank Wkst'!HO8)","v":""},{"$f":"IF($Z$5=\"x\", 'Rank Wkst'!IH8,'Rank Wkst'!HP8)","v":""},{"$f":"IF($Z$5=\"x\", 'Rank Wkst'!II8,'Rank Wkst'!HQ8)","v":""},{"$f":"IF($Z$5=\"x\", 'Rank Wkst'!IJ8,'Rank Wkst'!HR8)","v":""},{"$f":"IF($Z$5=\"x\", 'Rank Wkst'!IK8,'Rank Wkst'!HS8)","v":""},{"$f":"IF($Z$5=\"x\", 'Rank Wkst'!IL8,'Rank Wkst'!HT8)","v":""},{"$f":"IF($Z$5=\"x\", 'Rank Wkst'!IM8,'Rank Wkst'!HU8)","v":""},{"$f":"IF($Z$5=\"x\", 'Rank Wkst'!IN8,'Rank Wkst'!HV8)","v":""},{"$f":"\"/\"","v":"/"},{"$f":"IF($Z$5=\"x\", 'Rank Wkst'!IO8,'Rank Wkst'!HW8)","v":""},{"$f":"'Rank Wkst'!HX8","v":""},{"$f":"IF($Z$5=\"x\", 'Rank Wkst'!HZ8, 'Rank Wkst'!HG8)","v":""},{"$f":"IF($Z$5=\"x\", 'Rank Wkst'!ED8, 'Rank Wkst'!HH8)","v":""},null,null,{"$f":"IF(E12=\"\",\" \",'Rank Wkst'!BT57)","v":" "}]
[{"$f":"IF($Z$5=\"x\", 'Rank Wkst'!HZ9, 'Rank Wkst'!HG9)","v":""},{"$f":"IF($Z$5=\"x\", 'Rank Wkst'!ED9, 'Rank Wkst'!HH9)","v":""},{"$f":"IF($Z$5=\"x\", 'Rank Wkst'!EA9, 'Rank Wkst'!HI9)","v":""},null,{"$f":"IF($Z$5=\"x\", 'Rank Wkst'!IB9,'Rank Wkst'!HJ9)","v":""},{"$f":"IF($Z$5=\"x\", 'Rank Wkst'!IC9,'Rank Wkst'!HK9)","v":""},{"$f":"IF($Z$5=\"x\", 'Rank Wkst'!ID9,'Rank Wkst'!HL9)","v":""},{"$f":"IF($Z$5=\"x\", 'Rank Wkst'!IE9,'Rank Wkst'!HM9)","v":""},{"$f":"IF($Z$5=\"x\", 'Rank Wkst'!IF9,'Rank Wkst'!HN9)","v":""},{"$f":"IF($Z$5=\"x\", 'Rank Wkst'!IG9,'Rank Wkst'!HO9)","v":""},{"$f":"IF($Z$5=\"x\", 'Rank Wkst'!IH9,'Rank Wkst'!HP9)","v":""},{"$f":"IF($Z$5=\"x\", 'Rank Wkst'!II9,'Rank Wkst'!HQ9)","v":""},{"$f":"IF($Z$5=\"x\", 'Rank Wkst'!IJ9,'Rank Wkst'!HR9)","v":""},{"$f":"IF($Z$5=\"x\", 'Rank Wkst'!IK9,'Rank Wkst'!HS9)","v":""},{"$f":"IF($Z$5=\"x\", 'Rank Wkst'!IL9,'Rank Wkst'!HT9)","v":""},{"$f":"IF($Z$5=\"x\", 'Rank Wkst'!IM9,'Rank Wkst'!HU9)","v":""},{"$f":"IF($Z$5=\"x\", 'Rank Wkst'!IN9,'Rank Wkst'!HV9)","v":""},{"$f":"\"/\"","v":"/"},{"$f":"IF($Z$5=\"x\", 'Rank Wkst'!IO9,'Rank Wkst'!HW9)","v":""},{"$f":"'Rank Wkst'!HX9","v":""},{"$f":"IF($Z$5=\"x\", 'Rank Wkst'!HZ9, 'Rank Wkst'!HG9)","v":""},{"$f":"IF($Z$5=\"x\", 'Rank Wkst'!ED9, 'Rank Wkst'!HH9)","v":""},null,null,{"$f":"IF(E13=\"\",\" \",'Rank Wkst'!BT58)","v":" "}]
[{"$f":"IF($Z$5=\"x\", 'Rank Wkst'!HZ10, 'Rank Wkst'!HG10)","v":""},{"$f":"IF($Z$5=\"x\", 'Rank Wkst'!ED10, 'Rank Wkst'!HH10)","v":""},{"$f":"IF($Z$5=\"x\", 'Rank Wkst'!EA10, 'Rank Wkst'!HI10)","v":""},null,{"$f":"IF($Z$5=\"x\", 'Rank Wkst'!IB10,'Rank Wkst'!HJ10)","v":""},{"$f":"IF($Z$5=\"x\", 'Rank Wkst'!IC10,'Rank Wkst'!HK10)","v":""},{"$f":"IF($Z$5=\"x\", 'Rank Wkst'!ID10,'Rank Wkst'!HL10)","v":""},{"$f":"IF($Z$5=\"x\", 'Rank Wkst'!IE10,'Rank Wkst'!HM10)","v":""},{"$f":"IF($Z$5=\"x\", 'Rank Wkst'!IF10,'Rank Wkst'!HN10)","v":""},{"$f":"IF($Z$5=\"x\", 'Rank Wkst'!IG10,'Rank Wkst'!HO10)","v":""},{"$f":"IF($Z$5=\"x\", 'Rank Wkst'!IH10,'Rank Wkst'!HP10)","v":""},{"$f":"IF($Z$5=\"x\", 'Rank Wkst'!II10,'Rank Wkst'!HQ10)","v":""},{"$f":"IF($Z$5=\"x\", 'Rank Wkst'!IJ10,'Rank Wkst'!HR10)","v":""},{"$f":"IF($Z$5=\"x\", 'Rank Wkst'!IK10,'Rank Wkst'!HS10)","v":""},{"$f":"IF($Z$5=\"x\", 'Rank Wkst'!IL10,'Rank Wkst'!HT10)","v":""},{"$f":"IF($Z$5=\"x\", 'Rank Wkst'!IM10,'Rank Wkst'!HU10)","v":""},{"$f":"IF($Z$5=\"x\", 'Rank Wkst'!IN10,'Rank Wkst'!HV10)","v":""},"/",{"$f":"IF($Z$5=\"x\", 'Rank Wkst'!IO10,'Rank Wkst'!HW10)","v":""},{"$f":"'Rank Wkst'!HX10","v":""},{"$f":"IF($Z$5=\"x\", 'Rank Wkst'!HZ10, 'Rank Wkst'!HG10)","v":""},{"$f":"IF($Z$5=\"x\", 'Rank Wkst'!ED10, 'Rank Wkst'!HH10)","v":""},null,null,{"$f":"IF(E14=\"\",\" \",'Rank Wkst'!BT59)","v":" "}]
[{"$f":"IF($Z$5=\"x\", 'Rank Wkst'!HZ11, 'Rank Wkst'!HG11)","v":""},{"$f":"IF($Z$5=\"x\", 'Rank Wkst'!ED11, 'Rank Wkst'!HH11)","v":""},{"$f":"IF($Z$5=\"x\", 'Rank Wkst'!EA11, 'Rank Wkst'!HI11)","v":""},null,{"$f":"IF($Z$5=\"x\", 'Rank Wkst'!IB11,'Rank Wkst'!HJ11)","v":""},{"$f":"IF($Z$5=\"x\", 'Rank Wkst'!IC11,'Rank Wkst'!HK11)","v":""},{"$f":"IF($Z$5=\"x\", 'Rank Wkst'!ID11,'Rank Wkst'!HL11)","v":""},{"$f":"IF($Z$5=\"x\", 'Rank Wkst'!IE11,'Rank Wkst'!HM11)","v":""},{"$f":"IF($Z$5=\"x\", 'Rank Wkst'!IF11,'Rank Wkst'!HN11)","v":""},{"$f":"IF($Z$5=\"x\", 'Rank Wkst'!IG11,'Rank Wkst'!HO11)","v":""},{"$f":"IF($Z$5=\"x\", 'Rank Wkst'!IH11,'Rank Wkst'!HP11)","v":""},{"$f":"IF($Z$5=\"x\", 'Rank Wkst'!II11,'Rank Wkst'!HQ11)","v":""},{"$f":"IF($Z$5=\"x\", 'Rank Wkst'!IJ11,'Rank Wkst'!HR11)","v":""},{"$f":"IF($Z$5=\"x\", 'Rank Wkst'!IK11,'Rank Wkst'!HS11)","v":""},{"$f":"IF($Z$5=\"x\", 'Rank Wkst'!IL11,'Rank Wkst'!HT11)","v":""},{"$f":"IF($Z$5=\"x\", 'Rank Wkst'!IM11,'Rank Wkst'!HU11)","v":""},{"$f":"IF($Z$5=\"x\", 'Rank Wkst'!IN11,'Rank Wkst'!HV11)","v":""},"/",{"$f":"IF($Z$5=\"x\", 'Rank Wkst'!IO11,'Rank Wkst'!HW11)","v":""},{"$f":"'Rank Wkst'!HX11","v":""},{"$f":"IF($Z$5=\"x\", 'Rank Wkst'!HZ11, 'Rank Wkst'!HG11)","v":""},{"$f":"IF($Z$5=\"x\", 'Rank Wkst'!ED11, 'Rank Wkst'!HH11)","v":""},null,null,{"$f":"IF(E15=\"\",\" \",'Rank Wkst'!BT60)","v":" "}]
[{"$f":"IF($Z$5=\"x\", 'Rank Wkst'!HZ12, 'Rank Wkst'!HG12)","v":""},{"$f":"IF($Z$5=\"x\", 'Rank Wkst'!ED12, 'Rank Wkst'!HH12)","v":""},{"$f":"IF($Z$5=\"x\", 'Rank Wkst'!EA12, 'Rank Wkst'!HI12)","v":""},null,{"$f":"IF($Z$5=\"x\", 'Rank Wkst'!IB12,'Rank Wkst'!HJ12)","v":""},{"$f":"IF($Z$5=\"x\", 'Rank Wkst'!IC12,'Rank Wkst'!HK12)","v":""},{"$f":"IF($Z$5=\"x\", 'Rank Wkst'!ID12,'Rank Wkst'!HL12)","v":""},{"$f":"IF($Z$5=\"x\", 'Rank Wkst'!IE12,'Rank Wkst'!HM12)","v":""},{"$f":"IF($Z$5=\"x\", 'Rank Wkst'!IF12,'Rank Wkst'!HN12)","v":""},{"$f":"IF($Z$5=\"x\", 'Rank Wkst'!IG12,'Rank Wkst'!HO12)","v":""},{"$f":"IF($Z$5=\"x\", 'Rank Wkst'!IH12,'Rank Wkst'!HP12)","v":""},{"$f":"IF($Z$5=\"x\", 'Rank Wkst'!II12,'Rank Wkst'!HQ12)","v":""},{"$f":"IF($Z$5=\"x\", 'Rank Wkst'!IJ12,'Rank Wkst'!HR12)","v":""},{"$f":"IF($Z$5=\"x\", 'Rank Wkst'!IK12,'Rank Wkst'!HS12)","v":""},{"$f":"IF($Z$5=\"x\", 'Rank Wkst'!IL12,'Rank Wkst'!HT12)","v":""},{"$f":"IF($Z$5=\"x\", 'Rank Wkst'!IM12,'Rank Wkst'!HU12)","v":""},{"$f":"IF($Z$5=\"x\", 'Rank Wkst'!IN12,'Rank Wkst'!HV12)","v":""},"/",{"$f":"IF($Z$5=\"x\", 'Rank Wkst'!IO12,'Rank Wkst'!HW12)","v":""},{"$f":"'Rank Wkst'!HX12","v":""},{"$f":"IF($Z$5=\"x\", 'Rank Wkst'!HZ12, 'Rank Wkst'!HG12)","v":""},{"$f":"IF($Z$5=\"x\", 'Rank Wkst'!ED12, 'Rank Wkst'!HH12)","v":""},null,null,{"$f":"IF(E16=\"\",\" \",'Rank Wkst'!BT61)","v":" "}]
[{"$f":"IF($Z$5=\"x\", 'Rank Wkst'!HZ13, 'Rank Wkst'!HG13)","v":""},{"$f":"IF($Z$5=\"x\", 'Rank Wkst'!ED13, 'Rank Wkst'!HH13)","v":""},{"$f":"IF($Z$5=\"x\", 'Rank Wkst'!EA13, 'Rank Wkst'!HI13)","v":""},null,{"$f":"IF($Z$5=\"x\", 'Rank Wkst'!IB13,'Rank Wkst'!HJ13)","v":""},{"$f":"IF($Z$5=\"x\", 'Rank Wkst'!IC13,'Rank Wkst'!HK13)","v":""},{"$f":"IF($Z$5=\"x\", 'Rank Wkst'!ID13,'Rank Wkst'!HL13)","v":""},{"$f":"IF($Z$5=\"x\", 'Rank Wkst'!IE13,'Rank Wkst'!HM13)","v":""},{"$f":"IF($Z$5=\"x\", 'Rank Wkst'!IF13,'Rank Wkst'!HN13)","v":""},{"$f":"IF($Z$5=\"x\", 'Rank Wkst'!IG13,'Rank Wkst'!HO13)","v":""},{"$f":"IF($Z$5=\"x\", 'Rank Wkst'!IH13,'Rank Wkst'!HP13)","v":""},{"$f":"IF($Z$5=\"x\", 'Rank Wkst'!II13,'Rank Wkst'!HQ13)","v":""},{"$f":"IF($Z$5=\"x\", 'Rank Wkst'!IJ13,'Rank Wkst'!HR13)","v":""},{"$f":"IF($Z$5=\"x\", 'Rank Wkst'!IK13,'Rank Wkst'!HS13)","v":""},{"$f":"IF($Z$5=\"x\", 'Rank Wkst'!IL13,'Rank Wkst'!HT13)","v":""},{"$f":"IF($Z$5=\"x\", 'Rank Wkst'!IM13,'Rank Wkst'!HU13)","v":""},{"$f":"IF($Z$5=\"x\", 'Rank Wkst'!IN13,'Rank Wkst'!HV13)","v":""},"/",{"$f":"IF($Z$5=\"x\", 'Rank Wkst'!IO13,'Rank Wkst'!HW13)","v":""},{"$f":"'Rank Wkst'!HX13","v":""},{"$f":"IF($Z$5=\"x\", 'Rank Wkst'!HZ13, 'Rank Wkst'!HG13)","v":""},{"$f":"IF($Z$5=\"x\", 'Rank Wkst'!ED13, 'Rank Wkst'!HH13)","v":""},null,null,{"$f":"IF(E17=\"\",\" \",'Rank Wkst'!BT62)","v":" "}]
[{"$f":"IF($Z$5=\"x\", 'Rank Wkst'!HZ14, 'Rank Wkst'!HG14)","v":""},{"$f":"IF($Z$5=\"x\", 'Rank Wkst'!ED14, 'Rank Wkst'!HH14)","v":""},{"$f":"IF($Z$5=\"x\", 'Rank Wkst'!EA14, 'Rank Wkst'!HI14)","v":""},null,{"$f":"IF($Z$5=\"x\", 'Rank Wkst'!IB14,'Rank Wkst'!HJ14)","v":""},{"$f":"IF($Z$5=\"x\", 'Rank Wkst'!IC14,'Rank Wkst'!HK14)","v":""},{"$f":"IF($Z$5=\"x\", 'Rank Wkst'!ID14,'Rank Wkst'!HL14)","v":""},{"$f":"IF($Z$5=\"x\", 'Rank Wkst'!IE14,'Rank Wkst'!HM14)","v":""},{"$f":"IF($Z$5=\"x\", 'Rank Wkst'!IF14,'Rank Wkst'!HN14)","v":""},{"$f":"IF($Z$5=\"x\", 'Rank Wkst'!IG14,'Rank Wkst'!HO14)","v":""},{"$f":"IF($Z$5=\"x\", 'Rank Wkst'!IH14,'Rank Wkst'!HP14)","v":""},{"$f":"IF($Z$5=\"x\", 'Rank Wkst'!II14,'Rank Wkst'!HQ14)","v":""},{"$f":"IF($Z$5=\"x\", 'Rank Wkst'!IJ14,'Rank Wkst'!HR14)","v":""},{"$f":"IF($Z$5=\"x\", 'Rank Wkst'!IK14,'Rank Wkst'!HS14)","v":""},{"$f":"IF($Z$5=\"x\", 'Rank Wkst'!IL14,'Rank Wkst'!HT14)","v":""},{"$f":"IF($Z$5=\"x\", 'Rank Wkst'!IM14,'Rank Wkst'!HU14)","v":""},{"$f":"IF($Z$5=\"x\", 'Rank Wkst'!IN14,'Rank Wkst'!HV14)","v":""},"/",{"$f":"IF($Z$5=\"x\", 'Rank Wkst'!IO14,'Rank Wkst'!HW14)","v":""},{"$f":"'Rank Wkst'!HX14","v":""},{"$f":"IF($Z$5=\"x\", 'Rank Wkst'!HZ14, 'Rank Wkst'!HG14)","v":""},{"$f":"IF($Z$5=\"x\", 'Rank Wkst'!ED14, 'Rank Wkst'!HH14)","v":""},null,null,{"$f":"IF(E18=\"\",\" \",'Rank Wkst'!BT63)","v":" "}]
[{"$f":"IF($Z$5=\"x\", 'Rank Wkst'!HZ15, 'Rank Wkst'!HG15)","v":""},{"$f":"IF($Z$5=\"x\", 'Rank Wkst'!ED15, 'Rank Wkst'!HH15)","v":""},{"$f":"IF($Z$5=\"x\", 'Rank Wkst'!EA15, 'Rank Wkst'!HI15)","v":""},null,{"$f":"IF($Z$5=\"x\", 'Rank Wkst'!IB15,'Rank Wkst'!HJ15)","v":""},{"$f":"IF($Z$5=\"x\", 'Rank Wkst'!IC15,'Rank Wkst'!HK15)","v":""},{"$f":"IF($Z$5=\"x\", 'Rank Wkst'!ID15,'Rank Wkst'!HL15)","v":""},{"$f":"IF($Z$5=\"x\", 'Rank Wkst'!IE15,'Rank Wkst'!HM15)","v":""},{"$f":"IF($Z$5=\"x\", 'Rank Wkst'!IF15,'Rank Wkst'!HN15)","v":""},{"$f":"IF($Z$5=\"x\", 'Rank Wkst'!IG15,'Rank Wkst'!HO15)","v":""},{"$f":"IF($Z$5=\"x\", 'Rank Wkst'!IH15,'Rank Wkst'!HP15)","v":""},{"$f":"IF($Z$5=\"x\", 'Rank Wkst'!II15,'Rank Wkst'!HQ15)","v":""},{"$f":"IF($Z$5=\"x\", 'Rank Wkst'!IJ15,'Rank Wkst'!HR15)","v":""},{"$f":"IF($Z$5=\"x\", 'Rank Wkst'!IK15,'Rank Wkst'!HS15)","v":""},{"$f":"IF($Z$5=\"x\", 'Rank Wkst'!IL15,'Rank Wkst'!HT15)","v":""},{"$f":"IF($Z$5=\"x\", 'Rank Wkst'!IM15,'Rank Wkst'!HU15)","v":""},{"$f":"IF($Z$5=\"x\", 'Rank Wkst'!IN15,'Rank Wkst'!HV15)","v":""},"/",{"$f":"IF($Z$5=\"x\", 'Rank Wkst'!IO15,'Rank Wkst'!HW15)","v":""},{"$f":"'Rank Wkst'!HX15","v":""},{"$f":"IF($Z$5=\"x\", 'Rank Wkst'!HZ15, 'Rank Wkst'!HG15)","v":""},{"$f":"IF($Z$5=\"x\", 'Rank Wkst'!ED15, 'Rank Wkst'!HH15)","v":""},null,null,{"$f":"IF(E19=\"\",\" \",'Rank Wkst'!BT64)","v":" "}]
[{"$f":"IF($Z$5=\"x\", 'Rank Wkst'!HZ16, 'Rank Wkst'!HG16)","v":""},{"$f":"IF($Z$5=\"x\", 'Rank Wkst'!ED16, 'Rank Wkst'!HH16)","v":""},{"$f":"IF($Z$5=\"x\", 'Rank Wkst'!EA16, 'Rank Wkst'!HI16)","v":""},null,{"$f":"IF($Z$5=\"x\", 'Rank Wkst'!IB16,'Rank Wkst'!HJ16)","v":""},{"$f":"IF($Z$5=\"x\", 'Rank Wkst'!IC16,'Rank Wkst'!HK16)","v":""},{"$f":"IF($Z$5=\"x\", 'Rank Wkst'!ID16,'Rank Wkst'!HL16)","v":""},{"$f":"IF($Z$5=\"x\", 'Rank Wkst'!IE16,'Rank Wkst'!HM16)","v":""},{"$f":"IF($Z$5=\"x\", 'Rank Wkst'!IF16,'Rank Wkst'!HN16)","v":""},{"$f":"IF($Z$5=\"x\", 'Rank Wkst'!IG16,'Rank Wkst'!HO16)","v":""},{"$f":"IF($Z$5=\"x\", 'Rank Wkst'!IH16,'Rank Wkst'!HP16)","v":""},{"$f":"IF($Z$5=\"x\", 'Rank Wkst'!II16,'Rank Wkst'!HQ16)","v":""},{"$f":"IF($Z$5=\"x\", 'Rank Wkst'!IJ16,'Rank Wkst'!HR16)","v":""},{"$f":"IF($Z$5=\"x\", 'Rank Wkst'!IK16,'Rank Wkst'!HS16)","v":""},{"$f":"IF($Z$5=\"x\", 'Rank Wkst'!IL16,'Rank Wkst'!HT16)","v":""},{"$f":"IF($Z$5=\"x\", 'Rank Wkst'!IM16,'Rank Wkst'!HU16)","v":""},{"$f":"IF($Z$5=\"x\", 'Rank Wkst'!IN16,'Rank Wkst'!HV16)","v":""},"/",{"$f":"IF($Z$5=\"x\", 'Rank Wkst'!IO16,'Rank Wkst'!HW16)","v":""},{"$f":"'Rank Wkst'!HX16","v":""},{"$f":"IF($Z$5=\"x\", 'Rank Wkst'!HZ16, 'Rank Wkst'!HG16)","v":""},{"$f":"IF($Z$5=\"x\", 'Rank Wkst'!ED16, 'Rank Wkst'!HH16)","v":""},null,null,{"$f":"IF(E20=\"\",\" \",'Rank Wkst'!BT65)","v":" "}]
[{"$f":"IF($Z$5=\"x\", 'Rank Wkst'!HZ17, 'Rank Wkst'!HG17)","v":""},{"$f":"IF($Z$5=\"x\", 'Rank Wkst'!ED17, 'Rank Wkst'!HH17)","v":""},{"$f":"IF($Z$5=\"x\", 'Rank Wkst'!EA17, 'Rank Wkst'!HI17)","v":""},null,{"$f":"IF($Z$5=\"x\", 'Rank Wkst'!IB17,'Rank Wkst'!HJ17)","v":""},{"$f":"IF($Z$5=\"x\", 'Rank Wkst'!IC17,'Rank Wkst'!HK17)","v":""},{"$f":"IF($Z$5=\"x\", 'Rank Wkst'!ID17,'Rank Wkst'!HL17)","v":""},{"$f":"IF($Z$5=\"x\", 'Rank Wkst'!IE17,'Rank Wkst'!HM17)","v":""},{"$f":"IF($Z$5=\"x\", 'Rank Wkst'!IF17,'Rank Wkst'!HN17)","v":""},{"$f":"IF($Z$5=\"x\", 'Rank Wkst'!IG17,'Rank Wkst'!HO17)","v":""},{"$f":"IF($Z$5=\"x\", 'Rank Wkst'!IH17,'Rank Wkst'!HP17)","v":""},{"$f":"IF($Z$5=\"x\", 'Rank Wkst'!II17,'Rank Wkst'!HQ17)","v":""},{"$f":"IF($Z$5=\"x\", 'Rank Wkst'!IJ17,'Rank Wkst'!HR17)","v":""},{"$f":"IF($Z$5=\"x\", 'Rank Wkst'!IK17,'Rank Wkst'!HS17)","v":""},{"$f":"IF($Z$5=\"x\", 'Rank Wkst'!IL17,'Rank Wkst'!HT17)","v":""},{"$f":"IF($Z$5=\"x\", 'Rank Wkst'!IM17,'Rank Wkst'!HU17)","v":""},{"$f":"IF($Z$5=\"x\", 'Rank Wkst'!IN17,'Rank Wkst'!HV17)","v":""},"/",{"$f":"IF($Z$5=\"x\", 'Rank Wkst'!IO17,'Rank Wkst'!HW17)","v":""},{"$f":"'Rank Wkst'!HX17","v":""},{"$f":"IF($Z$5=\"x\", 'Rank Wkst'!HZ17, 'Rank Wkst'!HG17)","v":""},{"$f":"IF($Z$5=\"x\", 'Rank Wkst'!ED17, 'Rank Wkst'!HH17)","v":""},null,null,{"$f":"IF(E21=\"\",\" \",'Rank Wkst'!BT66)","v":" "}]
[{"$f":"IF($Z$5=\"x\", 'Rank Wkst'!HZ18, 'Rank Wkst'!HG18)","v":""},{"$f":"IF($Z$5=\"x\", 'Rank Wkst'!ED18, 'Rank Wkst'!HH18)","v":""},{"$f":"IF($Z$5=\"x\", 'Rank Wkst'!EA18, 'Rank Wkst'!HI18)","v":""},null,{"$f":"IF($Z$5=\"x\", 'Rank Wkst'!IB18,'Rank Wkst'!HJ18)","v":""},{"$f":"IF($Z$5=\"x\", 'Rank Wkst'!IC18,'Rank Wkst'!HK18)","v":""},{"$f":"IF($Z$5=\"x\", 'Rank Wkst'!ID18,'Rank Wkst'!HL18)","v":""},{"$f":"IF($Z$5=\"x\", 'Rank Wkst'!IE18,'Rank Wkst'!HM18)","v":""},{"$f":"IF($Z$5=\"x\", 'Rank Wkst'!IF18,'Rank Wkst'!HN18)","v":""},{"$f":"IF($Z$5=\"x\", 'Rank Wkst'!IG18,'Rank Wkst'!HO18)","v":""},{"$f":"IF($Z$5=\"x\", 'Rank Wkst'!IH18,'Rank Wkst'!HP18)","v":""},{"$f":"IF($Z$5=\"x\", 'Rank Wkst'!II18,'Rank Wkst'!HQ18)","v":""},{"$f":"IF($Z$5=\"x\", 'Rank Wkst'!IJ18,'Rank Wkst'!HR18)","v":""},{"$f":"IF($Z$5=\"x\", 'Rank Wkst'!IK18,'Rank Wkst'!HS18)","v":""},{"$f":"IF($Z$5=\"x\", 'Rank Wkst'!IL18,'Rank Wkst'!HT18)","v":""},{"$f":"IF($Z$5=\"x\", 'Rank Wkst'!IM18,'Rank Wkst'!HU18)","v":""},{"$f":"IF($Z$5=\"x\", 'Rank Wkst'!IN18,'Rank Wkst'!HV18)","v":""},"/",{"$f":"IF($Z$5=\"x\", 'Rank Wkst'!IO18,'Rank Wkst'!HW18)","v":""},{"$f":"'Rank Wkst'!HX18","v":""},{"$f":"IF($Z$5=\"x\", 'Rank Wkst'!HZ18, 'Rank Wkst'!HG18)","v":""},{"$f":"IF($Z$5=\"x\", 'Rank Wkst'!ED18, 'Rank Wkst'!HH18)","v":""},null,null,{"$f":"IF(E22=\"\",\" \",'Rank Wkst'!BT67)","v":" "}]
[{"$f":"IF($Z$5=\"x\", 'Rank Wkst'!HZ19, 'Rank Wkst'!HG19)","v":""},{"$f":"IF($Z$5=\"x\", 'Rank Wkst'!ED19, 'Rank Wkst'!HH19)","v":""},{"$f":"IF($Z$5=\"x\", 'Rank Wkst'!EA19, 'Rank Wkst'!HI19)","v":""},null,{"$f":"IF($Z$5=\"x\", 'Rank Wkst'!IB19,'Rank Wkst'!HJ19)","v":""},{"$f":"IF($Z$5=\"x\", 'Rank Wkst'!IC19,'Rank Wkst'!HK19)","v":""},{"$f":"IF($Z$5=\"x\", 'Rank Wkst'!ID19,'Rank Wkst'!HL19)","v":""},{"$f":"IF($Z$5=\"x\", 'Rank Wkst'!IE19,'Rank Wkst'!HM19)","v":""},{"$f":"IF($Z$5=\"x\", 'Rank Wkst'!IF19,'Rank Wkst'!HN19)","v":""},{"$f":"IF($Z$5=\"x\", 'Rank Wkst'!IG19,'Rank Wkst'!HO19)","v":""},{"$f":"IF($Z$5=\"x\", 'Rank Wkst'!IH19,'Rank Wkst'!HP19)","v":""},{"$f":"IF($Z$5=\"x\", 'Rank Wkst'!II19,'Rank Wkst'!HQ19)","v":""},{"$f":"IF($Z$5=\"x\", 'Rank Wkst'!IJ19,'Rank Wkst'!HR19)","v":""},{"$f":"IF($Z$5=\"x\", 'Rank Wkst'!IK19,'Rank Wkst'!HS19)","v":""},{"$f":"IF($Z$5=\"x\", 'Rank Wkst'!IL19,'Rank Wkst'!HT19)","v":""},{"$f":"IF($Z$5=\"x\", 'Rank Wkst'!IM19,'Rank Wkst'!HU19)","v":""},{"$f":"IF($Z$5=\"x\", 'Rank Wkst'!IN19,'Rank Wkst'!HV19)","v":""},"/",{"$f":"IF($Z$5=\"x\", 'Rank Wkst'!IO19,'Rank Wkst'!HW19)","v":""},{"$f":"'Rank Wkst'!HX19","v":""},{"$f":"IF($Z$5=\"x\", 'Rank Wkst'!HZ19, 'Rank Wkst'!HG19)","v":""},{"$f":"IF($Z$5=\"x\", 'Rank Wkst'!ED19, 'Rank Wkst'!HH19)","v":""},null,null,{"$f":"IF(E23=\"\",\" \",'Rank Wkst'!BT68)","v":" "}]
[{"$f":"IF($Z$5=\"x\", 'Rank Wkst'!HZ20, 'Rank Wkst'!HG20)","v":""},{"$f":"IF($Z$5=\"x\", 'Rank Wkst'!ED20, 'Rank Wkst'!HH20)","v":""},{"$f":"IF($Z$5=\"x\", 'Rank Wkst'!EA20, 'Rank Wkst'!HI20)","v":""},null,{"$f":"IF($Z$5=\"x\", 'Rank Wkst'!IB20,'Rank Wkst'!HJ20)","v":""},{"$f":"IF($Z$5=\"x\", 'Rank Wkst'!IC20,'Rank Wkst'!HK20)","v":""},{"$f":"IF($Z$5=\"x\", 'Rank Wkst'!ID20,'Rank Wkst'!HL20)","v":""},{"$f":"IF($Z$5=\"x\", 'Rank Wkst'!IE20,'Rank Wkst'!HM20)","v":""},{"$f":"IF($Z$5=\"x\", 'Rank Wkst'!IF20,'Rank Wkst'!HN20)","v":""},{"$f":"IF($Z$5=\"x\", 'Rank Wkst'!IG20,'Rank Wkst'!HO20)","v":""},{"$f":"IF($Z$5=\"x\", 'Rank Wkst'!IH20,'Rank Wkst'!HP20)","v":""},{"$f":"IF($Z$5=\"x\", 'Rank Wkst'!II20,'Rank Wkst'!HQ20)","v":""},{"$f":"IF($Z$5=\"x\", 'Rank Wkst'!IJ20,'Rank Wkst'!HR20)","v":""},{"$f":"IF($Z$5=\"x\", 'Rank Wkst'!IK20,'Rank Wkst'!HS20)","v":""},{"$f":"IF($Z$5=\"x\", 'Rank Wkst'!IL20,'Rank Wkst'!HT20)","v":""},{"$f":"IF($Z$5=\"x\", 'Rank Wkst'!IM20,'Rank Wkst'!HU20)","v":""},{"$f":"IF($Z$5=\"x\", 'Rank Wkst'!IN20,'Rank Wkst'!HV20)","v":""},"/",{"$f":"IF($Z$5=\"x\", 'Rank Wkst'!IO20,'Rank Wkst'!HW20)","v":""},{"$f":"'Rank Wkst'!HX20","v":""},{"$f":"IF($Z$5=\"x\", 'Rank Wkst'!HZ20, 'Rank Wkst'!HG20)","v":""},{"$f":"IF($Z$5=\"x\", 'Rank Wkst'!ED20, 'Rank Wkst'!HH20)","v":""},null,null,{"$f":"IF(E24=\"\",\" \",'Rank Wkst'!BT69)","v":" "}]
[{"$f":"IF($Z$5=\"x\", 'Rank Wkst'!HZ21, 'Rank Wkst'!HG21)","v":""},{"$f":"IF($Z$5=\"x\", 'Rank Wkst'!ED21, 'Rank Wkst'!HH21)","v":""},{"$f":"IF($Z$5=\"x\", 'Rank Wkst'!EA21, 'Rank Wkst'!HI21)","v":""},null,{"$f":"IF($Z$5=\"x\", 'Rank Wkst'!IB21,'Rank Wkst'!HJ21)","v":""},{"$f":"IF($Z$5=\"x\", 'Rank Wkst'!IC21,'Rank Wkst'!HK21)","v":""},{"$f":"IF($Z$5=\"x\", 'Rank Wkst'!ID21,'Rank Wkst'!HL21)","v":""},{"$f":"IF($Z$5=\"x\", 'Rank Wkst'!IE21,'Rank Wkst'!HM21)","v":""},{"$f":"IF($Z$5=\"x\", 'Rank Wkst'!IF21,'Rank Wkst'!HN21)","v":""},{"$f":"IF($Z$5=\"x\", 'Rank Wkst'!IG21,'Rank Wkst'!HO21)","v":""},{"$f":"IF($Z$5=\"x\", 'Rank Wkst'!IH21,'Rank Wkst'!HP21)","v":""},{"$f":"IF($Z$5=\"x\", 'Rank Wkst'!II21,'Rank Wkst'!HQ21)","v":""},{"$f":"IF($Z$5=\"x\", 'Rank Wkst'!IJ21,'Rank Wkst'!HR21)","v":""},{"$f":"IF($Z$5=\"x\", 'Rank Wkst'!IK21,'Rank Wkst'!HS21)","v":""},{"$f":"IF($Z$5=\"x\", 'Rank Wkst'!IL21,'Rank Wkst'!HT21)","v":""},{"$f":"IF($Z$5=\"x\", 'Rank Wkst'!IM21,'Rank Wkst'!HU21)","v":""},{"$f":"IF($Z$5=\"x\", 'Rank Wkst'!IN21,'Rank Wkst'!HV21)","v":""},"/",{"$f":"IF($Z$5=\"x\", 'Rank Wkst'!IO21,'Rank Wkst'!HW21)","v":""},{"$f":"'Rank Wkst'!HX21","v":""},{"$f":"IF($Z$5=\"x\", 'Rank Wkst'!HZ21, 'Rank Wkst'!HG21)","v":""},{"$f":"IF($Z$5=\"x\", 'Rank Wkst'!ED21, 'Rank Wkst'!HH21)","v":""},null,null,{"$f":"IF(E25=\"\",\" \",'Rank Wkst'!BT70)","v":" "}]
[{"$f":"IF($Z$5=\"x\", 'Rank Wkst'!HZ22, 'Rank Wkst'!HG22)","v":""},{"$f":"IF($Z$5=\"x\", 'Rank Wkst'!ED22, 'Rank Wkst'!HH22)","v":""},{"$f":"IF($Z$5=\"x\", 'Rank Wkst'!EA22, 'Rank Wkst'!HI22)","v":""},null,{"$f":"IF($Z$5=\"x\", 'Rank Wkst'!IB22,'Rank Wkst'!HJ22)","v":""},{"$f":"IF($Z$5=\"x\", 'Rank Wkst'!IC22,'Rank Wkst'!HK22)","v":""},{"$f":"IF($Z$5=\"x\", 'Rank Wkst'!ID22,'Rank Wkst'!HL22)","v":""},{"$f":"IF($Z$5=\"x\", 'Rank Wkst'!IE22,'Rank Wkst'!HM22)","v":""},{"$f":"IF($Z$5=\"x\", 'Rank Wkst'!IF22,'Rank Wkst'!HN22)","v":""},{"$f":"IF($Z$5=\"x\", 'Rank Wkst'!IG22,'Rank Wkst'!HO22)","v":""},{"$f":"IF($Z$5=\"x\", 'Rank Wkst'!IH22,'Rank Wkst'!HP22)","v":""},{"$f":"IF($Z$5=\"x\", 'Rank Wkst'!II22,'Rank Wkst'!HQ22)","v":""},{"$f":"IF($Z$5=\"x\", 'Rank Wkst'!IJ22,'Rank Wkst'!HR22)","v":""},{"$f":"IF($Z$5=\"x\", 'Rank Wkst'!IK22,'Rank Wkst'!HS22)","v":""},{"$f":"IF($Z$5=\"x\", 'Rank Wkst'!IL22,'Rank Wkst'!HT22)","v":""},{"$f":"IF($Z$5=\"x\", 'Rank Wkst'!IM22,'Rank Wkst'!HU22)","v":""},{"$f":"IF($Z$5=\"x\", 'Rank Wkst'!IN22,'Rank Wkst'!HV22)","v":""},"/",{"$f":"IF($Z$5=\"x\", 'Rank Wkst'!IO22,'Rank Wkst'!HW22)","v":""},{"$f":"'Rank Wkst'!HX22","v":""},{"$f":"IF($Z$5=\"x\", 'Rank Wkst'!HZ22, 'Rank Wkst'!HG22)","v":""},{"$f":"IF($Z$5=\"x\", 'Rank Wkst'!ED22, 'Rank Wkst'!HH22)","v":""},null,null,{"$f":"IF(E26=\"\",\" \",'Rank Wkst'!BT71)","v":" "}]
[{"$f":"IF($Z$5=\"x\", 'Rank Wkst'!HZ23, 'Rank Wkst'!HG23)","v":""},{"$f":"IF($Z$5=\"x\", 'Rank Wkst'!ED23, 'Rank Wkst'!HH23)","v":""},{"$f":"IF($Z$5=\"x\", 'Rank Wkst'!EA23, 'Rank Wkst'!HI23)","v":""},null,{"$f":"IF($Z$5=\"x\", 'Rank Wkst'!IB23,'Rank Wkst'!HJ23)","v":""},{"$f":"IF($Z$5=\"x\", 'Rank Wkst'!IC23,'Rank Wkst'!HK23)","v":""},{"$f":"IF($Z$5=\"x\", 'Rank Wkst'!ID23,'Rank Wkst'!HL23)","v":""},{"$f":"IF($Z$5=\"x\", 'Rank Wkst'!IE23,'Rank Wkst'!HM23)","v":""},{"$f":"IF($Z$5=\"x\", 'Rank Wkst'!IF23,'Rank Wkst'!HN23)","v":""},{"$f":"IF($Z$5=\"x\", 'Rank Wkst'!IG23,'Rank Wkst'!HO23)","v":""},{"$f":"IF($Z$5=\"x\", 'Rank Wkst'!IH23,'Rank Wkst'!HP23)","v":""},{"$f":"IF($Z$5=\"x\", 'Rank Wkst'!II23,'Rank Wkst'!HQ23)","v":""},{"$f":"IF($Z$5=\"x\", 'Rank Wkst'!IJ23,'Rank Wkst'!HR23)","v":""},{"$f":"IF($Z$5=\"x\", 'Rank Wkst'!IK23,'Rank Wkst'!HS23)","v":""},{"$f":"IF($Z$5=\"x\", 'Rank Wkst'!IL23,'Rank Wkst'!HT23)","v":""},{"$f":"IF($Z$5=\"x\", 'Rank Wkst'!IM23,'Rank Wkst'!HU23)","v":""},{"$f":"IF($Z$5=\"x\", 'Rank Wkst'!IN23,'Rank Wkst'!HV23)","v":""},"/",{"$f":"IF($Z$5=\"x\", 'Rank Wkst'!IO23,'Rank Wkst'!HW23)","v":""},{"$f":"'Rank Wkst'!HX23","v":""},{"$f":"IF($Z$5=\"x\", 'Rank Wkst'!HZ23, 'Rank Wkst'!HG23)","v":""},{"$f":"IF($Z$5=\"x\", 'Rank Wkst'!ED23, 'Rank Wkst'!HH23)","v":""},null,null,{"$f":"IF(E27=\"\",\" \",'Rank Wkst'!BT72)","v":" "}]
[{"$f":"IF($Z$5=\"x\", 'Rank Wkst'!HZ24, 'Rank Wkst'!HG24)","v":""},{"$f":"IF($Z$5=\"x\", 'Rank Wkst'!ED24, 'Rank Wkst'!HH24)","v":""},{"$f":"IF($Z$5=\"x\", 'Rank Wkst'!EA24, 'Rank Wkst'!HI24)","v":""},null,{"$f":"IF($Z$5=\"x\", 'Rank Wkst'!IB24,'Rank Wkst'!HJ24)","v":""},{"$f":"IF($Z$5=\"x\", 'Rank Wkst'!IC24,'Rank Wkst'!HK24)","v":""},{"$f":"IF($Z$5=\"x\", 'Rank Wkst'!ID24,'Rank Wkst'!HL24)","v":""},{"$f":"IF($Z$5=\"x\", 'Rank Wkst'!IE24,'Rank Wkst'!HM24)","v":""},{"$f":"IF($Z$5=\"x\", 'Rank Wkst'!IF24,'Rank Wkst'!HN24)","v":""},{"$f":"IF($Z$5=\"x\", 'Rank Wkst'!IG24,'Rank Wkst'!HO24)","v":""},{"$f":"IF($Z$5=\"x\", 'Rank Wkst'!IH24,'Rank Wkst'!HP24)","v":""},{"$f":"IF($Z$5=\"x\", 'Rank Wkst'!II24,'Rank Wkst'!HQ24)","v":""},{"$f":"IF($Z$5=\"x\", 'Rank Wkst'!IJ24,'Rank Wkst'!HR24)","v":""},{"$f":"IF($Z$5=\"x\", 'Rank Wkst'!IK24,'Rank Wkst'!HS24)","v":""},{"$f":"IF($Z$5=\"x\", 'Rank Wkst'!IL24,'Rank Wkst'!HT24)","v":""},{"$f":"IF($Z$5=\"x\", 'Rank Wkst'!IM24,'Rank Wkst'!HU24)","v":""},{"$f":"IF($Z$5=\"x\", 'Rank Wkst'!IN24,'Rank Wkst'!HV24)","v":""},"/",{"$f":"IF($Z$5=\"x\", 'Rank Wkst'!IO24,'Rank Wkst'!HW24)","v":""},{"$f":"'Rank Wkst'!HX24","v":""},{"$f":"IF($Z$5=\"x\", 'Rank Wkst'!HZ24, 'Rank Wkst'!HG24)","v":""},{"$f":"IF($Z$5=\"x\", 'Rank Wkst'!ED24, 'Rank Wkst'!HH24)","v":""},null,null,{"$f":"IF(E28=\"\",\" \",'Rank Wkst'!BT73)","v":" "}]
[{"$f":"IF($Z$5=\"x\", 'Rank Wkst'!HZ25, 'Rank Wkst'!HG25)","v":""},{"$f":"IF($Z$5=\"x\", 'Rank Wkst'!ED25, 'Rank Wkst'!HH25)","v":""},{"$f":"IF($Z$5=\"x\", 'Rank Wkst'!EA25, 'Rank Wkst'!HI25)","v":""},null,{"$f":"IF($Z$5=\"x\", 'Rank Wkst'!IB25,'Rank Wkst'!HJ25)","v":""},{"$f":"IF($Z$5=\"x\", 'Rank Wkst'!IC25,'Rank Wkst'!HK25)","v":""},{"$f":"IF($Z$5=\"x\", 'Rank Wkst'!ID25,'Rank Wkst'!HL25)","v":""},{"$f":"IF($Z$5=\"x\", 'Rank Wkst'!IE25,'Rank Wkst'!HM25)","v":""},{"$f":"IF($Z$5=\"x\", 'Rank Wkst'!IF25,'Rank Wkst'!HN25)","v":""},{"$f":"IF($Z$5=\"x\", 'Rank Wkst'!IG25,'Rank Wkst'!HO25)","v":""},{"$f":"IF($Z$5=\"x\", 'Rank Wkst'!IH25,'Rank Wkst'!HP25)","v":""},{"$f":"IF($Z$5=\"x\", 'Rank Wkst'!II25,'Rank Wkst'!HQ25)","v":""},{"$f":"IF($Z$5=\"x\", 'Rank Wkst'!IJ25,'Rank Wkst'!HR25)","v":""},{"$f":"IF($Z$5=\"x\", 'Rank Wkst'!IK25,'Rank Wkst'!HS25)","v":""},{"$f":"IF($Z$5=\"x\", 'Rank Wkst'!IL25,'Rank Wkst'!HT25)","v":""},{"$f":"IF($Z$5=\"x\", 'Rank Wkst'!IM25,'Rank Wkst'!HU25)","v":""},{"$f":"IF($Z$5=\"x\", 'Rank Wkst'!IN25,'Rank Wkst'!HV25)","v":""},"/",{"$f":"IF($Z$5=\"x\", 'Rank Wkst'!IO25,'Rank Wkst'!HW25)","v":""},{"$f":"'Rank Wkst'!HX25","v":""},{"$f":"IF($Z$5=\"x\", 'Rank Wkst'!HZ25, 'Rank Wkst'!HG25)","v":""},{"$f":"IF($Z$5=\"x\", 'Rank Wkst'!ED25, 'Rank Wkst'!HH25)","v":""},null,null,{"$f":"IF(E29=\"\",\" \",'Rank Wkst'!BT74)","v":" "}]
[{"$f":"IF($Z$5=\"x\", 'Rank Wkst'!HZ26, 'Rank Wkst'!HG26)","v":""},{"$f":"IF($Z$5=\"x\", 'Rank Wkst'!ED26, 'Rank Wkst'!HH26)","v":""},{"$f":"IF($Z$5=\"x\", 'Rank Wkst'!EA26, 'Rank Wkst'!HI26)","v":""},null,{"$f":"IF($Z$5=\"x\", 'Rank Wkst'!IB26,'Rank Wkst'!HJ26)","v":""},{"$f":"IF($Z$5=\"x\", 'Rank Wkst'!IC26,'Rank Wkst'!HK26)","v":""},{"$f":"IF($Z$5=\"x\", 'Rank Wkst'!ID26,'Rank Wkst'!HL26)","v":""},{"$f":"IF($Z$5=\"x\", 'Rank Wkst'!IE26,'Rank Wkst'!HM26)","v":""},{"$f":"IF($Z$5=\"x\", 'Rank Wkst'!IF26,'Rank Wkst'!HN26)","v":""},{"$f":"IF($Z$5=\"x\", 'Rank Wkst'!IG26,'Rank Wkst'!HO26)","v":""},{"$f":"IF($Z$5=\"x\", 'Rank Wkst'!IH26,'Rank Wkst'!HP26)","v":""},{"$f":"IF($Z$5=\"x\", 'Rank Wkst'!II26,'Rank Wkst'!HQ26)","v":""},{"$f":"IF($Z$5=\"x\", 'Rank Wkst'!IJ26,'Rank Wkst'!HR26)","v":""},{"$f":"IF($Z$5=\"x\", 'Rank Wkst'!IK26,'Rank Wkst'!HS26)","v":""},{"$f":"IF($Z$5=\"x\", 'Rank Wkst'!IL26,'Rank Wkst'!HT26)","v":""},{"$f":"IF($Z$5=\"x\", 'Rank Wkst'!IM26,'Rank Wkst'!HU26)","v":""},{"$f":"IF($Z$5=\"x\", 'Rank Wkst'!IN26,'Rank Wkst'!HV26)","v":""},"/",{"$f":"IF($Z$5=\"x\", 'Rank Wkst'!IO26,'Rank Wkst'!HW26)","v":""},{"$f":"'Rank Wkst'!HX26","v":""},{"$f":"IF($Z$5=\"x\", 'Rank Wkst'!HZ26, 'Rank Wkst'!HG26)","v":""},{"$f":"IF($Z$5=\"x\", 'Rank Wkst'!ED26, 'Rank Wkst'!HH26)","v":""},null,null,{"$f":"IF(E30=\"\",\" \",'Rank Wkst'!BT75)","v":" "}]
[{"$f":"IF($Z$5=\"x\", 'Rank Wkst'!HZ27, 'Rank Wkst'!HG27)","v":""},{"$f":"IF($Z$5=\"x\", 'Rank Wkst'!ED27, 'Rank Wkst'!HH27)","v":""},{"$f":"IF($Z$5=\"x\", 'Rank Wkst'!EA27, 'Rank Wkst'!HI27)","v":""},null,{"$f":"IF($Z$5=\"x\", 'Rank Wkst'!IB27,'Rank Wkst'!HJ27)","v":""},{"$f":"IF($Z$5=\"x\", 'Rank Wkst'!IC27,'Rank Wkst'!HK27)","v":""},{"$f":"IF($Z$5=\"x\", 'Rank Wkst'!ID27,'Rank Wkst'!HL27)","v":""},{"$f":"IF($Z$5=\"x\", 'Rank Wkst'!IE27,'Rank Wkst'!HM27)","v":""},{"$f":"IF($Z$5=\"x\", 'Rank Wkst'!IF27,'Rank Wkst'!HN27)","v":""},{"$f":"IF($Z$5=\"x\", 'Rank Wkst'!IG27,'Rank Wkst'!HO27)","v":""},{"$f":"IF($Z$5=\"x\", 'Rank Wkst'!IH27,'Rank Wkst'!HP27)","v":""},{"$f":"IF($Z$5=\"x\", 'Rank Wkst'!II27,'Rank Wkst'!HQ27)","v":""},{"$f":"IF($Z$5=\"x\", 'Rank Wkst'!IJ27,'Rank Wkst'!HR27)","v":""},{"$f":"IF($Z$5=\"x\", 'Rank Wkst'!IK27,'Rank Wkst'!HS27)","v":""},{"$f":"IF($Z$5=\"x\", 'Rank Wkst'!IL27,'Rank Wkst'!HT27)","v":""},{"$f":"IF($Z$5=\"x\", 'Rank Wkst'!IM27,'Rank Wkst'!HU27)","v":""},{"$f":"IF($Z$5=\"x\", 'Rank Wkst'!IN27,'Rank Wkst'!HV27)","v":""},"/",{"$f":"IF($Z$5=\"x\", 'Rank Wkst'!IO27,'Rank Wkst'!HW27)","v":""},{"$f":"'Rank Wkst'!HX27","v":""},{"$f":"IF($Z$5=\"x\", 'Rank Wkst'!HZ27, 'Rank Wkst'!HG27)","v":""},{"$f":"IF($Z$5=\"x\", 'Rank Wkst'!ED27, 'Rank Wkst'!HH27)","v":""},null,null,{"$f":"IF(E31=\"\",\" \",'Rank Wkst'!BT76)","v":" "}]
[{"$f":"IF($Z$5=\"x\", 'Rank Wkst'!HZ28, 'Rank Wkst'!HG28)","v":""},{"$f":"IF($Z$5=\"x\", 'Rank Wkst'!ED28, 'Rank Wkst'!HH28)","v":""},{"$f":"IF($Z$5=\"x\", 'Rank Wkst'!EA28, 'Rank Wkst'!HI28)","v":""},null,{"$f":"IF($Z$5=\"x\", 'Rank Wkst'!IB28,'Rank Wkst'!HJ28)","v":""},{"$f":"IF($Z$5=\"x\", 'Rank Wkst'!IC28,'Rank Wkst'!HK28)","v":""},{"$f":"IF($Z$5=\"x\", 'Rank Wkst'!ID28,'Rank Wkst'!HL28)","v":""},{"$f":"IF($Z$5=\"x\", 'Rank Wkst'!IE28,'Rank Wkst'!HM28)","v":""},{"$f":"IF($Z$5=\"x\", 'Rank Wkst'!IF28,'Rank Wkst'!HN28)","v":""},{"$f":"IF($Z$5=\"x\", 'Rank Wkst'!IG28,'Rank Wkst'!HO28)","v":""},{"$f":"IF($Z$5=\"x\", 'Rank Wkst'!IH28,'Rank Wkst'!HP28)","v":""},{"$f":"IF($Z$5=\"x\", 'Rank Wkst'!II28,'Rank Wkst'!HQ28)","v":""},{"$f":"IF($Z$5=\"x\", 'Rank Wkst'!IJ28,'Rank Wkst'!HR28)","v":""},{"$f":"IF($Z$5=\"x\", 'Rank Wkst'!IK28,'Rank Wkst'!HS28)","v":""},{"$f":"IF($Z$5=\"x\", 'Rank Wkst'!IL28,'Rank Wkst'!HT28)","v":""},{"$f":"IF($Z$5=\"x\", 'Rank Wkst'!IM28,'Rank Wkst'!HU28)","v":""},{"$f":"IF($Z$5=\"x\", 'Rank Wkst'!IN28,'Rank Wkst'!HV28)","v":""},"/",{"$f":"IF($Z$5=\"x\", 'Rank Wkst'!IO28,'Rank Wkst'!HW28)","v":""},{"$f":"'Rank Wkst'!HX28","v":""},{"$f":"IF($Z$5=\"x\", 'Rank Wkst'!HZ28, 'Rank Wkst'!HG28)","v":""},{"$f":"IF($Z$5=\"x\", 'Rank Wkst'!ED28, 'Rank Wkst'!HH28)","v":""},null,null,{"$f":"IF(E32=\"\",\" \",'Rank Wkst'!BT77)","v":" "}]
[{"$f":"IF($Z$5=\"x\", 'Rank Wkst'!HZ29, 'Rank Wkst'!HG29)","v":""},{"$f":"IF($Z$5=\"x\", 'Rank Wkst'!ED29, 'Rank Wkst'!HH29)","v":""},{"$f":"IF($Z$5=\"x\", 'Rank Wkst'!EA29, 'Rank Wkst'!HI29)","v":""},null,{"$f":"IF($Z$5=\"x\", 'Rank Wkst'!IB29,'Rank Wkst'!HJ29)","v":""},{"$f":"IF($Z$5=\"x\", 'Rank Wkst'!IC29,'Rank Wkst'!HK29)","v":""},{"$f":"IF($Z$5=\"x\", 'Rank Wkst'!ID29,'Rank Wkst'!HL29)","v":""},{"$f":"IF($Z$5=\"x\", 'Rank Wkst'!IE29,'Rank Wkst'!HM29)","v":""},{"$f":"IF($Z$5=\"x\", 'Rank Wkst'!IF29,'Rank Wkst'!HN29)","v":""},{"$f":"IF($Z$5=\"x\", 'Rank Wkst'!IG29,'Rank Wkst'!HO29)","v":""},{"$f":"IF($Z$5=\"x\", 'Rank Wkst'!IH29,'Rank Wkst'!HP29)","v":""},{"$f":"IF($Z$5=\"x\", 'Rank Wkst'!II29,'Rank Wkst'!HQ29)","v":""},{"$f":"IF($Z$5=\"x\", 'Rank Wkst'!IJ29,'Rank Wkst'!HR29)","v":""},{"$f":"IF($Z$5=\"x\", 'Rank Wkst'!IK29,'Rank Wkst'!HS29)","v":""},{"$f":"IF($Z$5=\"x\", 'Rank Wkst'!IL29,'Rank Wkst'!HT29)","v":""},{"$f":"IF($Z$5=\"x\", 'Rank Wkst'!IM29,'Rank Wkst'!HU29)","v":""},{"$f":"IF($Z$5=\"x\", 'Rank Wkst'!IN29,'Rank Wkst'!HV29)","v":""},"/",{"$f":"IF($Z$5=\"x\", 'Rank Wkst'!IO29,'Rank Wkst'!HW29)","v":""},{"$f":"'Rank Wkst'!HX29","v":""},{"$f":"IF($Z$5=\"x\", 'Rank Wkst'!HZ29, 'Rank Wkst'!HG29)","v":""},{"$f":"IF($Z$5=\"x\", 'Rank Wkst'!ED29, 'Rank Wkst'!HH29)","v":""},null,null,{"$f":"IF(E33=\"\",\" \",'Rank Wkst'!BT78)","v":" "}]
[{"$f":"IF($Z$5=\"x\", 'Rank Wkst'!HZ30, 'Rank Wkst'!HG30)","v":""},{"$f":"IF($Z$5=\"x\", 'Rank Wkst'!ED30, 'Rank Wkst'!HH30)","v":""},{"$f":"IF($Z$5=\"x\", 'Rank Wkst'!EA30, 'Rank Wkst'!HI30)","v":""},null,{"$f":"IF($Z$5=\"x\", 'Rank Wkst'!IB30,'Rank Wkst'!HJ30)","v":""},{"$f":"IF($Z$5=\"x\", 'Rank Wkst'!IC30,'Rank Wkst'!HK30)","v":""},{"$f":"IF($Z$5=\"x\", 'Rank Wkst'!ID30,'Rank Wkst'!HL30)","v":""},{"$f":"IF($Z$5=\"x\", 'Rank Wkst'!IE30,'Rank Wkst'!HM30)","v":""},{"$f":"IF($Z$5=\"x\", 'Rank Wkst'!IF30,'Rank Wkst'!HN30)","v":""},{"$f":"IF($Z$5=\"x\", 'Rank Wkst'!IG30,'Rank Wkst'!HO30)","v":""},{"$f":"IF($Z$5=\"x\", 'Rank Wkst'!IH30,'Rank Wkst'!HP30)","v":""},{"$f":"IF($Z$5=\"x\", 'Rank Wkst'!II30,'Rank Wkst'!HQ30)","v":""},{"$f":"IF($Z$5=\"x\", 'Rank Wkst'!IJ30,'Rank Wkst'!HR30)","v":""},{"$f":"IF($Z$5=\"x\", 'Rank Wkst'!IK30,'Rank Wkst'!HS30)","v":""},{"$f":"IF($Z$5=\"x\", 'Rank Wkst'!IL30,'Rank Wkst'!HT30)","v":""},{"$f":"IF($Z$5=\"x\", 'Rank Wkst'!IM30,'Rank Wkst'!HU30)","v":""},{"$f":"IF($Z$5=\"x\", 'Rank Wkst'!IN30,'Rank Wkst'!HV30)","v":""},"/",{"$f":"IF($Z$5=\"x\", 'Rank Wkst'!IO30,'Rank Wkst'!HW30)","v":""},{"$f":"'Rank Wkst'!HX30","v":""},{"$f":"IF($Z$5=\"x\", 'Rank Wkst'!HZ30, 'Rank Wkst'!HG30)","v":""},{"$f":"IF($Z$5=\"x\", 'Rank Wkst'!ED30, 'Rank Wkst'!HH30)","v":""},null,null,{"$f":"IF(E34=\"\",\" \",'Rank Wkst'!BT79)","v":" "}]
[{"$f":"IF($Z$5=\"x\", 'Rank Wkst'!HZ31, 'Rank Wkst'!HG31)","v":""},{"$f":"IF($Z$5=\"x\", 'Rank Wkst'!ED31, 'Rank Wkst'!HH31)","v":""},{"$f":"IF($Z$5=\"x\", 'Rank Wkst'!EA31, 'Rank Wkst'!HI31)","v":""},null,{"$f":"IF($Z$5=\"x\", 'Rank Wkst'!IB31,'Rank Wkst'!HJ31)","v":""},{"$f":"IF($Z$5=\"x\", 'Rank Wkst'!IC31,'Rank Wkst'!HK31)","v":""},{"$f":"IF($Z$5=\"x\", 'Rank Wkst'!ID31,'Rank Wkst'!HL31)","v":""},{"$f":"IF($Z$5=\"x\", 'Rank Wkst'!IE31,'Rank Wkst'!HM31)","v":""},{"$f":"IF($Z$5=\"x\", 'Rank Wkst'!IF31,'Rank Wkst'!HN31)","v":""},{"$f":"IF($Z$5=\"x\", 'Rank Wkst'!IG31,'Rank Wkst'!HO31)","v":""},{"$f":"IF($Z$5=\"x\", 'Rank Wkst'!IH31,'Rank Wkst'!HP31)","v":""},{"$f":"IF($Z$5=\"x\", 'Rank Wkst'!II31,'Rank Wkst'!HQ31)","v":""},{"$f":"IF($Z$5=\"x\", 'Rank Wkst'!IJ31,'Rank Wkst'!HR31)","v":""},{"$f":"IF($Z$5=\"x\", 'Rank Wkst'!IK31,'Rank Wkst'!HS31)","v":""},{"$f":"IF($Z$5=\"x\", 'Rank Wkst'!IL31,'Rank Wkst'!HT31)","v":""},{"$f":"IF($Z$5=\"x\", 'Rank Wkst'!IM31,'Rank Wkst'!HU31)","v":""},{"$f":"IF($Z$5=\"x\", 'Rank Wkst'!IN31,'Rank Wkst'!HV31)","v":""},"/",{"$f":"IF($Z$5=\"x\", 'Rank Wkst'!IO31,'Rank Wkst'!HW31)","v":""},{"$f":"'Rank Wkst'!HX31","v":""},{"$f":"IF($Z$5=\"x\", 'Rank Wkst'!HZ31, 'Rank Wkst'!HG31)","v":""},{"$f":"IF($Z$5=\"x\", 'Rank Wkst'!ED31, 'Rank Wkst'!HH31)","v":""},null,null,{"$f":"IF(E35=\"\",\" \",'Rank Wkst'!BT80)","v":" "}]

{"sheet":"Team1","index":5,"n_rows":25,"n_cols":17,"rows_kept":25,"cut":false,"hidden":false,"merged":[[19,1,19,2],[17,1,17,2],[12,1,12,2],[9,1,9,2],[15,1,15,2],[6,14,7,14],[6,0,6,2],[7,0,7,2],[8,0,9,0],[20,1,20,2],[11,1,11,2],[8,1,8,2],[14,1,14,2],[13,1,13,2],[12,0,14,0],[15,0,16,0],[10,1,10,2],[16,1,16,2],[10,0,11,0],[0,0,0,16],[1,0,1,16],[3,2,3,7],[3,8,3,11],[3,12,3,16],[4,8,4,11],[4,12,4,16],[4,2,4,7],[24,3,24,4],[24,8,24,9],[6,15,7,16],[6,12,7,13],[6,11,7,11],[22,3,22,4],[22,8,22,9],[23,3,23,4],[23,8,23,9]]}
["Minnesota State High School League Dance Team Competition"]
["Jazz Judges Recap Sheet"]
[]
[null,"School:",{"$f":"IF('Ranking Sheet'!B12=0, \"\", 'Ranking Sheet'!B12)","v":""},null,null,null,null,null,"Class:",null,null,null,{"$f":"IF(Class=0, \"\", Class)","v":""}]
[null,"Meet Site:",{"$f":"IF(Site=0, \"\", Site)","v":""},null,null,null,null,null,"Meet Date:",null,null,null,{"$f":"IF(DATE=0, \"\", DATE)","v":""}]
[]
["Judge's Initials → ",null,null,{"$f":"IF('Ranking Sheet'!D10=0, \"\", 'Ranking Sheet'!D10)","v":""},{"$f":"IF('Ranking Sheet'!F10=0, \"\", 'Ranking Sheet'!F10)","v":""},{"$f":"IF('Ranking Sheet'!H10=0, \"\", 'Ranking Sheet'!H10)","v":""},{"$f":"IF('Ranking Sheet'!J10=0, \"\", 'Ranking Sheet'!J10)","v":""},{"$f":"IF('Ranking Sheet'!L10=0, \"\", 'Ranking Sheet'!L10)","v":""},{"$f":"IF('Ranking Sheet'!N10=0, \"\", 'Ranking Sheet'!N10)","v":""},{"$f":"IF('Ranking Sheet'!P10=0, \"\", 'Ranking Sheet'!P10)","v":""},{"$f":"IF('Ranking Sheet'!R10=0, \"\", 'Ranking Sheet'!R10)","v":""},"Category Total Points","Total Points Possible",null,"Subtotal Points","Subtotal Points Possible"]
["Category",null,null,1,2,3,4,5,6,7,8]
["SKILLS","Technique of Turns",null,null,null,null,null,null,null,null,null,{"$f":"IF(D9=0, \"\", SUM(D9:K9))","v":""},"/",{"$f":"IF(D9=\"\", \"\", IF(K9=0, 70, 80))","v":""}]
[null,"Technique of Leaps & Jumps",null,null,null,null,null,null,null,null,null,{"$f":"IF(D10=0, \"\", SUM(D10:K10))","v":""},"/",{"$f":"IF(D10=\"\", \"\", IF(K10=0, 70, 80))","v":""},{"$f":"IF(D9=0, \"\", SUM(D9:K10))","v":""},"/",{"$f":"IF(D9=\"\", \"\", IF(K9=0, 140, 160))","v":""}]
["CHOREOGRAPHY","Creativity",null,null,null,null,null,null,null,null,null,{"$f":"IF(D11=0, \"\", SUM(D11:K11))","v":""},"/",""]
[null,"Visual Effectiveness",null,null,null,null,null,null,null,null,null,"","/","",{"$f":"IF(D11=0, \"\", SUM(D11:K12))","v":""},"/",{"$f":"IF(D11=\"\", \"\", IF(K11=0, 140, 160))","v":""}]
["DIFFICULTY","Diffuculty of Routine Choreography",null,null,null,null,null,null,null,null,null,"","/",""]
[null,"Difficulty of Formations and Transitions",null,null,null,null,null,null,null,null,null,"","/",""]
[null,"Difficulty of Skills",null,null,null,null,null,null,null,null,null,"","/","",{"$f":"IF(D13=0, \"\", SUM(D13:K15))","v":""},"/",{"$f":"IF(D13=\"\", \"\", IF(K13=0, 210, 240))","v":""}]
["EXECUTION","Placement & Control",null,null,null,null,null,null,null,null,null,"","/",""]
[null,"Degree of Accuracy",null,null,null,null,null,null,null,null,null,"","/","",{"$f":"IF(D16=0, \"\", SUM(D16:K17))","v":""},"/",{"$f":"IF(D16=\"\", \"\", IF(K16=0, 140, 160))","v":""}]
["R.E.","Routine Effectiveness",null,null,null,null,null,null,null,null,null,"","/","",{"$f":"IF(D18=0, \"\", SUM(D18:K18))","v":""},"/",{"$f":"IF(D18=\"\", \"\", IF(K18=0, 70, 80))","v":""}]
[null,"SUB TOTALS",null,{"$f":"D9+D10+D11+D12+D13+D14+D15+D16+D17+D18","v":0},{"$f":"E9+E10+E11+E12+E13+E14+E15+E16+E17+E18","v":0},0,0,0,0,0,0,{"$f":"IF(D9=0, \"\", SUM(D19:K19))","v":""},"/",{"$f":"IF(D9=\"\", \"\", SUM(N9:N18))","v":""},{"$f":"IF(D9=0, \"\", SUM(O9:O18))","v":""},"/",{"$f":"IF(D9=\"\", \"\", SUM(Q9:Q18))","v":""}]
[null,"DEDUCTIONS \nEnter as a negative number i.e. -3 or DQ",null,null,null,null,null,null,null,null,null,{"$f":"IF(D20=\"\", \"\", IF(D20=\"DQ\",\"DQ\",SUM(D20:K20)))","v":""},null,null,{"$f":"IF(D20=\"\", \"\", IF(D20=\"DQ\",\"DQ\",SUM(D20:K20)))","v":""}]
[null,"TOTALS",null,{"$f":"IF(D20=\"DQ\", \"DQ\",SUM(D19+D20))","v":0},0,0,0,0,0,{"$f":"IF(J20=\"DQ\", \"DQ\",SUM(J19+J20))","v":0},{"$f":"IF(K20=\"DQ\", \"DQ\",SUM(K19+K20))","v":0},{"$f":"IF(D9=0, \"\", IF(D20=\"DQ\",\"DQ\",SUM(D21:K21)))","v":""},"/",{"$f":"IF(D9=\"\", \"\", SUM(N9:N18))","v":""},{"$f":"IF(D9=0, \"\", IF(D20=\"DQ\",\"DQ\",SUM(O19:O20)))","v":""},"/",{"$f":"IF(D9=\"\", \"\", SUM(Q9:Q18))","v":""}]
[]
[null,"KC/T #1","Time:",null,null,null,"Kick Count:",null,null,null,null,null,"# Comp:"]
[null,"KC/T #2","Time:",null,null,null,"Kick Count:",null,null,null,null,null,"# Comp:"]
[null,"KC/T #3","Time:",null,null,null,"Kick Count:",null,null,null,null,null,"# Comp:"]

{"sheet":"Team2","index":6,"n_rows":25,"n_cols":17,"rows_kept":25,"cut":false,"hidden":false,"merged":[[10,0,11,0],[12,0,14,0],[8,0,9,0],[9,1,9,2],[13,1,13,2],[15,0,16,0],[11,1,11,2],[10,1,10,2],[16,1,16,2],[8,1,8,2],[0,0,0,16],[1,0,1,16],[3,2,3,7],[3,8,3,11],[3,12,3,16],[6,15,7,16],[6,11,7,11],[6,12,7,13],[6,0,6,2],[7,0,7,2],[4,8,4,11],[4,12,4,16],[4,2,4,7],[6,14,7,14],[19,1,19,2],[20,1,20,2],[15,1,15,2],[17,1,17,2],[23,3,23,4],[23,8,23,9],[24,3,24,4],[24,8,24,9],[12,1,12,2],[14,1,14,2],[22,3,22,4],[22,8,22,9]]}
["Minnesota State High School League Dance Team Competition"]
["Jazz Judges Recap Sheet"]
[]
[null,"School:",{"$f":"IF('Ranking Sheet'!B13=0, \"\", 'Ranking Sheet'!B13)","v":""},null,null,null,null,null,"Class:",null,null,null,{"$f":"IF(Class=0, \"\", Class)","v":""}]
[null,"Meet Site:",{"$f":"IF(Site=0, \"\", Site)","v":""},null,null,null,null,null,"Meet Date:",null,null,null,{"$f":"IF(DATE=0, \"\", DATE)","v":""}]
[]
["Judge's Initials → ",null,null,{"$f":"IF('Ranking Sheet'!D10=0, \"\", 'Ranking Sheet'!D10)","v":""},{"$f":"IF('Ranking Sheet'!F10=0, \"\", 'Ranking Sheet'!F10)","v":""},{"$f":"IF('Ranking Sheet'!H10=0, \"\", 'Ranking Sheet'!H10)","v":""},{"$f":"IF('Ranking Sheet'!J10=0, \"\", 'Ranking Sheet'!J10)","v":""},{"$f":"IF('Ranking Sheet'!L10=0, \"\", 'Ranking Sheet'!L10)","v":""},{"$f":"IF('Ranking Sheet'!N10=0, \"\", 'Ranking Sheet'!N10)","v":""},{"$f":"IF('Ranking Sheet'!P10=0, \"\", 'Ranking Sheet'!P10)","v":""},{"$f":"IF('Ranking Sheet'!R10=0, \"\", 'Ranking Sheet'!R10)","v":""},"Category Total Points","Total Points Possible",null,"Subtotal Points","Subtotal Points Possible"]
["Category",null,null,1,2,3,4,5,6,7,8]
["SKILLS","Technique of Turns",null,null,null,null,null,null,null,null,null,{"$f":"IF(D9=0, \"\", SUM(D9:K9))","v":""},"/",{"$f":"IF(D9=\"\", \"\", IF(K9=0, 70, 80))","v":""}]
[null,"Technique of Leaps & Jumps",null,null,null,null,null,null,null,null,null,{"$f":"IF(D10=0, \"\", SUM(D10:K10))","v":""},"/",{"$f":"IF(D10=\"\", \"\", IF(K10=0, 70, 80))","v":""},{"$f":"IF(D9=0, \"\", SUM(D9:K10))","v":""},"/",{"$f":"IF(D9=\"\", \"\", IF(K9=0, 140, 160))","v":""}]
["CHOREOGRAPHY","Creativity",null,null,null,null,null,null,null,null,null,{"$f":"IF(D11=0, \"\", SUM(D11:K11))","v":""},"/",""]
[null,"Visual Effectiveness",null,null,null,null,null,null,null,null,null,"","/","",{"$f":"IF(D11=0, \"\", SUM(D11:K12))","v":""},"/",{"$f":"IF(D11=\"\", \"\", IF(K11=0, 140, 160))","v":""}]
["DIFFICULTY","Diffuculty of Routine Choreography",null,null,null,null,null,null,null,null,null,"","/",""]
[null,"Difficulty of Formations and Transitions",null,null,null,null,null,null,null,null,null,"","/",""]
[null,"Difficulty of Skills",null,null,null,null,null,null,null,null,null,"","/","",{"$f":"IF(D13=0, \"\", SUM(D13:K15))","v":""},"/",{"$f":"IF(D13=\"\", \"\", IF(K13=0, 210, 240))","v":""}]
["EXECUTION","Placement & Control",null,null,null,null,null,null,null,null,null,"","/",""]
[null,"Degree of Accuracy",null,null,null,null,null,null,null,null,null,"","/","",{"$f":"IF(D16=0, \"\", SUM(D16:K17))","v":""},"/",{"$f":"IF(D16=\"\", \"\", IF(K16=0, 140, 160))","v":""}]
["R.E.","Routine Effectiveness",null,null,null,null,null,null,null,null,null,"","/","",{"$f":"IF(D18=0, \"\", SUM(D18:K18))","v":""},"/",{"$f":"IF(D18=\"\", \"\", IF(K18=0, 70, 80))","v":""}]
[null,"SUB TOTALS",null,{"$f":"D9+D10+D11+D12+D13+D14+D15+D16+D17+D18","v":0},{"$f":"E9+E10+E11+E12+E13+E14+E15+E16+E17+E18","v":0},0,0,0,0,0,0,{"$f":"IF(D9=0, \"\", SUM(D19:K19))","v":""},"/",{"$f":"IF(D9=\"\", \"\", SUM(N9:N18))","v":""},{"$f":"IF(D9=0, \"\", SUM(O9:O18))","v":""},"/",{"$f":"IF(D9=\"\", \"\", SUM(Q9:Q18))","v":""}]
[null,"DEDUCTIONS \nEnter as a negative number i.e. -3 or DQ",null,null,null,null,null,null,null,null,null,{"$f":"IF(D20=\"\", \"\", IF(D20=\"DQ\",\"DQ\",SUM(D20:K20)))","v":""},null,null,{"$f":"IF(D20=\"\", \"\", IF(D20=\"DQ\",\"DQ\",SUM(D20:K20)))","v":""}]
[null,"TOTALS",null,{"$f":"IF(D20=\"DQ\", \"DQ\",SUM(D19+D20))","v":0},0,0,0,0,0,{"$f":"IF(J20=\"DQ\", \"DQ\",SUM(J19+J20))","v":0},{"$f":"IF(K20=\"DQ\", \"DQ\",SUM(K19+K20))","v":0},{"$f":"IF(D9=0, \"\", IF(D20=\"DQ\",\"DQ\",SUM(D21:K21)))","v":""},"/",{"$f":"IF(D9=\"\", \"\", SUM(N9:N18))","v":""},{"$f":"IF(D9=0, \"\", IF(D20=\"DQ\",\"DQ\",SUM(O19:O20)))","v":""},"/",{"$f":"IF(D9=\"\", \"\", SUM(Q9:Q18))","v":""}]
[]
[null,"KC/T #1","Time:",null,null,null,"Kick Count:",null,null,null,null,null,"# Comp:"]
[null,"KC/T #2","Time:",null,null,null,"Kick Count:",null,null,null,null,null,"# Comp:"]
[null,"KC/T #3","Time:",null,null,null,"Kick Count:",null,null,null,null,null,"# Comp:"]

{"sheet":"Team3","index":7,"n_rows":25,"n_cols":17,"rows_kept":25,"cut":false,"hidden":false,"merged":[[20,1,20,2],[16,1,16,2],[17,1,17,2],[14,1,14,2],[15,1,15,2],[10,1,10,2],[6,0,6,2],[7,0,7,2],[6,14,7,14],[6,11,7,11],[12,1,12,2],[19,1,19,2],[8,0,9,0],[10,0,11,0],[12,0,14,0],[15,0,16,0],[6,15,7,16],[0,0,0,16],[1,0,1,16],[3,2,3,7],[3,8,3,11],[3,12,3,16],[4,2,4,7],[4,8,4,11],[4,12,4,16],[6,12,7,13],[23,3,23,4],[23,8,23,9],[24,3,24,4],[24,8,24,9],[9,1,9,2],[8,1,8,2],[13,1,13,2],[11,1,11,2],[22,3,22,4],[22,8,22,9]]}
["Minnesota State High School League Dance Team Competition"]
["Jazz Judges Recap Sheet"]
[]
[null,"School:",{"$f":"IF('Ranking Sheet'!B14=0, \"\", 'Ranking Sheet'!B14)","v":""},null,null,null,null,null,"Class:",null,null,null,{"$f":"IF(Class=0, \"\", Class)","v":""}]
[null,"Meet Site:",{"$f":"IF(Site=0, \"\", Site)","v":""},null,null,null,null,null,"Meet Date:",null,null,null,{"$f":"IF(DATE=0, \"\", DATE)","v":""}]
[]
["Judge's Initials → ",null,null,{"$f":"IF('Ranking Sheet'!D10=0, \"\", 'Ranking Sheet'!D10)","v":""},{"$f":"IF('Ranking Sheet'!F10=0, \"\", 'Ranking Sheet'!F10)","v":""},{"$f":"IF('Ranking Sheet'!H10=0, \"\", 'Ranking Sheet'!H10)","v":""},{"$f":"IF('Ranking Sheet'!J10=0, \"\", 'Ranking Sheet'!J10)","v":""},{"$f":"IF('Ranking Sheet'!L10=0, \"\", 'Ranking Sheet'!L10)","v":""},{"$f":"IF('Ranking Sheet'!N10=0, \"\", 'Ranking Sheet'!N10)","v":""},{"$f":"IF('Ranking Sheet'!P10=0, \"\", 'Ranking Sheet'!P10)","v":""},{"$f":"IF('Ranking Sheet'!R10=0, \"\", 'Ranking Sheet'!R10)","v":""},"Category Total Points","Total Points Possible",null,"Subtotal Points","Subtotal Points Possible"]
["Category",null,null,1,2,3,4,5,6,7,8]
["SKILLS","Technique of Turns",null,null,null,null,null,null,null,null,null,{"$f":"IF(D9=0, \"\", SUM(D9:K9))","v":""},"/",{"$f":"IF(D9=\"\", \"\", IF(K9=0, 70, 80))","v":""}]
[null,"Technique of Leaps & Jumps",null,null,null,null,null,null,null,null,null,{"$f":"IF(D10=0, \"\", SUM(D10:K10))","v":""},"/",{"$f":"IF(D10=\"\", \"\", IF(K10=0, 70, 80))","v":""},{"$f":"IF(D9=0, \"\", SUM(D9:K10))","v":""},"/",{"$f":"IF(D9=\"\", \"\", IF(K9=0, 140, 160))","v":""}]
["CHOREOGRAPHY","Creativity",null,null,null,null,null,null,null,null,null,{"$f":"IF(D11=0, \"\", SUM(D11:K11))","v":""},"/",""]
[null,"Visual Effectiveness",null,null,null,null,null,null,null,null,null,"","/","",{"$f":"IF(D11=0, \"\", SUM(D11:K12))","v":""},"/",{"$f":"IF(D11=\"\", \"\", IF(K11=0, 140, 160))","v":""}]
["DIFFICULTY","Diffuculty of Routine Choreography",null,null,null,null,null,null,null,null,null,"","/",""]
[null,"Difficulty of Formations and Transitions",null,null,null,null,null,null,null,null,null,"","/",""]
[null,"Difficulty of Skills",null,null,null,null,null,null,null,null,null,"","/","",{"$f":"IF(D13=0, \"\", SUM(D13:K15))","v":""},"/",{"$f":"IF(D13=\"\", \"\", IF(K13=0, 210, 240))","v":""}]
["EXECUTION","Placement & Control",null,null,null,null,null,null,null,null,null,"","/",""]
[null,"Degree of Accuracy",null,null,null,null,null,null,null,null,null,"","/","",{"$f":"IF(D16=0, \"\", SUM(D16:K17))","v":""},"/",{"$f":"IF(D16=\"\", \"\", IF(K16=0, 140, 160))","v":""}]
["R.E.","Routine Effectiveness",null,null,null,null,null,null,null,null,null,"","/","",{"$f":"IF(D18=0, \"\", SUM(D18:K18))","v":""},"/",{"$f":"IF(D18=\"\", \"\", IF(K18=0, 70, 80))","v":""}]
[null,"SUB TOTALS",null,{"$f":"D9+D10+D11+D12+D13+D14+D15+D16+D17+D18","v":0},{"$f":"E9+E10+E11+E12+E13+E14+E15+E16+E17+E18","v":0},0,0,0,0,0,0,{"$f":"IF(D9=0, \"\", SUM(D19:K19))","v":""},"/",{"$f":"IF(D9=\"\", \"\", SUM(N9:N18))","v":""},{"$f":"IF(D9=0, \"\", SUM(O9:O18))","v":""},"/",{"$f":"IF(D9=\"\", \"\", SUM(Q9:Q18))","v":""}]
[null,"DEDUCTIONS \nEnter as a negative number i.e. -3 or DQ",null,null,null,null,null,null,null,null,null,{"$f":"IF(D20=\"\", \"\", IF(D20=\"DQ\",\"DQ\",SUM(D20:K20)))","v":""},null,null,{"$f":"IF(D20=\"\", \"\", IF(D20=\"DQ\",\"DQ\",SUM(D20:K20)))","v":""}]
[null,"TOTALS",null,{"$f":"IF(D20=\"DQ\", \"DQ\",SUM(D19+D20))","v":0},0,0,0,0,0,{"$f":"IF(J20=\"DQ\", \"DQ\",SUM(J19+J20))","v":0},{"$f":"IF(K20=\"DQ\", \"DQ\",SUM(K19+K20))","v":0},{"$f":"IF(D9=0, \"\", IF(D20=\"DQ\",\"DQ\",SUM(D21:K21)))","v":""},"/",{"$f":"IF(D9=\"\", \"\", SUM(N9:N18))","v":""},{"$f":"IF(D9=0, \"\", IF(D20=\"DQ\",\"DQ\",SUM(O19:O20)))","v":""},"/",{"$f":"IF(D9=\"\", \"\", SUM(Q9:Q18))","v":""}]
[]
[null,"KC/T #1","Time:",null,null,null,"Kick Count:",null,null,null,null,null,"# Comp:"]
[null,"KC/T #2","Time:",null,null,null,"Kick Count:",null,null,null,null,null,"# Comp:"]
[null,"KC/T #3","Time:",null,null,null,"Kick Count:",null,null,null,null,null,"# Comp:"]

{"sheet":"Team4","index":8,"n_rows":25,"n_cols":17,"rows_kept":25,"cut":false,"hidden":false,"merged":[[20,1,20,2],[16,1,16,2],[17,1,17,2],[14,1,14,2],[15,1,15,2],[10,1,10,2],[6,0,6,2],[7,0,7,2],[6,14,7,14],[6,11,7,11],[12,1,12,2],[19,1,19,2],[8,0,9,0],[10,0,11,0],[12,0,14,0],[15,0,16,0],[6,15,7,16],[0,0,0,16],[1,0,1,16],[3,2,3,7],[3,8,3,11],[3,12,3,16],[4,2,4,7],[4,8,4,11],[4,12,4,16],[6,12,7,13],[23,3,23,4],[23,8,23,9],[24,3,24,4],[24,8,24,9],[9,1,9,2],[8,1,8,2],[13,1,13,2],[11,1,11,2],[22,3,22,4],[22,8,22,9]]}
["Minnesota State High School League Dance Team Competition"]
["Jazz Judges Recap Sheet"]
[]
[null,"School:",{"$f":"IF('Ranking Sheet'!B15=0, \"\", 'Ranking Sheet'!B15)","v":""},null,null,null,null,null,"Class:",null,null,null,{"$f":"IF(Class=0, \"\", Class)","v":""}]
[null,"Meet Site:",{"$f":"IF(Site=0, \"\", Site)","v":""},null,null,null,null,null,"Meet Date:",null,null,null,{"$f":"IF(DATE=0, \"\", DATE)","v":""}]
[]
["Judge's Initials → ",null,null,{"$f":"IF('Ranking Sheet'!D10=0, \"\", 'Ranking Sheet'!D10)","v":""},{"$f":"IF('Ranking Sheet'!F10=0, \"\", 'Ranking Sheet'!F10)","v":""},{"$f":"IF('Ranking Sheet'!H10=0, \"\", 'Ranking Sheet'!H10)","v":""},{"$f":"IF('Ranking Sheet'!J10=0, \"\", 'Ranking Sheet'!J10)","v":""},{"$f":"IF('Ranking Sheet'!L10=0, \"\", 'Ranking Sheet'!L10)","v":""},{"$f":"IF('Ranking Sheet'!N10=0, \"\", 'Ranking Sheet'!N10)","v":""},{"$f":"IF('Ranking Sheet'!P10=0, \"\", 'Ranking Sheet'!P10)","v":""},{"$f":"IF('Ranking Sheet'!R10=0, \"\", 'Ranking Sheet'!R10)","v":""},"Category Total Points","Total Points Possible",null,"Subtotal Points","Subtotal Points Possible"]
["Category",null,null,1,2,3,4,5,6,7,8]
["SKILLS","Technique of Turns",null,null,null,null,null,null,null,null,null,{"$f":"IF(D9=0, \"\", SUM(D9:K9))","v":""},"/",{"$f":"IF(D9=\"\", \"\", IF(K9=0, 70, 80))","v":""}]
[null,"Technique of Leaps & Jumps",null,null,null,null,null,null,null,null,null,{"$f":"IF(D10=0, \"\", SUM(D10:K10))","v":""},"/",{"$f":"IF(D10=\"\", \"\", IF(K10=0, 70, 80))","v":""},{"$f":"IF(D9=0, \"\", SUM(D9:K10))","v":""},"/",{"$f":"IF(D9=\"\", \"\", IF(K9=0, 140, 160))","v":""}]
["CHOREOGRAPHY","Creativity",null,null,null,null,null,null,null,null,null,{"$f":"IF(D11=0, \"\", SUM(D11:K11))","v":""},"/",""]
[null,"Visual Effectiveness",null,null,null,null,null,null,null,null,null,"","/","",{"$f":"IF(D11=0, \"\", SUM(D11:K12))","v":""},"/",{"$f":"IF(D11=\"\", \"\", IF(K11=0, 140, 160))","v":""}]
["DIFFICULTY","Diffuculty of Routine Choreography",null,null,null,null,null,null,null,null,null,"","/",""]
[null,"Difficulty of Formations and Transitions",null,null,null,null,null,null,null,null,null,"","/",""]
[null,"Difficulty of Skills",null,null,null,null,null,null,null,null,null,"","/","",{"$f":"IF(D13=0, \"\", SUM(D13:K15))","v":""},"/",{"$f":"IF(D13=\"\", \"\", IF(K13=0, 210, 240))","v":""}]
["EXECUTION","Placement & Control",null,null,null,null,null,null,null,null,null,"","/",""]
[null,"Degree of Accuracy",null,null,null,null,null,null,null,null,null,"","/","",{"$f":"IF(D16=0, \"\", SUM(D16:K17))","v":""},"/",{"$f":"IF(D16=\"\", \"\", IF(K16=0, 140, 160))","v":""}]
["R.E.","Routine Effectiveness",null,null,null,null,null,null,null,null,null,"","/","",{"$f":"IF(D18=0, \"\", SUM(D18:K18))","v":""},"/",{"$f":"IF(D18=\"\", \"\", IF(K18=0, 70, 80))","v":""}]
[null,"SUB TOTALS",null,{"$f":"D9+D10+D11+D12+D13+D14+D15+D16+D17+D18","v":0},{"$f":"E9+E10+E11+E12+E13+E14+E15+E16+E17+E18","v":0},0,0,0,0,0,0,{"$f":"IF(D9=0, \"\", SUM(D19:K19))","v":""},"/",{"$f":"IF(D9=\"\", \"\", SUM(N9:N18))","v":""},{"$f":"IF(D9=0, \"\", SUM(O9:O18))","v":""},"/",{"$f":"IF(D9=\"\", \"\", SUM(Q9:Q18))","v":""}]
[null,"DEDUCTIONS \nEnter as a negative number i.e. -3 or DQ",null,null,null,null,null,null,null,null,null,{"$f":"IF(D20=\"\", \"\", IF(D20=\"DQ\",\"DQ\",SUM(D20:K20)))","v":""},null,null,{"$f":"IF(D20=\"\", \"\", IF(D20=\"DQ\",\"DQ\",SUM(D20:K20)))","v":""}]
[null,"TOTALS",null,{"$f":"IF(D20=\"DQ\", \"DQ\",SUM(D19+D20))","v":0},0,0,0,0,0,{"$f":"IF(J20=\"DQ\", \"DQ\",SUM(J19+J20))","v":0},{"$f":"IF(K20=\"DQ\", \"DQ\",SUM(K19+K20))","v":0},{"$f":"IF(D9=0, \"\", IF(D20=\"DQ\",\"DQ\",SUM(D21:K21)))","v":""},"/",{"$f":"IF(D9=\"\", \"\", SUM(N9:N18))","v":""},{"$f":"IF(D9=0, \"\", IF(D20=\"DQ\",\"DQ\",SUM(O19:O20)))","v":""},"/",{"$f":"IF(D9=\"\", \"\", SUM(Q9:Q18))","v":""}]
[]
[null,"KC/T #1","Time:",null,null,null,"Kick Count:",null,null,null,null,null,"# Comp:"]
[null,"KC/T #2","Time:",null,null,null,"Kick Count:",null,null,null,null,null,"# Comp:"]
[null,"KC/T #3","Time:",null,null,null,"Kick Count:",null,null,null,null,null,"# Comp:"]

{"sheet":"Team5","index":9,"n_rows":25,"n_cols":17,"rows_kept":25,"cut":false,"hidden":false,"merged":[[20,1,20,2],[16,1,16,2],[17,1,17,2],[14,1,14,2],[15,1,15,2],[10,1,10,2],[6,0,6,2],[7,0,7,2],[6,14,7,14],[6,11,7,11],[12,1,12,2],[19,1,19,2],[8,0,9,0],[10,0,11,0],[12,0,14,0],[15,0,16,0],[6,15,7,16],[0,0,0,16],[1,0,1,16],[3,2,3,7],[3,8,3,11],[3,12,3,16],[4,2,4,7],[4,8,4,11],[4,12,4,16],[6,12,7,13],[23,3,23,4],[23,8,23,9],[24,3,24,4],[24,8,24,9],[9,1,9,2],[8,1,8,2],[13,1,13,2],[11,1,11,2],[22,3,22,4],[22,8,22,9]]}
["Minnesota State High School League Dance Team Competition"]
["Jazz Judges Recap Sheet"]
[]
[null,"School:",{"$f":"IF('Ranking Sheet'!B16=0, \"\", 'Ranking Sheet'!B16)","v":""},null,null,null,null,null,"Class:",null,null,null,{"$f":"IF(Class=0, \"\", Class)","v":""}]
[null,"Meet Site:",{"$f":"IF(Site=0, \"\", Site)","v":""},null,null,null,null,null,"Meet Date:",null,null,null,{"$f":"IF(DATE=0, \"\", DATE)","v":""}]
[]
["Judge's Initials → ",null,null,{"$f":"IF('Ranking Sheet'!D10=0, \"\", 'Ranking Sheet'!D10)","v":""},{"$f":"IF('Ranking Sheet'!F10=0, \"\", 'Ranking Sheet'!F10)","v":""},{"$f":"IF('Ranking Sheet'!H10=0, \"\", 'Ranking Sheet'!H10)","v":""},{"$f":"IF('Ranking Sheet'!J10=0, \"\", 'Ranking Sheet'!J10)","v":""},{"$f":"IF('Ranking Sheet'!L10=0, \"\", 'Ranking Sheet'!L10)","v":""},{"$f":"IF('Ranking Sheet'!N10=0, \"\", 'Ranking Sheet'!N10)","v":""},{"$f":"IF('Ranking Sheet'!P10=0, \"\", 'Ranking Sheet'!P10)","v":""},{"$f":"IF('Ranking Sheet'!R10=0, \"\", 'Ranking Sheet'!R10)","v":""},"Category Total Points","Total Points Possible",null,"Subtotal Points","Subtotal Points Possible"]
["Category",null,null,1,2,3,4,5,6,7,8]
["SKILLS","Technique of Turns",null,null,null,null,null,null,null,null,null,{"$f":"IF(D9=0, \"\", SUM(D9:K9))","v":""},"/",{"$f":"IF(D9=\"\", \"\", IF(K9=0, 70, 80))","v":""}]
[null,"Technique of Leaps & Jumps",null,null,null,null,null,null,null,null,null,{"$f":"IF(D10=0, \"\", SUM(D10:K10))","v":""},"/",{"$f":"IF(D10=\"\", \"\", IF(K10=0, 70, 80))","v":""},{"$f":"IF(D9=0, \"\", SUM(D9:K10))","v":""},"/",{"$f":"IF(D9=\"\", \"\", IF(K9=0, 140, 160))","v":""}]
["CHOREOGRAPHY","Creativity",null,null,null,null,null,null,null,null,null,{"$f":"IF(D11=0, \"\", SUM(D11:K11))","v":""},"/",""]
[null,"Visual Effectiveness",null,null,null,null,null,null,null,null,null,"","/","",{"$f":"IF(D11=0, \"\", SUM(D11:K12))","v":""},"/",{"$f":"IF(D11=\"\", \"\", IF(K11=0, 140, 160))","v":""}]
["DIFFICULTY","Diffuculty of Routine Choreography",null,null,null,null,null,null,null,null,null,"","/",""]
[null,"Difficulty of Formations and Transitions",null,null,null,null,null,null,null,null,null,"","/",""]
[null,"Difficulty of Skills",null,null,null,null,null,null,null,null,null,"","/","",{"$f":"IF(D13=0, \"\", SUM(D13:K15))","v":""},"/",{"$f":"IF(D13=\"\", \"\", IF(K13=0, 210, 240))","v":""}]
["EXECUTION","Placement & Control",null,null,null,null,null,null,null,null,null,"","/",""]
[null,"Degree of Accuracy",null,null,null,null,null,null,null,null,null,"","/","",{"$f":"IF(D16=0, \"\", SUM(D16:K17))","v":""},"/",{"$f":"IF(D16=\"\", \"\", IF(K16=0, 140, 160))","v":""}]
["R.E.","Routine Effectiveness",null,null,null,null,null,null,null,null,null,"","/","",{"$f":"IF(D18=0, \"\", SUM(D18:K18))","v":""},"/",{"$f":"IF(D18=\"\", \"\", IF(K18=0, 70, 80))","v":""}]
[null,"SUB TOTALS",null,{"$f":"D9+D10+D11+D12+D13+D14+D15+D16+D17+D18","v":0},{"$f":"E9+E10+E11+E12+E13+E14+E15+E16+E17+E18","v":0},0,0,0,0,0,0,{"$f":"IF(D9=0, \"\", SUM(D19:K19))","v":""},"/",{"$f":"IF(D9=\"\", \"\", SUM(N9:N18))","v":""},{"$f":"IF(D9=0, \"\", SUM(O9:O18))","v":""},"/",{"$f":"IF(D9=\"\", \"\", SUM(Q9:Q18))","v":""}]
[null,"DEDUCTIONS \nEnter as a negative number i.e. -3 or DQ",null,null,null,null,null,null,null,null,null,{"$f":"IF(D20=\"\", \"\", IF(D20=\"DQ\",\"DQ\",SUM(D20:K20)))","v":""},null,null,{"$f":"IF(D20=\"\", \"\", IF(D20=\"DQ\",\"DQ\",SUM(D20:K20)))","v":""}]
[null,"TOTALS",null,{"$f":"IF(D20=\"DQ\", \"DQ\",SUM(D19+D20))","v":0},0,0,0,0,0,{"$f":"IF(J20=\"DQ\", \"DQ\",SUM(J19+J20))","v":0},{"$f":"IF(K20=\"DQ\", \"DQ\",SUM(K19+K20))","v":0},{"$f":"IF(D9=0, \"\", IF(D20=\"DQ\",\"DQ\",SUM(D21:K21)))","v":""},"/",{"$f":"IF(D9=\"\", \"\", SUM(N9:N18))","v":""},{"$f":"IF(D9=0, \"\", IF(D20=\"DQ\",\"DQ\",SUM(O19:O20)))","v":""},"/",{"$f":"IF(D9=\"\", \"\", SUM(Q9:Q18))","v":""}]
[]
[null,"KC/T #1","Time:",null,null,null,"Kick Count:",null,null,null,null,null,"# Comp:"]
[null,"KC/T #2","Time:",null,null,null,"Kick Count:",null,null,null,null,null,"# Comp:"]
[null,"KC/T #3","Time:",null,null,null,"Kick Count:",null,null,null,null,null,"# Comp:"]

{"sheet":"Team6","index":10,"n_rows":25,"n_cols":17,"rows_kept":25,"cut":false,"hidden":false,"merged":[[20,1,20,2],[16,1,16,2],[17,1,17,2],[14,1,14,2],[15,1,15,2],[10,1,10,2],[6,0,6,2],[7,0,7,2],[6,14,7,14],[6,11,7,11],[12,1,12,2],[19,1,19,2],[8,0,9,0],[10,0,11,0],[12,0,14,0],[15,0,16,0],[6,15,7,16],[0,0,0,16],[1,0,1,16],[3,2,3,7],[3,8,3,11],[3,12,3,16],[4,2,4,7],[4,8,4,11],[4,12,4,16],[6,12,7,13],[23,3,23,4],[23,8,23,9],[24,3,24,4],[24,8,24,9],[9,1,9,2],[8,1,8,2],[13,1,13,2],[11,1,11,2],[22,3,22,4],[22,8,22,9]]}
["Minnesota State High School League Dance Team Competition"]
["Jazz Judges Recap Sheet"]
[]
[null,"School:",{"$f":"IF('Ranking Sheet'!B17=0, \"\", 'Ranking Sheet'!B17)","v":""},null,null,null,null,null,"Class:",null,null,null,{"$f":"IF(Class=0, \"\", Class)","v":""}]
[null,"Meet Site:",{"$f":"IF(Site=0, \"\", Site)","v":""},null,null,null,null,null,"Meet Date:",null,null,null,{"$f":"IF(DATE=0, \"\", DATE)","v":""}]
[]
["Judge's Initials → ",null,null,{"$f":"IF('Ranking Sheet'!D10=0, \"\", 'Ranking Sheet'!D10)","v":""},{"$f":"IF('Ranking Sheet'!F10=0, \"\", 'Ranking Sheet'!F10)","v":""},{"$f":"IF('Ranking Sheet'!H10=0, \"\", 'Ranking Sheet'!H10)","v":""},{"$f":"IF('Ranking Sheet'!J10=0, \"\", 'Ranking Sheet'!J10)","v":""},{"$f":"IF('Ranking Sheet'!L10=0, \"\", 'Ranking Sheet'!L10)","v":""},{"$f":"IF('Ranking Sheet'!N10=0, \"\", 'Ranking Sheet'!N10)","v":""},{"$f":"IF('Ranking Sheet'!P10=0, \"\", 'Ranking Sheet'!P10)","v":""},{"$f":"IF('Ranking Sheet'!R10=0, \"\", 'Ranking Sheet'!R10)","v":""},"Category Total Points","Total Points Possible",null,"Subtotal Points","Subtotal Points Possible"]
["Category",null,null,1,2,3,4,5,6,7,8]
["SKILLS","Technique of Turns",null,null,null,null,null,null,null,null,null,{"$f":"IF(D9=0, \"\", SUM(D9:K9))","v":""},"/",{"$f":"IF(D9=\"\", \"\", IF(K9=0, 70, 80))","v":""}]
[null,"Technique of Leaps & Jumps",null,null,null,null,null,null,null,null,null,{"$f":"IF(D10=0, \"\", SUM(D10:K10))","v":""},"/",{"$f":"IF(D10=\"\", \"\", IF(K10=0, 70, 80))","v":""},{"$f":"IF(D9=0, \"\", SUM(D9:K10))","v":""},"/",{"$f":"IF(D9=\"\", \"\", IF(K9=0, 140, 160))","v":""}]
["CHOREOGRAPHY","Creativity",null,null,null,null,null,null,null,null,null,{"$f":"IF(D11=0, \"\", SUM(D11:K11))","v":""},"/",""]
[null,"Visual Effectiveness",null,null,null,null,null,null,null,null,null,"","/","",{"$f":"IF(D11=0, \"\", SUM(D11:K12))","v":""},"/",{"$f":"IF(D11=\"\", \"\", IF(K11=0, 140, 160))","v":""}]
["DIFFICULTY","Diffuculty of Routine Choreography",null,null,null,null,null,null,null,null,null,"","/",""]
[null,"Difficulty of Formations and Transitions",null,null,null,null,null,null,null,null,null,"","/",""]
[null,"Difficulty of Skills",null,null,null,null,null,null,null,null,null,"","/","",{"$f":"IF(D13=0, \"\", SUM(D13:K15))","v":""},"/",{"$f":"IF(D13=\"\", \"\", IF(K13=0, 210, 240))","v":""}]
["EXECUTION","Placement & Control",null,null,null,null,null,null,null,null,null,"","/",""]
[null,"Degree of Accuracy",null,null,null,null,null,null,null,null,null,"","/","",{"$f":"IF(D16=0, \"\", SUM(D16:K17))","v":""},"/",{"$f":"IF(D16=\"\", \"\", IF(K16=0, 140, 160))","v":""}]
["R.E.","Routine Effectiveness",null,null,null,null,null,null,null,null,null,"","/","",{"$f":"IF(D18=0, \"\", SUM(D18:K18))","v":""},"/",{"$f":"IF(D18=\"\", \"\", IF(K18=0, 70, 80))","v":""}]
[null,"SUB TOTALS",null,{"$f":"D9+D10+D11+D12+D13+D14+D15+D16+D17+D18","v":0},{"$f":"E9+E10+E11+E12+E13+E14+E15+E16+E17+E18","v":0},0,0,0,0,0,0,{"$f":"IF(D9=0, \"\", SUM(D19:K19))","v":""},"/",{"$f":"IF(D9=\"\", \"\", SUM(N9:N18))","v":""},{"$f":"IF(D9=0, \"\", SUM(O9:O18))","v":""},"/",{"$f":"IF(D9=\"\", \"\", SUM(Q9:Q18))","v":""}]
[null,"DEDUCTIONS \nEnter as a negative number i.e. -3 or DQ",null,null,null,null,null,null,null,null,null,{"$f":"IF(D20=\"\", \"\", IF(D20=\"DQ\",\"DQ\",SUM(D20:K20)))","v":""},null,null,{"$f":"IF(D20=\"\", \"\", IF(D20=\"DQ\",\"DQ\",SUM(D20:K20)))","v":""}]
[null,"TOTALS",null,{"$f":"IF(D20=\"DQ\", \"DQ\",SUM(D19+D20))","v":0},0,0,0,0,0,{"$f":"IF(J20=\"DQ\", \"DQ\",SUM(J19+J20))","v":0},{"$f":"IF(K20=\"DQ\", \"DQ\",SUM(K19+K20))","v":0},{"$f":"IF(D9=0, \"\", IF(D20=\"DQ\",\"DQ\",SUM(D21:K21)))","v":""},"/",{"$f":"IF(D9=\"\", \"\", SUM(N9:N18))","v":""},{"$f":"IF(D9=0, \"\", IF(D20=\"DQ\",\"DQ\",SUM(O19:O20)))","v":""},"/",{"$f":"IF(D9=\"\", \"\", SUM(Q9:Q18))","v":""}]
[]
[null,"KC/T #1","Time:",null,null,null,"Kick Count:",null,null,null,null,null,"# Comp:"]
[null,"KC/T #2","Time:",null,null,null,"Kick Count:",null,null,null,null,null,"# Comp:"]
[null,"KC/T #3","Time:",null,null,null,"Kick Count:",null,null,null,null,null,"# Comp:"]

{"sheet":"Team7","index":11,"n_rows":25,"n_cols":17,"rows_kept":25,"cut":false,"hidden":false,"merged":[[20,1,20,2],[16,1,16,2],[17,1,17,2],[14,1,14,2],[15,1,15,2],[10,1,10,2],[6,0,6,2],[7,0,7,2],[6,14,7,14],[6,11,7,11],[12,1,12,2],[19,1,19,2],[8,0,9,0],[10,0,11,0],[12,0,14,0],[15,0,16,0],[6,15,7,16],[0,0,0,16],[1,0,1,16],[3,2,3,7],[3,8,3,11],[3,12,3,16],[4,2,4,7],[4,8,4,11],[4,12,4,16],[6,12,7,13],[23,3,23,4],[23,8,23,9],[24,3,24,4],[24,8,24,9],[9,1,9,2],[8,1,8,2],[13,1,13,2],[11,1,11,2],[22,3,22,4],[22,8,22,9]]}
["Minnesota State High School League Dance Team Competition"]
["Jazz Judges Recap Sheet"]
[]
[null,"School:",{"$f":"IF('Ranking Sheet'!B18=0, \"\", 'Ranking Sheet'!B18)","v":""},null,null,null,null,null,"Class:",null,null,null,{"$f":"IF(Class=0, \"\", Class)","v":""}]
[null,"Meet Site:",{"$f":"IF(Site=0, \"\", Site)","v":""},null,null,null,null,null,"Meet Date:",null,null,null,{"$f":"IF(DATE=0, \"\", DATE)","v":""}]
[]
["Judge's Initials → ",null,null,{"$f":"IF('Ranking Sheet'!D10=0, \"\", 'Ranking Sheet'!D10)","v":""},{"$f":"IF('Ranking Sheet'!F10=0, \"\", 'Ranking Sheet'!F10)","v":""},{"$f":"IF('Ranking Sheet'!H10=0, \"\", 'Ranking Sheet'!H10)","v":""},{"$f":"IF('Ranking Sheet'!J10=0, \"\", 'Ranking Sheet'!J10)","v":""},{"$f":"IF('Ranking Sheet'!L10=0, \"\", 'Ranking Sheet'!L10)","v":""},{"$f":"IF('Ranking Sheet'!N10=0, \"\", 'Ranking Sheet'!N10)","v":""},{"$f":"IF('Ranking Sheet'!P10=0, \"\", 'Ranking Sheet'!P10)","v":""},{"$f":"IF('Ranking Sheet'!R10=0, \"\", 'Ranking Sheet'!R10)","v":""},"Category Total Points","Total Points Possible",null,"Subtotal Points","Subtotal Points Possible"]
["Category",null,null,1,2,3,4,5,6,7,8]
["SKILLS","Technique of Turns",null,null,null,null,null,null,null,null,null,{"$f":"IF(D9=0, \"\", SUM(D9:K9))","v":""},"/",{"$f":"IF(D9=\"\", \"\", IF(K9=0, 70, 80))","v":""}]
[null,"Technique of Leaps & Jumps",null,null,null,null,null,null,null,null,null,{"$f":"IF(D10=0, \"\", SUM(D10:K10))","v":""},"/",{"$f":"IF(D10=\"\", \"\", IF(K10=0, 70, 80))","v":""},{"$f":"IF(D9=0, \"\", SUM(D9:K10))","v":""},"/",{"$f":"IF(D9=\"\", \"\", IF(K9=0, 140, 160))","v":""}]
["CHOREOGRAPHY","Creativity",null,null,null,null,null,null,null,null,null,{"$f":"IF(D11=0, \"\", SUM(D11:K11))","v":""},"/",""]
[null,"Visual Effectiveness",null,null,null,null,null,null,null,null,null,"","/","",{"$f":"IF(D11=0, \"\", SUM(D11:K12))","v":""},"/",{"$f":"IF(D11=\"\", \"\", IF(K11=0, 140, 160))","v":""}]
["DIFFICULTY","Diffuculty of Routine Choreography",null,null,null,null,null,null,null,null,null,"","/",""]
[null,"Difficulty of Formations and Transitions",null,null,null,null,null,null,null,null,null,"","/",""]
[null,"Difficulty of Skills",null,null,null,null,null,null,null,null,null,"","/","",{"$f":"IF(D13=0, \"\", SUM(D13:K15))","v":""},"/",{"$f":"IF(D13=\"\", \"\", IF(K13=0, 210, 240))","v":""}]
["EXECUTION","Placement & Control",null,null,null,null,null,null,null,null,null,"","/",""]
[null,"Degree of Accuracy",null,null,null,null,null,null,null,null,null,"","/","",{"$f":"IF(D16=0, \"\", SUM(D16:K17))","v":""},"/",{"$f":"IF(D16=\"\", \"\", IF(K16=0, 140, 160))","v":""}]
["R.E.","Routine Effectiveness",null,null,null,null,null,null,null,null,null,"","/","",{"$f":"IF(D18=0, \"\", SUM(D18:K18))","v":""},"/",{"$f":"IF(D18=\"\", \"\", IF(K18=0, 70, 80))","v":""}]
[null,"SUB TOTALS",null,{"$f":"D9+D10+D11+D12+D13+D14+D15+D16+D17+D18","v":0},{"$f":"E9+E10+E11+E12+E13+E14+E15+E16+E17+E18","v":0},0,0,0,0,0,0,{"$f":"IF(D9=0, \"\", SUM(D19:K19))","v":""},"/",{"$f":"IF(D9=\"\", \"\", SUM(N9:N18))","v":""},{"$f":"IF(D9=0, \"\", SUM(O9:O18))","v":""},"/",{"$f":"IF(D9=\"\", \"\", SUM(Q9:Q18))","v":""}]
[null,"DEDUCTIONS \nEnter as a negative number i.e. -3 or DQ",null,null,null,null,null,null,null,null,null,{"$f":"IF(D20=\"\", \"\", IF(D20=\"DQ\",\"DQ\",SUM(D20:K20)))","v":""},null,null,{"$f":"IF(D20=\"\", \"\", IF(D20=\"DQ\",\"DQ\",SUM(D20:K20)))","v":""}]
[null,"TOTALS",null,{"$f":"IF(D20=\"DQ\", \"DQ\",SUM(D19+D20))","v":0},0,0,0,0,0,{"$f":"IF(J20=\"DQ\", \"DQ\",SUM(J19+J20))","v":0},{"$f":"IF(K20=\"DQ\", \"DQ\",SUM(K19+K20))","v":0},{"$f":"IF(D9=0, \"\", IF(D20=\"DQ\",\"DQ\",SUM(D21:K21)))","v":""},"/",{"$f":"IF(D9=\"\", \"\", SUM(N9:N18))","v":""},{"$f":"IF(D9=0, \"\", IF(D20=\"DQ\",\"DQ\",SUM(O19:O20)))","v":""},"/",{"$f":"IF(D9=\"\", \"\", SUM(Q9:Q18))","v":""}]
[]
[null,"KC/T #1","Time:",null,null,null,"Kick Count:",null,null,null,null,null,"# Comp:"]
[null,"KC/T #2","Time:",null,null,null,"Kick Count:",null,null,null,null,null,"# Comp:"]
[null,"KC/T #3","Time:",null,null,null,"Kick Count:",null,null,null,null,null,"# Comp:"]

{"sheet":"Team8","index":12,"n_rows":25,"n_cols":17,"rows_kept":25,"cut":false,"hidden":false,"merged":[[20,1,20,2],[16,1,16,2],[17,1,17,2],[14,1,14,2],[15,1,15,2],[10,1,10,2],[6,0,6,2],[7,0,7,2],[6,14,7,14],[6,11,7,11],[12,1,12,2],[19,1,19,2],[8,0,9,0],[10,0,11,0],[12,0,14,0],[15,0,16,0],[6,15,7,16],[0,0,0,16],[1,0,1,16],[3,2,3,7],[3,8,3,11],[3,12,3,16],[4,2,4,7],[4,8,4,11],[4,12,4,16],[6,12,7,13],[23,3,23,4],[23,8,23,9],[24,3,24,4],[24,8,24,9],[9,1,9,2],[8,1,8,2],[13,1,13,2],[11,1,11,2],[22,3,22,4],[22,8,22,9]]}
["Minnesota State High School League Dance Team Competition"]
["Jazz Judges Recap Sheet"]
[]
[null,"School:",{"$f":"IF('Ranking Sheet'!B19=0, \"\", 'Ranking Sheet'!B19)","v":""},null,null,null,null,null,"Class:",null,null,null,{"$f":"IF(Class=0, \"\", Class)","v":""}]
[null,"Meet Site:",{"$f":"IF(Site=0, \"\", Site)","v":""},null,null,null,null,null,"Meet Date:",null,null,null,{"$f":"IF(DATE=0, \"\", DATE)","v":""}]
[]
["Judge's Initials → ",null,null,{"$f":"IF('Ranking Sheet'!D10=0, \"\", 'Ranking Sheet'!D10)","v":""},{"$f":"IF('Ranking Sheet'!F10=0, \"\", 'Ranking Sheet'!F10)","v":""},{"$f":"IF('Ranking Sheet'!H10=0, \"\", 'Ranking Sheet'!H10)","v":""},{"$f":"IF('Ranking Sheet'!J10=0, \"\", 'Ranking Sheet'!J10)","v":""},{"$f":"IF('Ranking Sheet'!L10=0, \"\", 'Ranking Sheet'!L10)","v":""},{"$f":"IF('Ranking Sheet'!N10=0, \"\", 'Ranking Sheet'!N10)","v":""},{"$f":"IF('Ranking Sheet'!P10=0, \"\", 'Ranking Sheet'!P10)","v":""},{"$f":"IF('Ranking Sheet'!R10=0, \"\", 'Ranking Sheet'!R10)","v":""},"Category Total Points","Total Points Possible",null,"Subtotal Points","Subtotal Points Possible"]
["Category",null,null,1,2,3,4,5,6,7,8]
["SKILLS","Technique of Turns",null,null,null,null,null,null,null,null,null,{"$f":"IF(D9=0, \"\", SUM(D9:K9))","v":""},"/",{"$f":"IF(D9=\"\", \"\", IF(K9=0, 70, 80))","v":""}]
[null,"Technique of Leaps & Jumps",null,null,null,null,null,null,null,null,null,{"$f":"IF(D10=0, \"\", SUM(D10:K10))","v":""},"/",{"$f":"IF(D10=\"\", \"\", IF(K10=0, 70, 80))","v":""},{"$f":"IF(D9=0, \"\", SUM(D9:K10))","v":""},"/",{"$f":"IF(D9=\"\", \"\", IF(K9=0, 140, 160))","v":""}]
["CHOREOGRAPHY","Creativity",null,null,null,null,null,null,null,null,null,{"$f":"IF(D11=0, \"\", SUM(D11:K11))","v":""},"/",""]
[null,"Visual Effectiveness",null,null,null,null,null,null,null,null,null,"","/","",{"$f":"IF(D11=0, \"\", SUM(D11:K12))","v":""},"/",{"$f":"IF(D11=\"\", \"\", IF(K11=0, 140, 160))","v":""}]
["DIFFICULTY","Diffuculty of Routine Choreography",null,null,null,null,null,null,null,null,null,"","/",""]
[null,"Difficulty of Formations and Transitions",null,null,null,null,null,null,null,null,null,"","/",""]
[null,"Difficulty of Skills",null,null,null,null,null,null,null,null,null,"","/","",{"$f":"IF(D13=0, \"\", SUM(D13:K15))","v":""},"/",{"$f":"IF(D13=\"\", \"\", IF(K13=0, 210, 240))","v":""}]
["EXECUTION","Placement & Control",null,null,null,null,null,null,null,null,null,"","/",""]
[null,"Degree of Accuracy",null,null,null,null,null,null,null,null,null,"","/","",{"$f":"IF(D16=0, \"\", SUM(D16:K17))","v":""},"/",{"$f":"IF(D16=\"\", \"\", IF(K16=0, 140, 160))","v":""}]
["R.E.","Routine Effectiveness",null,null,null,null,null,null,null,null,null,"","/","",{"$f":"IF(D18=0, \"\", SUM(D18:K18))","v":""},"/",{"$f":"IF(D18=\"\", \"\", IF(K18=0, 70, 80))","v":""}]
[null,"SUB TOTALS",null,{"$f":"D9+D10+D11+D12+D13+D14+D15+D16+D17+D18","v":0},{"$f":"E9+E10+E11+E12+E13+E14+E15+E16+E17+E18","v":0},0,0,0,0,0,0,{"$f":"IF(D9=0, \"\", SUM(D19:K19))","v":""},"/",{"$f":"IF(D9=\"\", \"\", SUM(N9:N18))","v":""},{"$f":"IF(D9=0, \"\", SUM(O9:O18))","v":""},"/",{"$f":"IF(D9=\"\", \"\", SUM(Q9:Q18))","v":""}]
[null,"DEDUCTIONS \nEnter as a negative number i.e. -3 or DQ",null,null,null,null,null,null,null,null,null,{"$f":"IF(D20=\"\", \"\", IF(D20=\"DQ\",\"DQ\",SUM(D20:K20)))","v":""},null,null,{"$f":"IF(D20=\"\", \"\", IF(D20=\"DQ\",\"DQ\",SUM(D20:K20)))","v":""}]
[null,"TOTALS",null,{"$f":"IF(D20=\"DQ\", \"DQ\",SUM(D19+D20))","v":0},0,0,0,0,0,{"$f":"IF(J20=\"DQ\", \"DQ\",SUM(J19+J20))","v":0},{"$f":"IF(K20=\"DQ\", \"DQ\",SUM(K19+K20))","v":0},{"$f":"IF(D9=0, \"\", IF(D20=\"DQ\",\"DQ\",SUM(D21:K21)))","v":""},"/",{"$f":"IF(D9=\"\", \"\", SUM(N9:N18))","v":""},{"$f":"IF(D9=0, \"\", IF(D20=\"DQ\",\"DQ\",SUM(O19:O20)))","v":""},"/",{"$f":"IF(D9=\"\", \"\", SUM(Q9:Q18))","v":""}]
[]
[null,"KC/T #1","Time:",null,null,null,"Kick Count:",null,null,null,null,null,"# Comp:"]
[null,"KC/T #2","Time:",null,null,null,"Kick Count:",null,null,null,null,null,"# Comp:"]
[null,"KC/T #3","Time:",null,null,null,"Kick Count:",null,null,null,null,null,"# Comp:"]

{"sheet":"Team9","index":13,"n_rows":25,"n_cols":17,"rows_kept":25,"cut":false,"hidden":false,"merged":[[20,1,20,2],[16,1,16,2],[17,1,17,2],[14,1,14,2],[15,1,15,2],[10,1,10,2],[6,0,6,2],[7,0,7,2],[6,14,7,14],[6,11,7,11],[12,1,12,2],[19,1,19,2],[8,0,9,0],[10,0,11,0],[12,0,14,0],[15,0,16,0],[6,15,7,16],[0,0,0,16],[1,0,1,16],[3,2,3,7],[3,8,3,11],[3,12,3,16],[4,2,4,7],[4,8,4,11],[4,12,4,16],[6,12,7,13],[23,3,23,4],[23,8,23,9],[24,3,24,4],[24,8,24,9],[9,1,9,2],[8,1,8,2],[13,1,13,2],[11,1,11,2],[22,3,22,4],[22,8,22,9]]}
["Minnesota State High School League Dance Team Competition"]
["Jazz Judges Recap Sheet"]
[]
[null,"School:",{"$f":"IF('Ranking Sheet'!B20=0, \"\", 'Ranking Sheet'!B20)","v":""},null,null,null,null,null,"Class:",null,null,null,{"$f":"IF(Class=0, \"\", Class)","v":""}]
[null,"Meet Site:",{"$f":"IF(Site=0, \"\", Site)","v":""},null,null,null,null,null,"Meet Date:",null,null,null,{"$f":"IF(DATE=0, \"\", DATE)","v":""}]
[]
["Judge's Initials → ",null,null,{"$f":"IF('Ranking Sheet'!D10=0, \"\", 'Ranking Sheet'!D10)","v":""},{"$f":"IF('Ranking Sheet'!F10=0, \"\", 'Ranking Sheet'!F10)","v":""},{"$f":"IF('Ranking Sheet'!H10=0, \"\", 'Ranking Sheet'!H10)","v":""},{"$f":"IF('Ranking Sheet'!J10=0, \"\", 'Ranking Sheet'!J10)","v":""},{"$f":"IF('Ranking Sheet'!L10=0, \"\", 'Ranking Sheet'!L10)","v":""},{"$f":"IF('Ranking Sheet'!N10=0, \"\", 'Ranking Sheet'!N10)","v":""},{"$f":"IF('Ranking Sheet'!P10=0, \"\", 'Ranking Sheet'!P10)","v":""},{"$f":"IF('Ranking Sheet'!R10=0, \"\", 'Ranking Sheet'!R10)","v":""},"Category Total Points","Total Points Possible",null,"Subtotal Points","Subtotal Points Possible"]
["Category",null,null,1,2,3,4,5,6,7,8]
["SKILLS","Technique of Turns",null,null,null,null,null,null,null,null,null,{"$f":"IF(D9=0, \"\", SUM(D9:K9))","v":""},"/",{"$f":"IF(D9=\"\", \"\", IF(K9=0, 70, 80))","v":""}]
[null,"Technique of Leaps & Jumps",null,null,null,null,null,null,null,null,null,{"$f":"IF(D10=0, \"\", SUM(D10:K10))","v":""},"/",{"$f":"IF(D10=\"\", \"\", IF(K10=0, 70, 80))","v":""},{"$f":"IF(D9=0, \"\", SUM(D9:K10))","v":""},"/",{"$f":"IF(D9=\"\", \"\", IF(K9=0, 140, 160))","v":""}]
["CHOREOGRAPHY","Creativity",null,null,null,null,null,null,null,null,null,{"$f":"IF(D11=0, \"\", SUM(D11:K11))","v":""},"/",""]
[null,"Visual Effectiveness",null,null,null,null,null,null,null,null,null,"","/","",{"$f":"IF(D11=0, \"\", SUM(D11:K12))","v":""},"/",{"$f":"IF(D11=\"\", \"\", IF(K11=0, 140, 160))","v":""}]
["DIFFICULTY","Diffuculty of Routine Choreography",null,null,null,null,null,null,null,null,null,"","/",""]
[null,"Difficulty of Formations and Transitions",null,null,null,null,null,null,null,null,null,"","/",""]
[null,"Difficulty of Skills",null,null,null,null,null,null,null,null,null,"","/","",{"$f":"IF(D13=0, \"\", SUM(D13:K15))","v":""},"/",{"$f":"IF(D13=\"\", \"\", IF(K13=0, 210, 240))","v":""}]
["EXECUTION","Placement & Control",null,null,null,null,null,null,null,null,null,"","/",""]
[null,"Degree of Accuracy",null,null,null,null,null,null,null,null,null,"","/","",{"$f":"IF(D16=0, \"\", SUM(D16:K17))","v":""},"/",{"$f":"IF(D16=\"\", \"\", IF(K16=0, 140, 160))","v":""}]
["R.E.","Routine Effectiveness",null,null,null,null,null,null,null,null,null,"","/","",{"$f":"IF(D18=0, \"\", SUM(D18:K18))","v":""},"/",{"$f":"IF(D18=\"\", \"\", IF(K18=0, 70, 80))","v":""}]
[null,"SUB TOTALS",null,{"$f":"D9+D10+D11+D12+D13+D14+D15+D16+D17+D18","v":0},{"$f":"E9+E10+E11+E12+E13+E14+E15+E16+E17+E18","v":0},0,0,0,0,0,0,{"$f":"IF(D9=0, \"\", SUM(D19:K19))","v":""},"/",{"$f":"IF(D9=\"\", \"\", SUM(N9:N18))","v":""},{"$f":"IF(D9=0, \"\", SUM(O9:O18))","v":""},"/",{"$f":"IF(D9=\"\", \"\", SUM(Q9:Q18))","v":""}]
[null,"DEDUCTIONS \nEnter as a negative number i.e. -3 or DQ",null,null,null,null,null,null,null,null,null,{"$f":"IF(D20=\"\", \"\", IF(D20=\"DQ\",\"DQ\",SUM(D20:K20)))","v":""},null,null,{"$f":"IF(D20=\"\", \"\", IF(D20=\"DQ\",\"DQ\",SUM(D20:K20)))","v":""}]
[null,"TOTALS",null,{"$f":"IF(D20=\"DQ\", \"DQ\",SUM(D19+D20))","v":0},0,0,0,0,0,{"$f":"IF(J20=\"DQ\", \"DQ\",SUM(J19+J20))","v":0},{"$f":"IF(K20=\"DQ\", \"DQ\",SUM(K19+K20))","v":0},{"$f":"IF(D9=0, \"\", IF(D20=\"DQ\",\"DQ\",SUM(D21:K21)))","v":""},"/",{"$f":"IF(D9=\"\", \"\", SUM(N9:N18))","v":""},{"$f":"IF(D9=0, \"\", IF(D20=\"DQ\",\"DQ\",SUM(O19:O20)))","v":""},"/",{"$f":"IF(D9=\"\", \"\", SUM(Q9:Q18))","v":""}]
[]
[null,"KC/T #1","Time:",null,null,null,"Kick Count:",null,null,null,null,null,"# Comp:"]
[null,"KC/T #2","Time:",null,null,null,"Kick Count:",null,null,null,null,null,"# Comp:"]
[null,"KC/T #3","Time:",null,null,null,"Kick Count:",null,null,null,null,null,"# Comp:"]

{"sheet":"Team10","index":14,"n_rows":25,"n_cols":17,"rows_kept":25,"cut":false,"hidden":false,"merged":[[20,1,20,2],[16,1,16,2],[17,1,17,2],[14,1,14,2],[15,1,15,2],[10,1,10,2],[6,0,6,2],[7,0,7,2],[6,14,7,14],[6,11,7,11],[12,1,12,2],[19,1,19,2],[8,0,9,0],[10,0,11,0],[12,0,14,0],[15,0,16,0],[6,15,7,16],[0,0,0,16],[1,0,1,16],[3,2,3,7],[3,8,3,11],[3,12,3,16],[4,2,4,7],[4,8,4,11],[4,12,4,16],[6,12,7,13],[23,3,23,4],[23,8,23,9],[24,3,24,4],[24,8,24,9],[9,1,9,2],[8,1,8,2],[13,1,13,2],[11,1,11,2],[22,3,22,4],[22,8,22,9]]}
["Minnesota State High School League Dance Team Competition"]
["Jazz Judges Recap Sheet"]
[]
[null,"School:",{"$f":"IF('Ranking Sheet'!B21=0, \"\", 'Ranking Sheet'!B21)","v":""},null,null,null,null,null,"Class:",null,null,null,{"$f":"IF(Class=0, \"\", Class)","v":""}]
[null,"Meet Site:",{"$f":"IF(Site=0, \"\", Site)","v":""},null,null,null,null,null,"Meet Date:",null,null,null,{"$f":"IF(DATE=0, \"\", DATE)","v":""}]
[]
["Judge's Initials → ",null,null,{"$f":"IF('Ranking Sheet'!D10=0, \"\", 'Ranking Sheet'!D10)","v":""},{"$f":"IF('Ranking Sheet'!F10=0, \"\", 'Ranking Sheet'!F10)","v":""},{"$f":"IF('Ranking Sheet'!H10=0, \"\", 'Ranking Sheet'!H10)","v":""},{"$f":"IF('Ranking Sheet'!J10=0, \"\", 'Ranking Sheet'!J10)","v":""},{"$f":"IF('Ranking Sheet'!L10=0, \"\", 'Ranking Sheet'!L10)","v":""},{"$f":"IF('Ranking Sheet'!N10=0, \"\", 'Ranking Sheet'!N10)","v":""},{"$f":"IF('Ranking Sheet'!P10=0, \"\", 'Ranking Sheet'!P10)","v":""},{"$f":"IF('Ranking Sheet'!R10=0, \"\", 'Ranking Sheet'!R10)","v":""},"Category Total Points","Total Points Possible",null,"Subtotal Points","Subtotal Points Possible"]
["Category",null,null,1,2,3,4,5,6,7,8]
["SKILLS","Technique of Turns",null,null,null,null,null,null,null,null,null,{"$f":"IF(D9=0, \"\", SUM(D9:K9))","v":""},"/",{"$f":"IF(D9=\"\", \"\", IF(K9=0, 70, 80))","v":""}]
[null,"Technique of Leaps & Jumps",null,null,null,null,null,null,null,null,null,{"$f":"IF(D10=0, \"\", SUM(D10:K10))","v":""},"/",{"$f":"IF(D10=\"\", \"\", IF(K10=0, 70, 80))","v":""},{"$f":"IF(D9=0, \"\", SUM(D9:K10))","v":""},"/",{"$f":"IF(D9=\"\", \"\", IF(K9=0, 140, 160))","v":""}]
["CHOREOGRAPHY","Creativity",null,null,null,null,null,null,null,null,null,{"$f":"IF(D11=0, \"\", SUM(D11:K11))","v":""},"/",""]
[null,"Visual Effectiveness",null,null,null,null,null,null,null,null,null,"","/","",{"$f":"IF(D11=0, \"\", SUM(D11:K12))","v":""},"/",{"$f":"IF(D11=\"\", \"\", IF(K11=0, 140, 160))","v":""}]
["DIFFICULTY","Diffuculty of Routine Choreography",null,null,null,null,null,null,null,null,null,"","/",""]
[null,"Difficulty of Formations and Transitions",null,null,null,null,null,null,null,null,null,"","/",""]
[null,"Difficulty of Skills",null,null,null,null,null,null,null,null,null,"","/","",{"$f":"IF(D13=0, \"\", SUM(D13:K15))","v":""},"/",{"$f":"IF(D13=\"\", \"\", IF(K13=0, 210, 240))","v":""}]
["EXECUTION","Placement & Control",null,null,null,null,null,null,null,null,null,"","/",""]
[null,"Degree of Accuracy",null,null,null,null,null,null,null,null,null,"","/","",{"$f":"IF(D16=0, \"\", SUM(D16:K17))","v":""},"/",{"$f":"IF(D16=\"\", \"\", IF(K16=0, 140, 160))","v":""}]
["R.E.","Routine Effectiveness",null,null,null,null,null,null,null,null,null,"","/","",{"$f":"IF(D18=0, \"\", SUM(D18:K18))","v":""},"/",{"$f":"IF(D18=\"\", \"\", IF(K18=0, 70, 80))","v":""}]
[null,"SUB TOTALS",null,{"$f":"D9+D10+D11+D12+D13+D14+D15+D16+D17+D18","v":0},{"$f":"E9+E10+E11+E12+E13+E14+E15+E16+E17+E18","v":0},0,0,0,0,0,0,{"$f":"IF(D9=0, \"\", SUM(D19:K19))","v":""},"/",{"$f":"IF(D9=\"\", \"\", SUM(N9:N18))","v":""},{"$f":"IF(D9=0, \"\", SUM(O9:O18))","v":""},"/",{"$f":"IF(D9=\"\", \"\", SUM(Q9:Q18))","v":""}]
[null,"DEDUCTIONS \nEnter as a negative number i.e. -3 or DQ",null,null,null,null,null,null,null,null,null,{"$f":"IF(D20=\"\", \"\", IF(D20=\"DQ\",\"DQ\",SUM(D20:K20)))","v":""},null,null,{"$f":"IF(D20=\"\", \"\", IF(D20=\"DQ\",\"DQ\",SUM(D20:K20)))","v":""}]
[null,"TOTALS",null,{"$f":"IF(D20=\"DQ\", \"DQ\",SUM(D19+D20))","v":0},0,0,0,0,0,{"$f":"IF(J20=\"DQ\", \"DQ\",SUM(J19+J20))","v":0},{"$f":"IF(K20=\"DQ\", \"DQ\",SUM(K19+K20))","v":0},{"$f":"IF(D9=0, \"\", IF(D20=\"DQ\",\"DQ\",SUM(D21:K21)))","v":""},"/",{"$f":"IF(D9=\"\", \"\", SUM(N9:N18))","v":""},{"$f":"IF(D9=0, \"\", IF(D20=\"DQ\",\"DQ\",SUM(O19:O20)))","v":""},"/",{"$f":"IF(D9=\"\", \"\", SUM(Q9:Q18))","v":""}]
[]
[null,"KC/T #1","Time:",null,null,null,"Kick Count:",null,null,null,null,null,"# Comp:"]
[null,"KC/T #2","Time:",null,null,null,"Kick Count:",null,null,null,null,null,"# Comp:"]
[null,"KC/T #3","Time:",null,null,null,"Kick Count:",null,null,null,null,null,"# Comp:"]

{"sheet":"Team11","index":15,"n_rows":25,"n_cols":17,"rows_kept":25,"cut":false,"hidden":false,"merged":[[20,1,20,2],[16,1,16,2],[17,1,17,2],[14,1,14,2],[15,1,15,2],[10,1,10,2],[6,0,6,2],[7,0,7,2],[6,14,7,14],[6,11,7,11],[12,1,12,2],[19,1,19,2],[8,0,9,0],[10,0,11,0],[12,0,14,0],[15,0,16,0],[6,15,7,16],[0,0,0,16],[1,0,1,16],[3,2,3,7],[3,8,3,11],[3,12,3,16],[4,2,4,7],[4,8,4,11],[4,12,4,16],[6,12,7,13],[23,3,23,4],[23,8,23,9],[24,3,24,4],[24,8,24,9],[9,1,9,2],[8,1,8,2],[13,1,13,2],[11,1,11,2],[22,3,22,4],[22,8,22,9]]}
["Minnesota State High School League Dance Team Competition"]
["Jazz Judges Recap Sheet"]
[]
[null,"School:",{"$f":"IF('Ranking Sheet'!B22=0, \"\", 'Ranking Sheet'!B22)","v":""},null,null,null,null,null,"Class:",null,null,null,{"$f":"IF(Class=0, \"\", Class)","v":""}]
[null,"Meet Site:",{"$f":"IF(Site=0, \"\", Site)","v":""},null,null,null,null,null,"Meet Date:",null,null,null,{"$f":"IF(DATE=0, \"\", DATE)","v":""}]
[]
["Judge's Initials → ",null,null,{"$f":"IF('Ranking Sheet'!D10=0, \"\", 'Ranking Sheet'!D10)","v":""},{"$f":"IF('Ranking Sheet'!F10=0, \"\", 'Ranking Sheet'!F10)","v":""},{"$f":"IF('Ranking Sheet'!H10=0, \"\", 'Ranking Sheet'!H10)","v":""},{"$f":"IF('Ranking Sheet'!J10=0, \"\", 'Ranking Sheet'!J10)","v":""},{"$f":"IF('Ranking Sheet'!L10=0, \"\", 'Ranking Sheet'!L10)","v":""},{"$f":"IF('Ranking Sheet'!N10=0, \"\", 'Ranking Sheet'!N10)","v":""},{"$f":"IF('Ranking Sheet'!P10=0, \"\", 'Ranking Sheet'!P10)","v":""},{"$f":"IF('Ranking Sheet'!R10=0, \"\", 'Ranking Sheet'!R10)","v":""},"Category Total Points","Total Points Possible",null,"Subtotal Points","Subtotal Points Possible"]
["Category",null,null,1,2,3,4,5,6,7,8]
["SKILLS","Technique of Turns",null,null,null,null,null,null,null,null,null,{"$f":"IF(D9=0, \"\", SUM(D9:K9))","v":""},"/",{"$f":"IF(D9=\"\", \"\", IF(K9=0, 70, 80))","v":""}]
[null,"Technique of Leaps & Jumps",null,null,null,null,null,null,null,null,null,{"$f":"IF(D10=0, \"\", SUM(D10:K10))","v":""},"/",{"$f":"IF(D10=\"\", \"\", IF(K10=0, 70, 80))","v":""},{"$f":"IF(D9=0, \"\", SUM(D9:K10))","v":""},"/",{"$f":"IF(D9=\"\", \"\", IF(K9=0, 140, 160))","v":""}]
["CHOREOGRAPHY","Creativity",null,null,null,null,null,null,null,null,null,{"$f":"IF(D11=0, \"\", SUM(D11:K11))","v":""},"/",""]
[null,"Visual Effectiveness",null,null,null,null,null,null,null,null,null,"","/","",{"$f":"IF(D11=0, \"\", SUM(D11:K12))","v":""},"/",{"$f":"IF(D11=\"\", \"\", IF(K11=0, 140, 160))","v":""}]
["DIFFICULTY","Diffuculty of Routine Choreography",null,null,null,null,null,null,null,null,null,"","/",""]
[null,"Difficulty of Formations and Transitions",null,null,null,null,null,null,null,null,null,"","/",""]
[null,"Difficulty of Skills",null,null,null,null,null,null,null,null,null,"","/","",{"$f":"IF(D13=0, \"\", SUM(D13:K15))","v":""},"/",{"$f":"IF(D13=\"\", \"\", IF(K13=0, 210, 240))","v":""}]
["EXECUTION","Placement & Control",null,null,null,null,null,null,null,null,null,"","/",""]
[null,"Degree of Accuracy",null,null,null,null,null,null,null,null,null,"","/","",{"$f":"IF(D16=0, \"\", SUM(D16:K17))","v":""},"/",{"$f":"IF(D16=\"\", \"\", IF(K16=0, 140, 160))","v":""}]
["R.E.","Routine Effectiveness",null,null,null,null,null,null,null,null,null,"","/","",{"$f":"IF(D18=0, \"\", SUM(D18:K18))","v":""},"/",{"$f":"IF(D18=\"\", \"\", IF(K18=0, 70, 80))","v":""}]
[null,"SUB TOTALS",null,{"$f":"D9+D10+D11+D12+D13+D14+D15+D16+D17+D18","v":0},{"$f":"E9+E10+E11+E12+E13+E14+E15+E16+E17+E18","v":0},0,0,0,0,0,0,{"$f":"IF(D9=0, \"\", SUM(D19:K19))","v":""},"/",{"$f":"IF(D9=\"\", \"\", SUM(N9:N18))","v":""},{"$f":"IF(D9=0, \"\", SUM(O9:O18))","v":""},"/",{"$f":"IF(D9=\"\", \"\", SUM(Q9:Q18))","v":""}]
[null,"DEDUCTIONS \nEnter as a negative number i.e. -3 or DQ",null,null,null,null,null,null,null,null,null,{"$f":"IF(D20=\"\", \"\", IF(D20=\"DQ\",\"DQ\",SUM(D20:K20)))","v":""},null,null,{"$f":"IF(D20=\"\", \"\", IF(D20=\"DQ\",\"DQ\",SUM(D20:K20)))","v":""}]
[null,"TOTALS",null,{"$f":"IF(D20=\"DQ\", \"DQ\",SUM(D19+D20))","v":0},0,0,0,0,0,{"$f":"IF(J20=\"DQ\", \"DQ\",SUM(J19+J20))","v":0},{"$f":"IF(K20=\"DQ\", \"DQ\",SUM(K19+K20))","v":0},{"$f":"IF(D9=0, \"\", IF(D20=\"DQ\",\"DQ\",SUM(D21:K21)))","v":""},"/",{"$f":"IF(D9=\"\", \"\", SUM(N9:N18))","v":""},{"$f":"IF(D9=0, \"\", IF(D20=\"DQ\",\"DQ\",SUM(O19:O20)))","v":""},"/",{"$f":"IF(D9=\"\", \"\", SUM(Q9:Q18))","v":""}]
[]
[null,"KC/T #1","Time:",null,null,null,"Kick Count:",null,null,null,null,null,"# Comp:"]
[null,"KC/T #2","Time:",null,null,null,"Kick Count:",null,null,null,null,null,"# Comp:"]
[null,"KC/T #3","Time:",null,null,null,"Kick Count:",null,null,null,null,null,"# Comp:"]

{"sheet":"Team12","index":16,"n_rows":25,"n_cols":17,"rows_kept":25,"cut":false,"hidden":false,"merged":[[20,1,20,2],[16,1,16,2],[17,1,17,2],[14,1,14,2],[15,1,15,2],[10,1,10,2],[6,0,6,2],[7,0,7,2],[6,14,7,14],[6,11,7,11],[12,1,12,2],[19,1,19,2],[8,0,9,0],[10,0,11,0],[12,0,14,0],[15,0,16,0],[6,15,7,16],[0,0,0,16],[1,0,1,16],[3,2,3,7],[3,8,3,11],[3,12,3,16],[4,2,4,7],[4,8,4,11],[4,12,4,16],[6,12,7,13],[23,3,23,4],[23,8,23,9],[24,3,24,4],[24,8,24,9],[9,1,9,2],[8,1,8,2],[13,1,13,2],[11,1,11,2],[22,3,22,4],[22,8,22,9]]}
["Minnesota State High School League Dance Team Competition"]
["Jazz Judges Recap Sheet"]
[]
[null,"School:",{"$f":"IF('Ranking Sheet'!B23=0, \"\", 'Ranking Sheet'!B23)","v":""},null,null,null,null,null,"Class:",null,null,null,{"$f":"IF(Class=0, \"\", Class)","v":""}]
[null,"Meet Site:",{"$f":"IF(Site=0, \"\", Site)","v":""},null,null,null,null,null,"Meet Date:",null,null,null,{"$f":"IF(DATE=0, \"\", DATE)","v":""}]
[]
["Judge's Initials → ",null,null,{"$f":"IF('Ranking Sheet'!D10=0, \"\", 'Ranking Sheet'!D10)","v":""},{"$f":"IF('Ranking Sheet'!F10=0, \"\", 'Ranking Sheet'!F10)","v":""},{"$f":"IF('Ranking Sheet'!H10=0, \"\", 'Ranking Sheet'!H10)","v":""},{"$f":"IF('Ranking Sheet'!J10=0, \"\", 'Ranking Sheet'!J10)","v":""},{"$f":"IF('Ranking Sheet'!L10=0, \"\", 'Ranking Sheet'!L10)","v":""},{"$f":"IF('Ranking Sheet'!N10=0, \"\", 'Ranking Sheet'!N10)","v":""},{"$f":"IF('Ranking Sheet'!P10=0, \"\", 'Ranking Sheet'!P10)","v":""},{"$f":"IF('Ranking Sheet'!R10=0, \"\", 'Ranking Sheet'!R10)","v":""},"Category Total Points","Total Points Possible",null,"Subtotal Points","Subtotal Points Possible"]
["Category",null,null,1,2,3,4,5,6,7,8]
["SKILLS","Technique of Turns",null,null,null,null,null,null,null,null,null,{"$f":"IF(D9=0, \"\", SUM(D9:K9))","v":""},"/",{"$f":"IF(D9=\"\", \"\", IF(K9=0, 70, 80))","v":""}]
[null,"Technique of Leaps & Jumps",null,null,null,null,null,null,null,null,null,{"$f":"IF(D10=0, \"\", SUM(D10:K10))","v":""},"/",{"$f":"IF(D10=\"\", \"\", IF(K10=0, 70, 80))","v":""},{"$f":"IF(D9=0, \"\", SUM(D9:K10))","v":""},"/",{"$f":"IF(D9=\"\", \"\", IF(K9=0, 140, 160))","v":""}]
["CHOREOGRAPHY","Creativity",null,null,null,null,null,null,null,null,null,{"$f":"IF(D11=0, \"\", SUM(D11:K11))","v":""},"/",""]
[null,"Visual Effectiveness",null,null,null,null,null,null,null,null,null,"","/","",{"$f":"IF(D11=0, \"\", SUM(D11:K12))","v":""},"/",{"$f":"IF(D11=\"\", \"\", IF(K11=0, 140, 160))","v":""}]
["DIFFICULTY","Diffuculty of Routine Choreography",null,null,null,null,null,null,null,null,null,"","/",""]
[null,"Difficulty of Formations and Transitions",null,null,null,null,null,null,null,null,null,"","/",""]
[null,"Difficulty of Skills",null,null,null,null,null,null,null,null,null,"","/","",{"$f":"IF(D13=0, \"\", SUM(D13:K15))","v":""},"/",{"$f":"IF(D13=\"\", \"\", IF(K13=0, 210, 240))","v":""}]
["EXECUTION","Placement & Control",null,null,null,null,null,null,null,null,null,"","/",""]
[null,"Degree of Accuracy",null,null,null,null,null,null,null,null,null,"","/","",{"$f":"IF(D16=0, \"\", SUM(D16:K17))","v":""},"/",{"$f":"IF(D16=\"\", \"\", IF(K16=0, 140, 160))","v":""}]
["R.E.","Routine Effectiveness",null,null,null,null,null,null,null,null,null,"","/","",{"$f":"IF(D18=0, \"\", SUM(D18:K18))","v":""},"/",{"$f":"IF(D18=\"\", \"\", IF(K18=0, 70, 80))","v":""}]
[null,"SUB TOTALS",null,{"$f":"D9+D10+D11+D12+D13+D14+D15+D16+D17+D18","v":0},{"$f":"E9+E10+E11+E12+E13+E14+E15+E16+E17+E18","v":0},0,0,0,0,0,0,{"$f":"IF(D9=0, \"\", SUM(D19:K19))","v":""},"/",{"$f":"IF(D9=\"\", \"\", SUM(N9:N18))","v":""},{"$f":"IF(D9=0, \"\", SUM(O9:O18))","v":""},"/",{"$f":"IF(D9=\"\", \"\", SUM(Q9:Q18))","v":""}]
[null,"DEDUCTIONS \nEnter as a negative number i.e. -3 or DQ",null,null,null,null,null,null,null,null,null,{"$f":"IF(D20=\"\", \"\", IF(D20=\"DQ\",\"DQ\",SUM(D20:K20)))","v":""},null,null,{"$f":"IF(D20=\"\", \"\", IF(D20=\"DQ\",\"DQ\",SUM(D20:K20)))","v":""}]
[null,"TOTALS",null,{"$f":"IF(D20=\"DQ\", \"DQ\",SUM(D19+D20))","v":0},0,0,0,0,0,{"$f":"IF(J20=\"DQ\", \"DQ\",SUM(J19+J20))","v":0},{"$f":"IF(K20=\"DQ\", \"DQ\",SUM(K19+K20))","v":0},{"$f":"IF(D9=0, \"\", IF(D20=\"DQ\",\"DQ\",SUM(D21:K21)))","v":""},"/",{"$f":"IF(D9=\"\", \"\", SUM(N9:N18))","v":""},{"$f":"IF(D9=0, \"\", IF(D20=\"DQ\",\"DQ\",SUM(O19:O20)))","v":""},"/",{"$f":"IF(D9=\"\", \"\", SUM(Q9:Q18))","v":""}]
[]
[null,"KC/T #1","Time:",null,null,null,"Kick Count:",null,null,null,null,null,"# Comp:"]
[null,"KC/T #2","Time:",null,null,null,"Kick Count:",null,null,null,null,null,"# Comp:"]
[null,"KC/T #3","Time:",null,null,null,"Kick Count:",null,null,null,null,null,"# Comp:"]

{"sheet":"Team13","index":17,"n_rows":25,"n_cols":17,"rows_kept":25,"cut":false,"hidden":false,"merged":[[20,1,20,2],[16,1,16,2],[17,1,17,2],[14,1,14,2],[15,1,15,2],[10,1,10,2],[6,0,6,2],[7,0,7,2],[6,14,7,14],[6,11,7,11],[12,1,12,2],[19,1,19,2],[8,0,9,0],[10,0,11,0],[12,0,14,0],[15,0,16,0],[6,15,7,16],[0,0,0,16],[1,0,1,16],[3,2,3,7],[3,8,3,11],[3,12,3,16],[4,2,4,7],[4,8,4,11],[4,12,4,16],[6,12,7,13],[23,3,23,4],[23,8,23,9],[24,3,24,4],[24,8,24,9],[9,1,9,2],[8,1,8,2],[13,1,13,2],[11,1,11,2],[22,3,22,4],[22,8,22,9]]}
["Minnesota State High School League Dance Team Competition"]
["Jazz Judges Recap Sheet"]
[]
[null,"School:",{"$f":"IF('Ranking Sheet'!B24=0, \"\", 'Ranking Sheet'!B24)","v":""},null,null,null,null,null,"Class:",null,null,null,{"$f":"IF(Class=0, \"\", Class)","v":""}]
[null,"Meet Site:",{"$f":"IF(Site=0, \"\", Site)","v":""},null,null,null,null,null,"Meet Date:",null,null,null,{"$f":"IF(DATE=0, \"\", DATE)","v":""}]
[]
["Judge's Initials → ",null,null,{"$f":"IF('Ranking Sheet'!D10=0, \"\", 'Ranking Sheet'!D10)","v":""},{"$f":"IF('Ranking Sheet'!F10=0, \"\", 'Ranking Sheet'!F10)","v":""},{"$f":"IF('Ranking Sheet'!H10=0, \"\", 'Ranking Sheet'!H10)","v":""},{"$f":"IF('Ranking Sheet'!J10=0, \"\", 'Ranking Sheet'!J10)","v":""},{"$f":"IF('Ranking Sheet'!L10=0, \"\", 'Ranking Sheet'!L10)","v":""},{"$f":"IF('Ranking Sheet'!N10=0, \"\", 'Ranking Sheet'!N10)","v":""},{"$f":"IF('Ranking Sheet'!P10=0, \"\", 'Ranking Sheet'!P10)","v":""},{"$f":"IF('Ranking Sheet'!R10=0, \"\", 'Ranking Sheet'!R10)","v":""},"Category Total Points","Total Points Possible",null,"Subtotal Points","Subtotal Points Possible"]
["Category",null,null,1,2,3,4,5,6,7,8]
["SKILLS","Technique of Turns",null,null,null,null,null,null,null,null,null,{"$f":"IF(D9=0, \"\", SUM(D9:K9))","v":""},"/",{"$f":"IF(D9=\"\", \"\", IF(K9=0, 70, 80))","v":""}]
[null,"Technique of Leaps & Jumps",null,null,null,null,null,null,null,null,null,{"$f":"IF(D10=0, \"\", SUM(D10:K10))","v":""},"/",{"$f":"IF(D10=\"\", \"\", IF(K10=0, 70, 80))","v":""},{"$f":"IF(D9=0, \"\", SUM(D9:K10))","v":""},"/",{"$f":"IF(D9=\"\", \"\", IF(K9=0, 140, 160))","v":""}]
["CHOREOGRAPHY","Creativity",null,null,null,null,null,null,null,null,null,{"$f":"IF(D11=0, \"\", SUM(D11:K11))","v":""},"/",""]
[null,"Visual Effectiveness",null,null,null,null,null,null,null,null,null,"","/","",{"$f":"IF(D11=0, \"\", SUM(D11:K12))","v":""},"/",{"$f":"IF(D11=\"\", \"\", IF(K11=0, 140, 160))","v":""}]
["DIFFICULTY","Diffuculty of Routine Choreography",null,null,null,null,null,null,null,null,null,"","/",""]
[null,"Difficulty of Formations and Transitions",null,null,null,null,null,null,null,null,null,"","/",""]
[null,"Difficulty of Skills",null,null,null,null,null,null,null,null,null,"","/","",{"$f":"IF(D13=0, \"\", SUM(D13:K15))","v":""},"/",{"$f":"IF(D13=\"\", \"\", IF(K13=0, 210, 240))","v":""}]
["EXECUTION","Placement & Control",null,null,null,null,null,null,null,null,null,"","/",""]
[null,"Degree of Accuracy",null,null,null,null,null,null,null,null,null,"","/","",{"$f":"IF(D16=0, \"\", SUM(D16:K17))","v":""},"/",{"$f":"IF(D16=\"\", \"\", IF(K16=0, 140, 160))","v":""}]
["R.E.","Routine Effectiveness",null,null,null,null,null,null,null,null,null,"","/","",{"$f":"IF(D18=0, \"\", SUM(D18:K18))","v":""},"/",{"$f":"IF(D18=\"\", \"\", IF(K18=0, 70, 80))","v":""}]
[null,"SUB TOTALS",null,{"$f":"D9+D10+D11+D12+D13+D14+D15+D16+D17+D18","v":0},{"$f":"E9+E10+E11+E12+E13+E14+E15+E16+E17+E18","v":0},0,0,0,0,0,0,{"$f":"IF(D9=0, \"\", SUM(D19:K19))","v":""},"/",{"$f":"IF(D9=\"\", \"\", SUM(N9:N18))","v":""},{"$f":"IF(D9=0, \"\", SUM(O9:O18))","v":""},"/",{"$f":"IF(D9=\"\", \"\", SUM(Q9:Q18))","v":""}]
[null,"DEDUCTIONS \nEnter as a negative number i.e. -3 or DQ",null,null,null,null,null,null,null,null,null,{"$f":"IF(D20=\"\", \"\", IF(D20=\"DQ\",\"DQ\",SUM(D20:K20)))","v":""},null,null,{"$f":"IF(D20=\"\", \"\", IF(D20=\"DQ\",\"DQ\",SUM(D20:K20)))","v":""}]
[null,"TOTALS",null,{"$f":"IF(D20=\"DQ\", \"DQ\",SUM(D19+D20))","v":0},0,0,0,0,0,{"$f":"IF(J20=\"DQ\", \"DQ\",SUM(J19+J20))","v":0},{"$f":"IF(K20=\"DQ\", \"DQ\",SUM(K19+K20))","v":0},{"$f":"IF(D9=0, \"\", IF(D20=\"DQ\",\"DQ\",SUM(D21:K21)))","v":""},"/",{"$f":"IF(D9=\"\", \"\", SUM(N9:N18))","v":""},{"$f":"IF(D9=0, \"\", IF(D20=\"DQ\",\"DQ\",SUM(O19:O20)))","v":""},"/",{"$f":"IF(D9=\"\", \"\", SUM(Q9:Q18))","v":""}]
[]
[null,"KC/T #1","Time:",null,null,null,"Kick Count:",null,null,null,null,null,"# Comp:"]
[null,"KC/T #2","Time:",null,null,null,"Kick Count:",null,null,null,null,null,"# Comp:"]
[null,"KC/T #3","Time:",null,null,null,"Kick Count:",null,null,null,null,null,"# Comp:"]

{"sheet":"Team14","index":18,"n_rows":25,"n_cols":17,"rows_kept":25,"cut":false,"hidden":false,"merged":[[20,1,20,2],[16,1,16,2],[17,1,17,2],[14,1,14,2],[15,1,15,2],[10,1,10,2],[6,0,6,2],[7,0,7,2],[6,14,7,14],[6,11,7,11],[12,1,12,2],[19,1,19,2],[8,0,9,0],[10,0,11,0],[12,0,14,0],[15,0,16,0],[6,15,7,16],[0,0,0,16],[1,0,1,16],[3,2,3,7],[3,8,3,11],[3,12,3,16],[4,2,4,7],[4,8,4,11],[4,12,4,16],[6,12,7,13],[23,3,23,4],[23,8,23,9],[24,3,24,4],[24,8,24,9],[9,1,9,2],[8,1,8,2],[13,1,13,2],[11,1,11,2],[22,3,22,4],[22,8,22,9]]}
["Minnesota State High School League Dance Team Competition"]
["Jazz Judges Recap Sheet"]
[]
[null,"School:",{"$f":"IF('Ranking Sheet'!B25=0, \"\", 'Ranking Sheet'!B25)","v":""},null,null,null,null,null,"Class:",null,null,null,{"$f":"IF(Class=0, \"\", Class)","v":""}]
[null,"Meet Site:",{"$f":"IF(Site=0, \"\", Site)","v":""},null,null,null,null,null,"Meet Date:",null,null,null,{"$f":"IF(DATE=0, \"\", DATE)","v":""}]
[]
["Judge's Initials → ",null,null,{"$f":"IF('Ranking Sheet'!D10=0, \"\", 'Ranking Sheet'!D10)","v":""},{"$f":"IF('Ranking Sheet'!F10=0, \"\", 'Ranking Sheet'!F10)","v":""},{"$f":"IF('Ranking Sheet'!H10=0, \"\", 'Ranking Sheet'!H10)","v":""},{"$f":"IF('Ranking Sheet'!J10=0, \"\", 'Ranking Sheet'!J10)","v":""},{"$f":"IF('Ranking Sheet'!L10=0, \"\", 'Ranking Sheet'!L10)","v":""},{"$f":"IF('Ranking Sheet'!N10=0, \"\", 'Ranking Sheet'!N10)","v":""},{"$f":"IF('Ranking Sheet'!P10=0, \"\", 'Ranking Sheet'!P10)","v":""},{"$f":"IF('Ranking Sheet'!R10=0, \"\", 'Ranking Sheet'!R10)","v":""},"Category Total Points","Total Points Possible",null,"Subtotal Points","Subtotal Points Possible"]
["Category",null,null,1,2,3,4,5,6,7,8]
["SKILLS","Technique of Turns",null,null,null,null,null,null,null,null,null,{"$f":"IF(D9=0, \"\", SUM(D9:K9))","v":""},"/",{"$f":"IF(D9=\"\", \"\", IF(K9=0, 70, 80))","v":""}]
[null,"Technique of Leaps & Jumps",null,null,null,null,null,null,null,null,null,{"$f":"IF(D10=0, \"\", SUM(D10:K10))","v":""},"/",{"$f":"IF(D10=\"\", \"\", IF(K10=0, 70, 80))","v":""},{"$f":"IF(D9=0, \"\", SUM(D9:K10))","v":""},"/",{"$f":"IF(D9=\"\", \"\", IF(K9=0, 140, 160))","v":""}]
["CHOREOGRAPHY","Creativity",null,null,null,null,null,null,null,null,null,{"$f":"IF(D11=0, \"\", SUM(D11:K11))","v":""},"/",""]
[null,"Visual Effectiveness",null,null,null,null,null,null,null,null,null,"","/","",{"$f":"IF(D11=0, \"\", SUM(D11:K12))","v":""},"/",{"$f":"IF(D11=\"\", \"\", IF(K11=0, 140, 160))","v":""}]
["DIFFICULTY","Diffuculty of Routine Choreography",null,null,null,null,null,null,null,null,null,"","/",""]
[null,"Difficulty of Formations and Transitions",null,null,null,null,null,null,null,null,null,"","/",""]
[null,"Difficulty of Skills",null,null,null,null,null,null,null,null,null,"","/","",{"$f":"IF(D13=0, \"\", SUM(D13:K15))","v":""},"/",{"$f":"IF(D13=\"\", \"\", IF(K13=0, 210, 240))","v":""}]
["EXECUTION","Placement & Control",null,null,null,null,null,null,null,null,null,"","/",""]
[null,"Degree of Accuracy",null,null,null,null,null,null,null,null,null,"","/","",{"$f":"IF(D16=0, \"\", SUM(D16:K17))","v":""},"/",{"$f":"IF(D16=\"\", \"\", IF(K16=0, 140, 160))","v":""}]
["R.E.","Routine Effectiveness",null,null,null,null,null,null,null,null,null,"","/","",{"$f":"IF(D18=0, \"\", SUM(D18:K18))","v":""},"/",{"$f":"IF(D18=\"\", \"\", IF(K18=0, 70, 80))","v":""}]
[null,"SUB TOTALS",null,{"$f":"D9+D10+D11+D12+D13+D14+D15+D16+D17+D18","v":0},{"$f":"E9+E10+E11+E12+E13+E14+E15+E16+E17+E18","v":0},0,0,0,0,0,0,{"$f":"IF(D9=0, \"\", SUM(D19:K19))","v":""},"/",{"$f":"IF(D9=\"\", \"\", SUM(N9:N18))","v":""},{"$f":"IF(D9=0, \"\", SUM(O9:O18))","v":""},"/",{"$f":"IF(D9=\"\", \"\", SUM(Q9:Q18))","v":""}]
[null,"DEDUCTIONS \nEnter as a negative number i.e. -3 or DQ",null,null,null,null,null,null,null,null,null,{"$f":"IF(D20=\"\", \"\", IF(D20=\"DQ\",\"DQ\",SUM(D20:K20)))","v":""},null,null,{"$f":"IF(D20=\"\", \"\", IF(D20=\"DQ\",\"DQ\",SUM(D20:K20)))","v":""}]
[null,"TOTALS",null,{"$f":"IF(D20=\"DQ\", \"DQ\",SUM(D19+D20))","v":0},0,0,0,0,0,{"$f":"IF(J20=\"DQ\", \"DQ\",SUM(J19+J20))","v":0},{"$f":"IF(K20=\"DQ\", \"DQ\",SUM(K19+K20))","v":0},{"$f":"IF(D9=0, \"\", IF(D20=\"DQ\",\"DQ\",SUM(D21:K21)))","v":""},"/",{"$f":"IF(D9=\"\", \"\", SUM(N9:N18))","v":""},{"$f":"IF(D9=0, \"\", IF(D20=\"DQ\",\"DQ\",SUM(O19:O20)))","v":""},"/",{"$f":"IF(D9=\"\", \"\", SUM(Q9:Q18))","v":""}]
[]
[null,"KC/T #1","Time:",null,null,null,"Kick Count:",null,null,null,null,null,"# Comp:"]
[null,"KC/T #2","Time:",null,null,null,"Kick Count:",null,null,null,null,null,"# Comp:"]
[null,"KC/T #3","Time:",null,null,null,"Kick Count:",null,null,null,null,null,"# Comp:"]

{"sheet":"Team15","index":19,"n_rows":25,"n_cols":17,"rows_kept":25,"cut":false,"hidden":false,"merged":[[20,1,20,2],[16,1,16,2],[17,1,17,2],[14,1,14,2],[15,1,15,2],[10,1,10,2],[6,0,6,2],[7,0,7,2],[6,14,7,14],[6,11,7,11],[12,1,12,2],[19,1,19,2],[8,0,9,0],[10,0,11,0],[12,0,14,0],[15,0,16,0],[6,15,7,16],[0,0,0,16],[1,0,1,16],[3,2,3,7],[3,8,3,11],[3,12,3,16],[4,2,4,7],[4,8,4,11],[4,12,4,16],[6,12,7,13],[23,3,23,4],[23,8,23,9],[24,3,24,4],[24,8,24,9],[9,1,9,2],[8,1,8,2],[13,1,13,2],[11,1,11,2],[22,3,22,4],[22,8,22,9]]}
["Minnesota State High School League Dance Team Competition"]
["Jazz Judges Recap Sheet"]
[]
[null,"School:",{"$f":"IF('Ranking Sheet'!B26=0, \"\", 'Ranking Sheet'!B26)","v":""},null,null,null,null,null,"Class:",null,null,null,{"$f":"IF(Class=0, \"\", Class)","v":""}]
[null,"Meet Site:",{"$f":"IF(Site=0, \"\", Site)","v":""},null,null,null,null,null,"Meet Date:",null,null,null,{"$f":"IF(DATE=0, \"\", DATE)","v":""}]
[]
["Judge's Initials → ",null,null,{"$f":"IF('Ranking Sheet'!D10=0, \"\", 'Ranking Sheet'!D10)","v":""},{"$f":"IF('Ranking Sheet'!F10=0, \"\", 'Ranking Sheet'!F10)","v":""},{"$f":"IF('Ranking Sheet'!H10=0, \"\", 'Ranking Sheet'!H10)","v":""},{"$f":"IF('Ranking Sheet'!J10=0, \"\", 'Ranking Sheet'!J10)","v":""},{"$f":"IF('Ranking Sheet'!L10=0, \"\", 'Ranking Sheet'!L10)","v":""},{"$f":"IF('Ranking Sheet'!N10=0, \"\", 'Ranking Sheet'!N10)","v":""},{"$f":"IF('Ranking Sheet'!P10=0, \"\", 'Ranking Sheet'!P10)","v":""},{"$f":"IF('Ranking Sheet'!R10=0, \"\", 'Ranking Sheet'!R10)","v":""},"Category Total Points","Total Points Possible",null,"Subtotal Points","Subtotal Points Possible"]
["Category",null,null,1,2,3,4,5,6,7,8]
["SKILLS","Technique of Turns",null,null,null,null,null,null,null,null,null,{"$f":"IF(D9=0, \"\", SUM(D9:K9))","v":""},"/",{"$f":"IF(D9=\"\", \"\", IF(K9=0, 70, 80))","v":""}]
[null,"Technique of Leaps & Jumps",null,null,null,null,null,null,null,null,null,{"$f":"IF(D10=0, \"\", SUM(D10:K10))","v":""},"/",{"$f":"IF(D10=\"\", \"\", IF(K10=0, 70, 80))","v":""},{"$f":"IF(D9=0, \"\", SUM(D9:K10))","v":""},"/",{"$f":"IF(D9=\"\", \"\", IF(K9=0, 140, 160))","v":""}]
["CHOREOGRAPHY","Creativity",null,null,null,null,null,null,null,null,null,{"$f":"IF(D11=0, \"\", SUM(D11:K11))","v":""},"/",""]
[null,"Visual Effectiveness",null,null,null,null,null,null,null,null,null,"","/","",{"$f":"IF(D11=0, \"\", SUM(D11:K12))","v":""},"/",{"$f":"IF(D11=\"\", \"\", IF(K11=0, 140, 160))","v":""}]
["DIFFICULTY","Diffuculty of Routine Choreography",null,null,null,null,null,null,null,null,null,"","/",""]
[null,"Difficulty of Formations and Transitions",null,null,null,null,null,null,null,null,null,"","/",""]
[null,"Difficulty of Skills",null,null,null,null,null,null,null,null,null,"","/","",{"$f":"IF(D13=0, \"\", SUM(D13:K15))","v":""},"/",{"$f":"IF(D13=\"\", \"\", IF(K13=0, 210, 240))","v":""}]
["EXECUTION","Placement & Control",null,null,null,null,null,null,null,null,null,"","/",""]
[null,"Degree of Accuracy",null,null,null,null,null,null,null,null,null,"","/","",{"$f":"IF(D16=0, \"\", SUM(D16:K17))","v":""},"/",{"$f":"IF(D16=\"\", \"\", IF(K16=0, 140, 160))","v":""}]
["R.E.","Routine Effectiveness",null,null,null,null,null,null,null,null,null,"","/","",{"$f":"IF(D18=0, \"\", SUM(D18:K18))","v":""},"/",{"$f":"IF(D18=\"\", \"\", IF(K18=0, 70, 80))","v":""}]
[null,"SUB TOTALS",null,{"$f":"D9+D10+D11+D12+D13+D14+D15+D16+D17+D18","v":0},{"$f":"E9+E10+E11+E12+E13+E14+E15+E16+E17+E18","v":0},0,0,0,0,0,0,{"$f":"IF(D9=0, \"\", SUM(D19:K19))","v":""},"/",{"$f":"IF(D9=\"\", \"\", SUM(N9:N18))","v":""},{"$f":"IF(D9=0, \"\", SUM(O9:O18))","v":""},"/",{"$f":"IF(D9=\"\", \"\", SUM(Q9:Q18))","v":""}]
[null,"DEDUCTIONS \nEnter as a negative number i.e. -3 or DQ",null,null,null,null,null,null,null,null,null,{"$f":"IF(D20=\"\", \"\", IF(D20=\"DQ\",\"DQ\",SUM(D20:K20)))","v":""},null,null,{"$f":"IF(D20=\"\", \"\", IF(D20=\"DQ\",\"DQ\",SUM(D20:K20)))","v":""}]
[null,"TOTALS",null,{"$f":"IF(D20=\"DQ\", \"DQ\",SUM(D19+D20))","v":0},0,0,0,0,0,{"$f":"IF(J20=\"DQ\", \"DQ\",SUM(J19+J20))","v":0},{"$f":"IF(K20=\"DQ\", \"DQ\",SUM(K19+K20))","v":0},{"$f":"IF(D9=0, \"\", IF(D20=\"DQ\",\"DQ\",SUM(D21:K21)))","v":""},"/",{"$f":"IF(D9=\"\", \"\", SUM(N9:N18))","v":""},{"$f":"IF(D9=0, \"\", IF(D20=\"DQ\",\"DQ\",SUM(O19:O20)))","v":""},"/",{"$f":"IF(D9=\"\", \"\", SUM(Q9:Q18))","v":""}]
[]
[null,"KC/T #1","Time:",null,null,null,"Kick Count:",null,null,null,null,null,"# Comp:"]
[null,"KC/T #2","Time:",null,null,null,"Kick Count:",null,null,null,null,null,"# Comp:"]
[null,"KC/T #3","Time:",null,null,null,"Kick Count:",null,null,null,null,null,"# Comp:"]

{"sheet":"Team16","index":20,"n_rows":25,"n_cols":17,"rows_kept":25,"cut":false,"hidden":false,"merged":[[20,1,20,2],[16,1,16,2],[17,1,17,2],[14,1,14,2],[15,1,15,2],[10,1,10,2],[6,0,6,2],[7,0,7,2],[6,14,7,14],[6,11,7,11],[12,1,12,2],[19,1,19,2],[8,0,9,0],[10,0,11,0],[12,0,14,0],[15,0,16,0],[6,15,7,16],[0,0,0,16],[1,0,1,16],[3,2,3,7],[3,8,3,11],[3,12,3,16],[4,2,4,7],[4,8,4,11],[4,12,4,16],[6,12,7,13],[23,3,23,4],[23,8,23,9],[24,3,24,4],[24,8,24,9],[9,1,9,2],[8,1,8,2],[13,1,13,2],[11,1,11,2],[22,3,22,4],[22,8,22,9]]}
["Minnesota State High School League Dance Team Competition"]
["Jazz Judges Recap Sheet"]
[]
[null,"School:",{"$f":"IF('Ranking Sheet'!B27=0, \"\", 'Ranking Sheet'!B27)","v":""},null,null,null,null,null,"Class:",null,null,null,{"$f":"IF(Class=0, \"\", Class)","v":""}]
[null,"Meet Site:",{"$f":"IF(Site=0, \"\", Site)","v":""},null,null,null,null,null,"Meet Date:",null,null,null,{"$f":"IF(DATE=0, \"\", DATE)","v":""}]
[]
["Judge's Initials → ",null,null,{"$f":"IF('Ranking Sheet'!D10=0, \"\", 'Ranking Sheet'!D10)","v":""},{"$f":"IF('Ranking Sheet'!F10=0, \"\", 'Ranking Sheet'!F10)","v":""},{"$f":"IF('Ranking Sheet'!H10=0, \"\", 'Ranking Sheet'!H10)","v":""},{"$f":"IF('Ranking Sheet'!J10=0, \"\", 'Ranking Sheet'!J10)","v":""},{"$f":"IF('Ranking Sheet'!L10=0, \"\", 'Ranking Sheet'!L10)","v":""},{"$f":"IF('Ranking Sheet'!N10=0, \"\", 'Ranking Sheet'!N10)","v":""},{"$f":"IF('Ranking Sheet'!P10=0, \"\", 'Ranking Sheet'!P10)","v":""},{"$f":"IF('Ranking Sheet'!R10=0, \"\", 'Ranking Sheet'!R10)","v":""},"Category Total Points","Total Points Possible",null,"Subtotal Points","Subtotal Points Possible"]
["Category",null,null,1,2,3,4,5,6,7,8]
["SKILLS","Technique of Turns",null,null,null,null,null,null,null,null,null,{"$f":"IF(D9=0, \"\", SUM(D9:K9))","v":""},"/",{"$f":"IF(D9=\"\", \"\", IF(K9=0, 70, 80))","v":""}]
[null,"Technique of Leaps & Jumps",null,null,null,null,null,null,null,null,null,{"$f":"IF(D10=0, \"\", SUM(D10:K10))","v":""},"/",{"$f":"IF(D10=\"\", \"\", IF(K10=0, 70, 80))","v":""},{"$f":"IF(D9=0, \"\", SUM(D9:K10))","v":""},"/",{"$f":"IF(D9=\"\", \"\", IF(K9=0, 140, 160))","v":""}]
["CHOREOGRAPHY","Creativity",null,null,null,null,null,null,null,null,null,{"$f":"IF(D11=0, \"\", SUM(D11:K11))","v":""},"/",""]
[null,"Visual Effectiveness",null,null,null,null,null,null,null,null,null,"","/","",{"$f":"IF(D11=0, \"\", SUM(D11:K12))","v":""},"/",{"$f":"IF(D11=\"\", \"\", IF(K11=0, 140, 160))","v":""}]
["DIFFICULTY","Diffuculty of Routine Choreography",null,null,null,null,null,null,null,null,null,"","/",""]
[null,"Difficulty of Formations and Transitions",null,null,null,null,null,null,null,null,null,"","/",""]
[null,"Difficulty of Skills",null,null,null,null,null,null,null,null,null,"","/","",{"$f":"IF(D13=0, \"\", SUM(D13:K15))","v":""},"/",{"$f":"IF(D13=\"\", \"\", IF(K13=0, 210, 240))","v":""}]
["EXECUTION","Placement & Control",null,null,null,null,null,null,null,null,null,"","/",""]
[null,"Degree of Accuracy",null,null,null,null,null,null,null,null,null,"","/","",{"$f":"IF(D16=0, \"\", SUM(D16:K17))","v":""},"/",{"$f":"IF(D16=\"\", \"\", IF(K16=0, 140, 160))","v":""}]
["R.E.","Routine Effectiveness",null,null,null,null,null,null,null,null,null,"","/","",{"$f":"IF(D18=0, \"\", SUM(D18:K18))","v":""},"/",{"$f":"IF(D18=\"\", \"\", IF(K18=0, 70, 80))","v":""}]
[null,"SUB TOTALS",null,{"$f":"D9+D10+D11+D12+D13+D14+D15+D16+D17+D18","v":0},{"$f":"E9+E10+E11+E12+E13+E14+E15+E16+E17+E18","v":0},0,0,0,0,0,0,{"$f":"IF(D9=0, \"\", SUM(D19:K19))","v":""},"/",{"$f":"IF(D9=\"\", \"\", SUM(N9:N18))","v":""},{"$f":"IF(D9=0, \"\", SUM(O9:O18))","v":""},"/",{"$f":"IF(D9=\"\", \"\", SUM(Q9:Q18))","v":""}]
[null,"DEDUCTIONS \nEnter as a negative number i.e. -3 or DQ",null,null,null,null,null,null,null,null,null,{"$f":"IF(D20=\"\", \"\", IF(D20=\"DQ\",\"DQ\",SUM(D20:K20)))","v":""},null,null,{"$f":"IF(D20=\"\", \"\", IF(D20=\"DQ\",\"DQ\",SUM(D20:K20)))","v":""}]
[null,"TOTALS",null,{"$f":"IF(D20=\"DQ\", \"DQ\",SUM(D19+D20))","v":0},0,0,0,0,0,{"$f":"IF(J20=\"DQ\", \"DQ\",SUM(J19+J20))","v":0},{"$f":"IF(K20=\"DQ\", \"DQ\",SUM(K19+K20))","v":0},{"$f":"IF(D9=0, \"\", IF(D20=\"DQ\",\"DQ\",SUM(D21:K21)))","v":""},"/",{"$f":"IF(D9=\"\", \"\", SUM(N9:N18))","v":""},{"$f":"IF(D9=0, \"\", IF(D20=\"DQ\",\"DQ\",SUM(O19:O20)))","v":""},"/",{"$f":"IF(D9=\"\", \"\", SUM(Q9:Q18))","v":""}]
[]
[null,"KC/T #1","Time:",null,null,null,"Kick Count:",null,null,null,null,null,"# Comp:"]
[null,"KC/T #2","Time:",null,null,null,"Kick Count:",null,null,null,null,null,"# Comp:"]
[null,"KC/T #3","Time:",null,null,null,"Kick Count:",null,null,null,null,null,"# Comp:"]

{"sheet":"Team17","index":21,"n_rows":25,"n_cols":17,"rows_kept":25,"cut":false,"hidden":false,"merged":[[20,1,20,2],[16,1,16,2],[17,1,17,2],[14,1,14,2],[15,1,15,2],[10,1,10,2],[6,0,6,2],[7,0,7,2],[6,14,7,14],[6,11,7,11],[12,1,12,2],[19,1,19,2],[8,0,9,0],[10,0,11,0],[12,0,14,0],[15,0,16,0],[6,15,7,16],[0,0,0,16],[1,0,1,16],[3,2,3,7],[3,8,3,11],[3,12,3,16],[4,2,4,7],[4,8,4,11],[4,12,4,16],[6,12,7,13],[23,3,23,4],[23,8,23,9],[24,3,24,4],[24,8,24,9],[9,1,9,2],[8,1,8,2],[13,1,13,2],[11,1,11,2],[22,3,22,4],[22,8,22,9]]}
["Minnesota State High School League Dance Team Competition"]
["Jazz Judges Recap Sheet"]
[]
[null,"School:",{"$f":"IF('Ranking Sheet'!B28=0, \"\", 'Ranking Sheet'!B28)","v":""},null,null,null,null,null,"Class:",null,null,null,{"$f":"IF(Class=0, \"\", Class)","v":""}]
[null,"Meet Site:",{"$f":"IF(Site=0, \"\", Site)","v":""},null,null,null,null,null,"Meet Date:",null,null,null,{"$f":"IF(DATE=0, \"\", DATE)","v":""}]
[]
["Judge's Initials → ",null,null,{"$f":"IF('Ranking Sheet'!D10=0, \"\", 'Ranking Sheet'!D10)","v":""},{"$f":"IF('Ranking Sheet'!F10=0, \"\", 'Ranking Sheet'!F10)","v":""},{"$f":"IF('Ranking Sheet'!H10=0, \"\", 'Ranking Sheet'!H10)","v":""},{"$f":"IF('Ranking Sheet'!J10=0, \"\", 'Ranking Sheet'!J10)","v":""},{"$f":"IF('Ranking Sheet'!L10=0, \"\", 'Ranking Sheet'!L10)","v":""},{"$f":"IF('Ranking Sheet'!N10=0, \"\", 'Ranking Sheet'!N10)","v":""},{"$f":"IF('Ranking Sheet'!P10=0, \"\", 'Ranking Sheet'!P10)","v":""},{"$f":"IF('Ranking Sheet'!R10=0, \"\", 'Ranking Sheet'!R10)","v":""},"Category Total Points","Total Points Possible",null,"Subtotal Points","Subtotal Points Possible"]
["Category",null,null,1,2,3,4,5,6,7,8]
["SKILLS","Technique of Turns",null,null,null,null,null,null,null,null,null,{"$f":"IF(D9=0, \"\", SUM(D9:K9))","v":""},"/",{"$f":"IF(D9=\"\", \"\", IF(K9=0, 70, 80))","v":""}]
[null,"Technique of Leaps & Jumps",null,null,null,null,null,null,null,null,null,{"$f":"IF(D10=0, \"\", SUM(D10:K10))","v":""},"/",{"$f":"IF(D10=\"\", \"\", IF(K10=0, 70, 80))","v":""},{"$f":"IF(D9=0, \"\", SUM(D9:K10))","v":""},"/",{"$f":"IF(D9=\"\", \"\", IF(K9=0, 140, 160))","v":""}]
["CHOREOGRAPHY","Creativity",null,null,null,null,null,null,null,null,null,{"$f":"IF(D11=0, \"\", SUM(D11:K11))","v":""},"/",""]
[null,"Visual Effectiveness",null,null,null,null,null,null,null,null,null,"","/","",{"$f":"IF(D11=0, \"\", SUM(D11:K12))","v":""},"/",{"$f":"IF(D11=\"\", \"\", IF(K11=0, 140, 160))","v":""}]
["DIFFICULTY","Diffuculty of Routine Choreography",null,null,null,null,null,null,null,null,null,"","/",""]
[null,"Difficulty of Formations and Transitions",null,null,null,null,null,null,null,null,null,"","/",""]
[null,"Difficulty of Skills",null,null,null,null,null,null,null,null,null,"","/","",{"$f":"IF(D13=0, \"\", SUM(D13:K15))","v":""},"/",{"$f":"IF(D13=\"\", \"\", IF(K13=0, 210, 240))","v":""}]
["EXECUTION","Placement & Control",null,null,null,null,null,null,null,null,null,"","/",""]
[null,"Degree of Accuracy",null,null,null,null,null,null,null,null,null,"","/","",{"$f":"IF(D16=0, \"\", SUM(D16:K17))","v":""},"/",{"$f":"IF(D16=\"\", \"\", IF(K16=0, 140, 160))","v":""}]
["R.E.","Routine Effectiveness",null,null,null,null,null,null,null,null,null,"","/","",{"$f":"IF(D18=0, \"\", SUM(D18:K18))","v":""},"/",{"$f":"IF(D18=\"\", \"\", IF(K18=0, 70, 80))","v":""}]
[null,"SUB TOTALS",null,{"$f":"D9+D10+D11+D12+D13+D14+D15+D16+D17+D18","v":0},{"$f":"E9+E10+E11+E12+E13+E14+E15+E16+E17+E18","v":0},0,0,0,0,0,0,{"$f":"IF(D9=0, \"\", SUM(D19:K19))","v":""},"/",{"$f":"IF(D9=\"\", \"\", SUM(N9:N18))","v":""},{"$f":"IF(D9=0, \"\", SUM(O9:O18))","v":""},"/",{"$f":"IF(D9=\"\", \"\", SUM(Q9:Q18))","v":""}]
[null,"DEDUCTIONS \nEnter as a negative number i.e. -3 or DQ",null,null,null,null,null,null,null,null,null,{"$f":"IF(D20=\"\", \"\", IF(D20=\"DQ\",\"DQ\",SUM(D20:K20)))","v":""},null,null,{"$f":"IF(D20=\"\", \"\", IF(D20=\"DQ\",\"DQ\",SUM(D20:K20)))","v":""}]
[null,"TOTALS",null,{"$f":"IF(D20=\"DQ\", \"DQ\",SUM(D19+D20))","v":0},0,0,0,0,0,{"$f":"IF(J20=\"DQ\", \"DQ\",SUM(J19+J20))","v":0},{"$f":"IF(K20=\"DQ\", \"DQ\",SUM(K19+K20))","v":0},{"$f":"IF(D9=0, \"\", IF(D20=\"DQ\",\"DQ\",SUM(D21:K21)))","v":""},"/",{"$f":"IF(D9=\"\", \"\", SUM(N9:N18))","v":""},{"$f":"IF(D9=0, \"\", IF(D20=\"DQ\",\"DQ\",SUM(O19:O20)))","v":""},"/",{"$f":"IF(D9=\"\", \"\", SUM(Q9:Q18))","v":""}]
[]
[null,"KC/T #1","Time:",null,null,null,"Kick Count:",null,null,null,null,null,"# Comp:"]
[null,"KC/T #2","Time:",null,null,null,"Kick Count:",null,null,null,null,null,"# Comp:"]
[null,"KC/T #3","Time:",null,null,null,"Kick Count:",null,null,null,null,null,"# Comp:"]

{"sheet":"Team18","index":22,"n_rows":25,"n_cols":17,"rows_kept":25,"cut":false,"hidden":false,"merged":[[20,1,20,2],[16,1,16,2],[17,1,17,2],[14,1,14,2],[15,1,15,2],[10,1,10,2],[6,0,6,2],[7,0,7,2],[6,14,7,14],[6,11,7,11],[12,1,12,2],[19,1,19,2],[8,0,9,0],[10,0,11,0],[12,0,14,0],[15,0,16,0],[6,15,7,16],[0,0,0,16],[1,0,1,16],[3,2,3,7],[3,8,3,11],[3,12,3,16],[4,2,4,7],[4,8,4,11],[4,12,4,16],[6,12,7,13],[23,3,23,4],[23,8,23,9],[24,3,24,4],[24,8,24,9],[9,1,9,2],[8,1,8,2],[13,1,13,2],[11,1,11,2],[22,3,22,4],[22,8,22,9]]}
["Minnesota State High School League Dance Team Competition"]
["Jazz Judges Recap Sheet"]
[]
[null,"School:",{"$f":"IF('Ranking Sheet'!B29=0, \"\", 'Ranking Sheet'!B29)","v":""},null,null,null,null,null,"Class:",null,null,null,{"$f":"IF(Class=0, \"\", Class)","v":""}]
[null,"Meet Site:",{"$f":"IF(Site=0, \"\", Site)","v":""},null,null,null,null,null,"Meet Date:",null,null,null,{"$f":"IF(DATE=0, \"\", DATE)","v":""}]
[]
["Judge's Initials → ",null,null,{"$f":"IF('Ranking Sheet'!D10=0, \"\", 'Ranking Sheet'!D10)","v":""},{"$f":"IF('Ranking Sheet'!F10=0, \"\", 'Ranking Sheet'!F10)","v":""},{"$f":"IF('Ranking Sheet'!H10=0, \"\", 'Ranking Sheet'!H10)","v":""},{"$f":"IF('Ranking Sheet'!J10=0, \"\", 'Ranking Sheet'!J10)","v":""},{"$f":"IF('Ranking Sheet'!L10=0, \"\", 'Ranking Sheet'!L10)","v":""},{"$f":"IF('Ranking Sheet'!N10=0, \"\", 'Ranking Sheet'!N10)","v":""},{"$f":"IF('Ranking Sheet'!P10=0, \"\", 'Ranking Sheet'!P10)","v":""},{"$f":"IF('Ranking Sheet'!R10=0, \"\", 'Ranking Sheet'!R10)","v":""},"Category Total Points","Total Points Possible",null,"Subtotal Points","Subtotal Points Possible"]
["Category",null,null,1,2,3,4,5,6,7,8]
["SKILLS","Technique of Turns",null,null,null,null,null,null,null,null,null,{"$f":"IF(D9=0, \"\", SUM(D9:K9))","v":""},"/",{"$f":"IF(D9=\"\", \"\", IF(K9=0, 70, 80))","v":""}]
[null,"Technique of Leaps & Jumps",null,null,null,null,null,null,null,null,null,{"$f":"IF(D10=0, \"\", SUM(D10:K10))","v":""},"/",{"$f":"IF(D10=\"\", \"\", IF(K10=0, 70, 80))","v":""},{"$f":"IF(D9=0, \"\", SUM(D9:K10))","v":""},"/",{"$f":"IF(D9=\"\", \"\", IF(K9=0, 140, 160))","v":""}]
["CHOREOGRAPHY","Creativity",null,null,null,null,null,null,null,null,null,{"$f":"IF(D11=0, \"\", SUM(D11:K11))","v":""},"/",""]
[null,"Visual Effectiveness",null,null,null,null,null,null,null,null,null,"","/","",{"$f":"IF(D11=0, \"\", SUM(D11:K12))","v":""},"/",{"$f":"IF(D11=\"\", \"\", IF(K11=0, 140, 160))","v":""}]
["DIFFICULTY","Diffuculty of Routine Choreography",null,null,null,null,null,null,null,null,null,"","/",""]
[null,"Difficulty of Formations and Transitions",null,null,null,null,null,null,null,null,null,"","/",""]
[null,"Difficulty of Skills",null,null,null,null,null,null,null,null,null,"","/","",{"$f":"IF(D13=0, \"\", SUM(D13:K15))","v":""},"/",{"$f":"IF(D13=\"\", \"\", IF(K13=0, 210, 240))","v":""}]
["EXECUTION","Placement & Control",null,null,null,null,null,null,null,null,null,"","/",""]
[null,"Degree of Accuracy",null,null,null,null,null,null,null,null,null,"","/","",{"$f":"IF(D16=0, \"\", SUM(D16:K17))","v":""},"/",{"$f":"IF(D16=\"\", \"\", IF(K16=0, 140, 160))","v":""}]
["R.E.","Routine Effectiveness",null,null,null,null,null,null,null,null,null,"","/","",{"$f":"IF(D18=0, \"\", SUM(D18:K18))","v":""},"/",{"$f":"IF(D18=\"\", \"\", IF(K18=0, 70, 80))","v":""}]
[null,"SUB TOTALS",null,{"$f":"D9+D10+D11+D12+D13+D14+D15+D16+D17+D18","v":0},{"$f":"E9+E10+E11+E12+E13+E14+E15+E16+E17+E18","v":0},0,0,0,0,0,0,{"$f":"IF(D9=0, \"\", SUM(D19:K19))","v":""},"/",{"$f":"IF(D9=\"\", \"\", SUM(N9:N18))","v":""},{"$f":"IF(D9=0, \"\", SUM(O9:O18))","v":""},"/",{"$f":"IF(D9=\"\", \"\", SUM(Q9:Q18))","v":""}]
[null,"DEDUCTIONS \nEnter as a negative number i.e. -3 or DQ",null,null,null,null,null,null,null,null,null,{"$f":"IF(D20=\"\", \"\", IF(D20=\"DQ\",\"DQ\",SUM(D20:K20)))","v":""},null,null,{"$f":"IF(D20=\"\", \"\", IF(D20=\"DQ\",\"DQ\",SUM(D20:K20)))","v":""}]
[null,"TOTALS",null,{"$f":"IF(D20=\"DQ\", \"DQ\",SUM(D19+D20))","v":0},0,0,0,0,0,{"$f":"IF(J20=\"DQ\", \"DQ\",SUM(J19+J20))","v":0},{"$f":"IF(K20=\"DQ\", \"DQ\",SUM(K19+K20))","v":0},{"$f":"IF(D9=0, \"\", IF(D20=\"DQ\",\"DQ\",SUM(D21:K21)))","v":""},"/",{"$f":"IF(D9=\"\", \"\", SUM(N9:N18))","v":""},{"$f":"IF(D9=0, \"\", IF(D20=\"DQ\",\"DQ\",SUM(O19:O20)))","v":""},"/",{"$f":"IF(D9=\"\", \"\", SUM(Q9:Q18))","v":""}]
[]
[null,"KC/T #1","Time:",null,null,null,"Kick Count:",null,null,null,null,null,"# Comp:"]
[null,"KC/T #2","Time:",null,null,null,"Kick Count:",null,null,null,null,null,"# Comp:"]
[null,"KC/T #3","Time:",null,null,null,"Kick Count:",null,null,null,null,null,"# Comp:"]

{"sheet":"Team19","index":23,"n_rows":25,"n_cols":17,"rows_kept":25,"cut":false,"hidden":false,"merged":[[20,1,20,2],[16,1,16,2],[17,1,17,2],[14,1,14,2],[15,1,15,2],[10,1,10,2],[6,0,6,2],[7,0,7,2],[6,14,7,14],[6,11,7,11],[12,1,12,2],[19,1,19,2],[8,0,9,0],[10,0,11,0],[12,0,14,0],[15,0,16,0],[6,15,7,16],[0,0,0,16],[1,0,1,16],[3,2,3,7],[3,8,3,11],[3,12,3,16],[4,2,4,7],[4,8,4,11],[4,12,4,16],[6,12,7,13],[23,3,23,4],[23,8,23,9],[24,3,24,4],[24,8,24,9],[9,1,9,2],[8,1,8,2],[13,1,13,2],[11,1,11,2],[22,3,22,4],[22,8,22,9]]}
["Minnesota State High School League Dance Team Competition"]
["Jazz Judges Recap Sheet"]
[]
[null,"School:",{"$f":"IF('Ranking Sheet'!B30=0, \"\", 'Ranking Sheet'!B30)","v":""},null,null,null,null,null,"Class:",null,null,null,{"$f":"IF(Class=0, \"\", Class)","v":""}]
[null,"Meet Site:",{"$f":"IF(Site=0, \"\", Site)","v":""},null,null,null,null,null,"Meet Date:",null,null,null,{"$f":"IF(DATE=0, \"\", DATE)","v":""}]
[]
["Judge's Initials → ",null,null,{"$f":"IF('Ranking Sheet'!D10=0, \"\", 'Ranking Sheet'!D10)","v":""},{"$f":"IF('Ranking Sheet'!F10=0, \"\", 'Ranking Sheet'!F10)","v":""},{"$f":"IF('Ranking Sheet'!H10=0, \"\", 'Ranking Sheet'!H10)","v":""},{"$f":"IF('Ranking Sheet'!J10=0, \"\", 'Ranking Sheet'!J10)","v":""},{"$f":"IF('Ranking Sheet'!L10=0, \"\", 'Ranking Sheet'!L10)","v":""},{"$f":"IF('Ranking Sheet'!N10=0, \"\", 'Ranking Sheet'!N10)","v":""},{"$f":"IF('Ranking Sheet'!P10=0, \"\", 'Ranking Sheet'!P10)","v":""},{"$f":"IF('Ranking Sheet'!R10=0, \"\", 'Ranking Sheet'!R10)","v":""},"Category Total Points","Total Points Possible",null,"Subtotal Points","Subtotal Points Possible"]
["Category",null,null,1,2,3,4,5,6,7,8]
["SKILLS","Technique of Turns",null,null,null,null,null,null,null,null,null,{"$f":"IF(D9=0, \"\", SUM(D9:K9))","v":""},"/",{"$f":"IF(D9=\"\", \"\", IF(K9=0, 70, 80))","v":""}]
[null,"Technique of Leaps & Jumps",null,null,null,null,null,null,null,null,null,{"$f":"IF(D10=0, \"\", SUM(D10:K10))","v":""},"/",{"$f":"IF(D10=\"\", \"\", IF(K10=0, 70, 80))","v":""},{"$f":"IF(D9=0, \"\", SUM(D9:K10))","v":""},"/",{"$f":"IF(D9=\"\", \"\", IF(K9=0, 140, 160))","v":""}]
["CHOREOGRAPHY","Creativity",null,null,null,null,null,null,null,null,null,{"$f":"IF(D11=0, \"\", SUM(D11:K11))","v":""},"/",""]
[null,"Visual Effectiveness",null,null,null,null,null,null,null,null,null,"","/","",{"$f":"IF(D11=0, \"\", SUM(D11:K12))","v":""},"/",{"$f":"IF(D11=\"\", \"\", IF(K11=0, 140, 160))","v":""}]
["DIFFICULTY","Diffuculty of Routine Choreography",null,null,null,null,null,null,null,null,null,"","/",""]
[null,"Difficulty of Formations and Transitions",null,null,null,null,null,null,null,null,null,"","/",""]
[null,"Difficulty of Skills",null,null,null,null,null,null,null,null,null,"","/","",{"$f":"IF(D13=0, \"\", SUM(D13:K15))","v":""},"/",{"$f":"IF(D13=\"\", \"\", IF(K13=0, 210, 240))","v":""}]
["EXECUTION","Placement & Control",null,null,null,null,null,null,null,null,null,"","/",""]
[null,"Degree of Accuracy",null,null,null,null,null,null,null,null,null,"","/","",{"$f":"IF(D16=0, \"\", SUM(D16:K17))","v":""},"/",{"$f":"IF(D16=\"\", \"\", IF(K16=0, 140, 160))","v":""}]
["R.E.","Routine Effectiveness",null,null,null,null,null,null,null,null,null,"","/","",{"$f":"IF(D18=0, \"\", SUM(D18:K18))","v":""},"/",{"$f":"IF(D18=\"\", \"\", IF(K18=0, 70, 80))","v":""}]
[null,"SUB TOTALS",null,{"$f":"D9+D10+D11+D12+D13+D14+D15+D16+D17+D18","v":0},{"$f":"E9+E10+E11+E12+E13+E14+E15+E16+E17+E18","v":0},0,0,0,0,0,0,{"$f":"IF(D9=0, \"\", SUM(D19:K19))","v":""},"/",{"$f":"IF(D9=\"\", \"\", SUM(N9:N18))","v":""},{"$f":"IF(D9=0, \"\", SUM(O9:O18))","v":""},"/",{"$f":"IF(D9=\"\", \"\", SUM(Q9:Q18))","v":""}]
[null,"DEDUCTIONS \nEnter as a negative number i.e. -3 or DQ",null,null,null,null,null,null,null,null,null,{"$f":"IF(D20=\"\", \"\", IF(D20=\"DQ\",\"DQ\",SUM(D20:K20)))","v":""},null,null,{"$f":"IF(D20=\"\", \"\", IF(D20=\"DQ\",\"DQ\",SUM(D20:K20)))","v":""}]
[null,"TOTALS",null,{"$f":"IF(D20=\"DQ\", \"DQ\",SUM(D19+D20))","v":0},0,0,0,0,0,{"$f":"IF(J20=\"DQ\", \"DQ\",SUM(J19+J20))","v":0},{"$f":"IF(K20=\"DQ\", \"DQ\",SUM(K19+K20))","v":0},{"$f":"IF(D9=0, \"\", IF(D20=\"DQ\",\"DQ\",SUM(D21:K21)))","v":""},"/",{"$f":"IF(D9=\"\", \"\", SUM(N9:N18))","v":""},{"$f":"IF(D9=0, \"\", IF(D20=\"DQ\",\"DQ\",SUM(O19:O20)))","v":""},"/",{"$f":"IF(D9=\"\", \"\", SUM(Q9:Q18))","v":""}]
[]
[null,"KC/T #1","Time:",null,null,null,"Kick Count:",null,null,null,null,null,"# Comp:"]
[null,"KC/T #2","Time:",null,null,null,"Kick Count:",null,null,null,null,null,"# Comp:"]
[null,"KC/T #3","Time:",null,null,null,"Kick Count:",null,null,null,null,null,"# Comp:"]

{"sheet":"Team20","index":24,"n_rows":25,"n_cols":17,"rows_kept":25,"cut":false,"hidden":false,"merged":[[20,1,20,2],[16,1,16,2],[17,1,17,2],[14,1,14,2],[15,1,15,2],[10,1,10,2],[6,0,6,2],[7,0,7,2],[6,14,7,14],[6,11,7,11],[12,1,12,2],[19,1,19,2],[8,0,9,0],[10,0,11,0],[12,0,14,0],[15,0,16,0],[6,15,7,16],[0,0,0,16],[1,0,1,16],[3,2,3,7],[3,8,3,11],[3,12,3,16],[4,2,4,7],[4,8,4,11],[4,12,4,16],[6,12,7,13],[23,3,23,4],[23,8,23,9],[24,3,24,4],[24,8,24,9],[9,1,9,2],[8,1,8,2],[13,1,13,2],[11,1,11,2],[22,3,22,4],[22,8,22,9]]}
["Minnesota State High School League Dance Team Competition"]
["Jazz Judges Recap Sheet"]
[]
[null,"School:",{"$f":"IF('Ranking Sheet'!B31=0, \"\", 'Ranking Sheet'!B31)","v":""},null,null,null,null,null,"Class:",null,null,null,{"$f":"IF(Class=0, \"\", Class)","v":""}]
[null,"Meet Site:",{"$f":"IF(Site=0, \"\", Site)","v":""},null,null,null,null,null,"Meet Date:",null,null,null,{"$f":"IF(DATE=0, \"\", DATE)","v":""}]
[]
["Judge's Initials → ",null,null,{"$f":"IF('Ranking Sheet'!D10=0, \"\", 'Ranking Sheet'!D10)","v":""},{"$f":"IF('Ranking Sheet'!F10=0, \"\", 'Ranking Sheet'!F10)","v":""},{"$f":"IF('Ranking Sheet'!H10=0, \"\", 'Ranking Sheet'!H10)","v":""},{"$f":"IF('Ranking Sheet'!J10=0, \"\", 'Ranking Sheet'!J10)","v":""},{"$f":"IF('Ranking Sheet'!L10=0, \"\", 'Ranking Sheet'!L10)","v":""},{"$f":"IF('Ranking Sheet'!N10=0, \"\", 'Ranking Sheet'!N10)","v":""},{"$f":"IF('Ranking Sheet'!P10=0, \"\", 'Ranking Sheet'!P10)","v":""},{"$f":"IF('Ranking Sheet'!R10=0, \"\", 'Ranking Sheet'!R10)","v":""},"Category Total Points","Total Points Possible",null,"Subtotal Points","Subtotal Points Possible"]
["Category",null,null,1,2,3,4,5,6,7,8]
["SKILLS","Technique of Turns",null,null,null,null,null,null,null,null,null,{"$f":"IF(D9=0, \"\", SUM(D9:K9))","v":""},"/",{"$f":"IF(D9=\"\", \"\", IF(K9=0, 70, 80))","v":""}]
[null,"Technique of Leaps & Jumps",null,null,null,null,null,null,null,null,null,{"$f":"IF(D10=0, \"\", SUM(D10:K10))","v":""},"/",{"$f":"IF(D10=\"\", \"\", IF(K10=0, 70, 80))","v":""},{"$f":"IF(D9=0, \"\", SUM(D9:K10))","v":""},"/",{"$f":"IF(D9=\"\", \"\", IF(K9=0, 140, 160))","v":""}]
["CHOREOGRAPHY","Creativity",null,null,null,null,null,null,null,null,null,{"$f":"IF(D11=0, \"\", SUM(D11:K11))","v":""},"/",""]
[null,"Visual Effectiveness",null,null,null,null,null,null,null,null,null,"","/","",{"$f":"IF(D11=0, \"\", SUM(D11:K12))","v":""},"/",{"$f":"IF(D11=\"\", \"\", IF(K11=0, 140, 160))","v":""}]
["DIFFICULTY","Diffuculty of Routine Choreography",null,null,null,null,null,null,null,null,null,"","/",""]
[null,"Difficulty of Formations and Transitions",null,null,null,null,null,null,null,null,null,"","/",""]
[null,"Difficulty of Skills",null,null,null,null,null,null,null,null,null,"","/","",{"$f":"IF(D13=0, \"\", SUM(D13:K15))","v":""},"/",{"$f":"IF(D13=\"\", \"\", IF(K13=0, 210, 240))","v":""}]
["EXECUTION","Placement & Control",null,null,null,null,null,null,null,null,null,"","/",""]
[null,"Degree of Accuracy",null,null,null,null,null,null,null,null,null,"","/","",{"$f":"IF(D16=0, \"\", SUM(D16:K17))","v":""},"/",{"$f":"IF(D16=\"\", \"\", IF(K16=0, 140, 160))","v":""}]
["R.E.","Routine Effectiveness",null,null,null,null,null,null,null,null,null,"","/","",{"$f":"IF(D18=0, \"\", SUM(D18:K18))","v":""},"/",{"$f":"IF(D18=\"\", \"\", IF(K18=0, 70, 80))","v":""}]
[null,"SUB TOTALS",null,{"$f":"D9+D10+D11+D12+D13+D14+D15+D16+D17+D18","v":0},{"$f":"E9+E10+E11+E12+E13+E14+E15+E16+E17+E18","v":0},0,0,0,0,0,0,{"$f":"IF(D9=0, \"\", SUM(D19:K19))","v":""},"/",{"$f":"IF(D9=\"\", \"\", SUM(N9:N18))","v":""},{"$f":"IF(D9=0, \"\", SUM(O9:O18))","v":""},"/",{"$f":"IF(D9=\"\", \"\", SUM(Q9:Q18))","v":""}]
[null,"DEDUCTIONS \nEnter as a negative number i.e. -3 or DQ",null,null,null,null,null,null,null,null,null,{"$f":"IF(D20=\"\", \"\", IF(D20=\"DQ\",\"DQ\",SUM(D20:K20)))","v":""},null,null,{"$f":"IF(D20=\"\", \"\", IF(D20=\"DQ\",\"DQ\",SUM(D20:K20)))","v":""}]
[null,"TOTALS",null,{"$f":"IF(D20=\"DQ\", \"DQ\",SUM(D19+D20))","v":0},0,0,0,0,0,{"$f":"IF(J20=\"DQ\", \"DQ\",SUM(J19+J20))","v":0},{"$f":"IF(K20=\"DQ\", \"DQ\",SUM(K19+K20))","v":0},{"$f":"IF(D9=0, \"\", IF(D20=\"DQ\",\"DQ\",SUM(D21:K21)))","v":""},"/",{"$f":"IF(D9=\"\", \"\", SUM(N9:N18))","v":""},{"$f":"IF(D9=0, \"\", IF(D20=\"DQ\",\"DQ\",SUM(O19:O20)))","v":""},"/",{"$f":"IF(D9=\"\", \"\", SUM(Q9:Q18))","v":""}]
[]
[null,"KC/T #1","Time:",null,null,null,"Kick Count:",null,null,null,null,null,"# Comp:"]
[null,"KC/T #2","Time:",null,null,null,"Kick Count:",null,null,null,null,null,"# Comp:"]
[null,"KC/T #3","Time:",null,null,null,"Kick Count:",null,null,null,null,null,"# Comp:"]

{"sheet":"Team21","index":25,"n_rows":25,"n_cols":17,"rows_kept":25,"cut":false,"hidden":false,"merged":[[7,0,7,2],[8,0,9,0],[10,0,11,0],[9,1,9,2],[16,1,16,2],[6,12,7,13],[6,11,7,11],[15,1,15,2],[11,1,11,2],[12,0,14,0],[20,1,20,2],[10,1,10,2],[19,1,19,2],[13,1,13,2],[12,1,12,2],[6,14,7,14],[8,1,8,2],[17,1,17,2],[14,1,14,2],[6,0,6,2],[15,0,16,0],[0,0,0,16],[1,0,1,16],[3,2,3,7],[3,8,3,11],[3,12,3,16],[4,2,4,7],[4,8,4,11],[4,12,4,16],[6,15,7,16],[22,3,22,4],[22,8,22,9],[23,3,23,4],[23,8,23,9],[24,3,24,4],[24,8,24,9]]}
["Minnesota State High School League Dance Team Competition"]
["Jazz Judges Recap Sheet"]
[]
[null,"School:",{"$f":"IF('Ranking Sheet'!B32=0, \"\", 'Ranking Sheet'!B32)","v":""},null,null,null,null,null,"Class:",null,null,null,{"$f":"IF(Class=0, \"\", Class)","v":""}]
[null,"Meet Site:",{"$f":"IF(Site=0, \"\", Site)","v":""},null,null,null,null,null,"Meet Date:",null,null,null,{"$f":"IF(DATE=0, \"\", DATE)","v":""}]
[]
["Judge's Initials → ",null,null,{"$f":"IF('Ranking Sheet'!D10=0, \"\", 'Ranking Sheet'!D10)","v":""},{"$f":"IF('Ranking Sheet'!F10=0, \"\", 'Ranking Sheet'!F10)","v":""},{"$f":"IF('Ranking Sheet'!H10=0, \"\", 'Ranking Sheet'!H10)","v":""},{"$f":"IF('Ranking Sheet'!J10=0, \"\", 'Ranking Sheet'!J10)","v":""},{"$f":"IF('Ranking Sheet'!L10=0, \"\", 'Ranking Sheet'!L10)","v":""},{"$f":"IF('Ranking Sheet'!N10=0, \"\", 'Ranking Sheet'!N10)","v":""},{"$f":"IF('Ranking Sheet'!P10=0, \"\", 'Ranking Sheet'!P10)","v":""},{"$f":"IF('Ranking Sheet'!R10=0, \"\", 'Ranking Sheet'!R10)","v":""},"Category Total Points","Total Points Possible",null,"Subtotal Points","Subtotal Points Possible"]
["Category",null,null,1,2,3,4,5,6,7,8]
["SKILLS","Technique of Turns",null,null,null,null,null,null,null,null,null,{"$f":"IF(D9=0, \"\", SUM(D9:K9))","v":""},"/",{"$f":"IF(D9=\"\", \"\", IF(K9=0, 70, 80))","v":""}]
[null,"Technique of Leaps & Jumps",null,null,null,null,null,null,null,null,null,{"$f":"IF(D10=0, \"\", SUM(D10:K10))","v":""},"/",{"$f":"IF(D10=\"\", \"\", IF(K10=0, 70, 80))","v":""},{"$f":"IF(D9=0, \"\", SUM(D9:K10))","v":""},"/",{"$f":"IF(D9=\"\", \"\", IF(K9=0, 140, 160))","v":""}]
["CHOREOGRAPHY","Creativity",null,null,null,null,null,null,null,null,null,{"$f":"IF(D11=0, \"\", SUM(D11:K11))","v":""},"/",""]
[null,"Visual Effectiveness",null,null,null,null,null,null,null,null,null,"","/","",{"$f":"IF(D11=0, \"\", SUM(D11:K12))","v":""},"/",{"$f":"IF(D11=\"\", \"\", IF(K11=0, 140, 160))","v":""}]
["DIFFICULTY","Diffuculty of Routine Choreography",null,null,null,null,null,null,null,null,null,"","/",""]
[null,"Difficulty of Formations and Transitions",null,null,null,null,null,null,null,null,null,"","/",""]
[null,"Difficulty of Skills",null,null,null,null,null,null,null,null,null,"","/","",{"$f":"IF(D13=0, \"\", SUM(D13:K15))","v":""},"/",{"$f":"IF(D13=\"\", \"\", IF(K13=0, 210, 240))","v":""}]
["EXECUTION","Placement & Control",null,null,null,null,null,null,null,null,null,"","/",""]
[null,"Degree of Accuracy",null,null,null,null,null,null,null,null,null,"","/","",{"$f":"IF(D16=0, \"\", SUM(D16:K17))","v":""},"/",{"$f":"IF(D16=\"\", \"\", IF(K16=0, 140, 160))","v":""}]
["R.E.","Routine Effectiveness",null,null,null,null,null,null,null,null,null,"","/","",{"$f":"IF(D18=0, \"\", SUM(D18:K18))","v":""},"/",{"$f":"IF(D18=\"\", \"\", IF(K18=0, 70, 80))","v":""}]
[null,"SUB TOTALS",null,{"$f":"D9+D10+D11+D12+D13+D14+D15+D16+D17+D18","v":0},{"$f":"E9+E10+E11+E12+E13+E14+E15+E16+E17+E18","v":0},0,0,0,0,0,0,{"$f":"IF(D9=0, \"\", SUM(D19:K19))","v":""},"/",{"$f":"IF(D9=\"\", \"\", SUM(N9:N18))","v":""},{"$f":"IF(D9=0, \"\", SUM(O9:O18))","v":""},"/",{"$f":"IF(D9=\"\", \"\", SUM(Q9:Q18))","v":""}]
[null,"DEDUCTIONS \nEnter as a negative number i.e. -3 or DQ",null,null,null,null,null,null,null,null,null,{"$f":"IF(D20=\"\", \"\", IF(D20=\"DQ\",\"DQ\",SUM(D20:K20)))","v":""},null,null,{"$f":"IF(D20=\"\", \"\", IF(D20=\"DQ\",\"DQ\",SUM(D20:K20)))","v":""}]
[null,"TOTALS",null,{"$f":"IF(D20=\"DQ\", \"DQ\",SUM(D19+D20))","v":0},0,0,0,0,0,{"$f":"IF(J20=\"DQ\", \"DQ\",SUM(J19+J20))","v":0},{"$f":"IF(K20=\"DQ\", \"DQ\",SUM(K19+K20))","v":0},{"$f":"IF(D9=0, \"\", IF(D20=\"DQ\",\"DQ\",SUM(D21:K21)))","v":""},"/",{"$f":"IF(D9=\"\", \"\", SUM(N9:N18))","v":""},{"$f":"IF(D9=0, \"\", IF(D20=\"DQ\",\"DQ\",SUM(O19:O20)))","v":""},"/",{"$f":"IF(D9=\"\", \"\", SUM(Q9:Q18))","v":""}]
[]
[null,"KC/T #1","Time:",null,null,null,"Kick Count:",null,null,null,null,null,"# Comp:"]
[null,"KC/T #2","Time:",null,null,null,"Kick Count:",null,null,null,null,null,"# Comp:"]
[null,"KC/T #3","Time:",null,null,null,"Kick Count:",null,null,null,null,null,"# Comp:"]

{"sheet":"Team22","index":26,"n_rows":25,"n_cols":17,"rows_kept":25,"cut":false,"hidden":false,"merged":[[7,0,7,2],[8,0,9,0],[10,0,11,0],[9,1,9,2],[16,1,16,2],[6,12,7,13],[6,11,7,11],[15,1,15,2],[11,1,11,2],[12,0,14,0],[20,1,20,2],[10,1,10,2],[19,1,19,2],[13,1,13,2],[12,1,12,2],[6,14,7,14],[8,1,8,2],[17,1,17,2],[14,1,14,2],[6,0,6,2],[15,0,16,0],[0,0,0,16],[1,0,1,16],[3,2,3,7],[3,8,3,11],[3,12,3,16],[4,2,4,7],[4,8,4,11],[4,12,4,16],[6,15,7,16],[22,3,22,4],[22,8,22,9],[23,3,23,4],[23,8,23,9],[24,3,24,4],[24,8,24,9]]}
["Minnesota State High School League Dance Team Competition"]
["Jazz Judges Recap Sheet"]
[]
[null,"School:",{"$f":"IF('Ranking Sheet'!B33=0, \"\", 'Ranking Sheet'!B33)","v":""},null,null,null,null,null,"Class:",null,null,null,{"$f":"IF(Class=0, \"\", Class)","v":""}]
[null,"Meet Site:",{"$f":"IF(Site=0, \"\", Site)","v":""},null,null,null,null,null,"Meet Date:",null,null,null,{"$f":"IF(DATE=0, \"\", DATE)","v":""}]
[]
["Judge's Initials → ",null,null,{"$f":"IF('Ranking Sheet'!D10=0, \"\", 'Ranking Sheet'!D10)","v":""},{"$f":"IF('Ranking Sheet'!F10=0, \"\", 'Ranking Sheet'!F10)","v":""},{"$f":"IF('Ranking Sheet'!H10=0, \"\", 'Ranking Sheet'!H10)","v":""},{"$f":"IF('Ranking Sheet'!J10=0, \"\", 'Ranking Sheet'!J10)","v":""},{"$f":"IF('Ranking Sheet'!L10=0, \"\", 'Ranking Sheet'!L10)","v":""},{"$f":"IF('Ranking Sheet'!N10=0, \"\", 'Ranking Sheet'!N10)","v":""},{"$f":"IF('Ranking Sheet'!P10=0, \"\", 'Ranking Sheet'!P10)","v":""},{"$f":"IF('Ranking Sheet'!R10=0, \"\", 'Ranking Sheet'!R10)","v":""},"Category Total Points","Total Points Possible",null,"Subtotal Points","Subtotal Points Possible"]
["Category",null,null,1,2,3,4,5,6,7,8]
["SKILLS","Technique of Turns",null,null,null,null,null,null,null,null,null,{"$f":"IF(D9=0, \"\", SUM(D9:K9))","v":""},"/",{"$f":"IF(D9=\"\", \"\", IF(K9=0, 70, 80))","v":""}]
[null,"Technique of Leaps & Jumps",null,null,null,null,null,null,null,null,null,{"$f":"IF(D10=0, \"\", SUM(D10:K10))","v":""},"/",{"$f":"IF(D10=\"\", \"\", IF(K10=0, 70, 80))","v":""},{"$f":"IF(D9=0, \"\", SUM(D9:K10))","v":""},"/",{"$f":"IF(D9=\"\", \"\", IF(K9=0, 140, 160))","v":""}]
["CHOREOGRAPHY","Creativity",null,null,null,null,null,null,null,null,null,{"$f":"IF(D11=0, \"\", SUM(D11:K11))","v":""},"/",""]
[null,"Visual Effectiveness",null,null,null,null,null,null,null,null,null,"","/","",{"$f":"IF(D11=0, \"\", SUM(D11:K12))","v":""},"/",{"$f":"IF(D11=\"\", \"\", IF(K11=0, 140, 160))","v":""}]
["DIFFICULTY","Diffuculty of Routine Choreography",null,null,null,null,null,null,null,null,null,"","/",""]
[null,"Difficulty of Formations and Transitions",null,null,null,null,null,null,null,null,null,"","/",""]
[null,"Difficulty of Skills",null,null,null,null,null,null,null,null,null,"","/","",{"$f":"IF(D13=0, \"\", SUM(D13:K15))","v":""},"/",{"$f":"IF(D13=\"\", \"\", IF(K13=0, 210, 240))","v":""}]
["EXECUTION","Placement & Control",null,null,null,null,null,null,null,null,null,"","/",""]
[null,"Degree of Accuracy",null,null,null,null,null,null,null,null,null,"","/","",{"$f":"IF(D16=0, \"\", SUM(D16:K17))","v":""},"/",{"$f":"IF(D16=\"\", \"\", IF(K16=0, 140, 160))","v":""}]
["R.E.","Routine Effectiveness",null,null,null,null,null,null,null,null,null,"","/","",{"$f":"IF(D18=0, \"\", SUM(D18:K18))","v":""},"/",{"$f":"IF(D18=\"\", \"\", IF(K18=0, 70, 80))","v":""}]
[null,"SUB TOTALS",null,{"$f":"D9+D10+D11+D12+D13+D14+D15+D16+D17+D18","v":0},{"$f":"E9+E10+E11+E12+E13+E14+E15+E16+E17+E18","v":0},0,0,0,0,0,0,{"$f":"IF(D9=0, \"\", SUM(D19:K19))","v":""},"/",{"$f":"IF(D9=\"\", \"\", SUM(N9:N18))","v":""},{"$f":"IF(D9=0, \"\", SUM(O9:O18))","v":""},"/",{"$f":"IF(D9=\"\", \"\", SUM(Q9:Q18))","v":""}]
[null,"DEDUCTIONS \nEnter as a negative number i.e. -3 or DQ",null,null,null,null,null,null,null,null,null,{"$f":"IF(D20=\"\", \"\", IF(D20=\"DQ\",\"DQ\",SUM(D20:K20)))","v":""},null,null,{"$f":"IF(D20=\"\", \"\", IF(D20=\"DQ\",\"DQ\",SUM(D20:K20)))","v":""}]
[null,"TOTALS",null,{"$f":"IF(D20=\"DQ\", \"DQ\",SUM(D19+D20))","v":0},0,0,0,0,0,{"$f":"IF(J20=\"DQ\", \"DQ\",SUM(J19+J20))","v":0},{"$f":"IF(K20=\"DQ\", \"DQ\",SUM(K19+K20))","v":0},{"$f":"IF(D9=0, \"\", IF(D20=\"DQ\",\"DQ\",SUM(D21:K21)))","v":""},"/",{"$f":"IF(D9=\"\", \"\", SUM(N9:N18))","v":""},{"$f":"IF(D9=0, \"\", IF(D20=\"DQ\",\"DQ\",SUM(O19:O20)))","v":""},"/",{"$f":"IF(D9=\"\", \"\", SUM(Q9:Q18))","v":""}]
[]
[null,"KC/T #1","Time:",null,null,null,"Kick Count:",null,null,null,null,null,"# Comp:"]
[null,"KC/T #2","Time:",null,null,null,"Kick Count:",null,null,null,null,null,"# Comp:"]
[null,"KC/T #3","Time:",null,null,null,"Kick Count:",null,null,null,null,null,"# Comp:"]

{"sheet":"Team23","index":27,"n_rows":25,"n_cols":17,"rows_kept":25,"cut":false,"hidden":false,"merged":[[7,0,7,2],[8,0,9,0],[10,0,11,0],[9,1,9,2],[16,1,16,2],[6,12,7,13],[6,11,7,11],[15,1,15,2],[11,1,11,2],[12,0,14,0],[20,1,20,2],[10,1,10,2],[19,1,19,2],[13,1,13,2],[12,1,12,2],[6,14,7,14],[8,1,8,2],[17,1,17,2],[14,1,14,2],[6,0,6,2],[15,0,16,0],[0,0,0,16],[1,0,1,16],[3,2,3,7],[3,8,3,11],[3,12,3,16],[4,2,4,7],[4,8,4,11],[4,12,4,16],[6,15,7,16],[22,3,22,4],[22,8,22,9],[23,3,23,4],[23,8,23,9],[24,3,24,4],[24,8,24,9]]}
["Minnesota State High School League Dance Team Competition"]
["Jazz Judges Recap Sheet"]
[]
[null,"School:",{"$f":"IF('Ranking Sheet'!B34=0, \"\", 'Ranking Sheet'!B34)","v":""},null,null,null,null,null,"Class:",null,null,null,{"$f":"IF(Class=0, \"\", Class)","v":""}]
[null,"Meet Site:",{"$f":"IF(Site=0, \"\", Site)","v":""},null,null,null,null,null,"Meet Date:",null,null,null,{"$f":"IF(DATE=0, \"\", DATE)","v":""}]
[]
["Judge's Initials → ",null,null,{"$f":"IF('Ranking Sheet'!D10=0, \"\", 'Ranking Sheet'!D10)","v":""},{"$f":"IF('Ranking Sheet'!F10=0, \"\", 'Ranking Sheet'!F10)","v":""},{"$f":"IF('Ranking Sheet'!H10=0, \"\", 'Ranking Sheet'!H10)","v":""},{"$f":"IF('Ranking Sheet'!J10=0, \"\", 'Ranking Sheet'!J10)","v":""},{"$f":"IF('Ranking Sheet'!L10=0, \"\", 'Ranking Sheet'!L10)","v":""},{"$f":"IF('Ranking Sheet'!N10=0, \"\", 'Ranking Sheet'!N10)","v":""},{"$f":"IF('Ranking Sheet'!P10=0, \"\", 'Ranking Sheet'!P10)","v":""},{"$f":"IF('Ranking Sheet'!R10=0, \"\", 'Ranking Sheet'!R10)","v":""},"Category Total Points","Total Points Possible",null,"Subtotal Points","Subtotal Points Possible"]
["Category",null,null,1,2,3,4,5,6,7,8]
["SKILLS","Technique of Turns",null,null,null,null,null,null,null,null,null,{"$f":"IF(D9=0, \"\", SUM(D9:K9))","v":""},"/",{"$f":"IF(D9=\"\", \"\", IF(K9=0, 70, 80))","v":""}]
[null,"Technique of Leaps & Jumps",null,null,null,null,null,null,null,null,null,{"$f":"IF(D10=0, \"\", SUM(D10:K10))","v":""},"/",{"$f":"IF(D10=\"\", \"\", IF(K10=0, 70, 80))","v":""},{"$f":"IF(D9=0, \"\", SUM(D9:K10))","v":""},"/",{"$f":"IF(D9=\"\", \"\", IF(K9=0, 140, 160))","v":""}]
["CHOREOGRAPHY","Creativity",null,null,null,null,null,null,null,null,null,{"$f":"IF(D11=0, \"\", SUM(D11:K11))","v":""},"/",""]
[null,"Visual Effectiveness",null,null,null,null,null,null,null,null,null,"","/","",{"$f":"IF(D11=0, \"\", SUM(D11:K12))","v":""},"/",{"$f":"IF(D11=\"\", \"\", IF(K11=0, 140, 160))","v":""}]
["DIFFICULTY","Diffuculty of Routine Choreography",null,null,null,null,null,null,null,null,null,"","/",""]
[null,"Difficulty of Formations and Transitions",null,null,null,null,null,null,null,null,null,"","/",""]
[null,"Difficulty of Skills",null,null,null,null,null,null,null,null,null,"","/","",{"$f":"IF(D13=0, \"\", SUM(D13:K15))","v":""},"/",{"$f":"IF(D13=\"\", \"\", IF(K13=0, 210, 240))","v":""}]
["EXECUTION","Placement & Control",null,null,null,null,null,null,null,null,null,"","/",""]
[null,"Degree of Accuracy",null,null,null,null,null,null,null,null,null,"","/","",{"$f":"IF(D16=0, \"\", SUM(D16:K17))","v":""},"/",{"$f":"IF(D16=\"\", \"\", IF(K16=0, 140, 160))","v":""}]
["R.E.","Routine Effectiveness",null,null,null,null,null,null,null,null,null,"","/","",{"$f":"IF(D18=0, \"\", SUM(D18:K18))","v":""},"/",{"$f":"IF(D18=\"\", \"\", IF(K18=0, 70, 80))","v":""}]
[null,"SUB TOTALS",null,{"$f":"D9+D10+D11+D12+D13+D14+D15+D16+D17+D18","v":0},{"$f":"E9+E10+E11+E12+E13+E14+E15+E16+E17+E18","v":0},0,0,0,0,0,0,{"$f":"IF(D9=0, \"\", SUM(D19:K19))","v":""},"/",{"$f":"IF(D9=\"\", \"\", SUM(N9:N18))","v":""},{"$f":"IF(D9=0, \"\", SUM(O9:O18))","v":""},"/",{"$f":"IF(D9=\"\", \"\", SUM(Q9:Q18))","v":""}]
[null,"DEDUCTIONS \nEnter as a negative number i.e. -3 or DQ",null,null,null,null,null,null,null,null,null,{"$f":"IF(D20=\"\", \"\", IF(D20=\"DQ\",\"DQ\",SUM(D20:K20)))","v":""},null,null,{"$f":"IF(D20=\"\", \"\", IF(D20=\"DQ\",\"DQ\",SUM(D20:K20)))","v":""}]
[null,"TOTALS",null,{"$f":"IF(D20=\"DQ\", \"DQ\",SUM(D19+D20))","v":0},0,0,0,0,0,{"$f":"IF(J20=\"DQ\", \"DQ\",SUM(J19+J20))","v":0},{"$f":"IF(K20=\"DQ\", \"DQ\",SUM(K19+K20))","v":0},{"$f":"IF(D9=0, \"\", IF(D20=\"DQ\",\"DQ\",SUM(D21:K21)))","v":""},"/",{"$f":"IF(D9=\"\", \"\", SUM(N9:N18))","v":""},{"$f":"IF(D9=0, \"\", IF(D20=\"DQ\",\"DQ\",SUM(O19:O20)))","v":""},"/",{"$f":"IF(D9=\"\", \"\", SUM(Q9:Q18))","v":""}]
[]
[null,"KC/T #1","Time:",null,null,null,"Kick Count:",null,null,null,null,null,"# Comp:"]
[null,"KC/T #2","Time:",null,null,null,"Kick Count:",null,null,null,null,null,"# Comp:"]
[null,"KC/T #3","Time:",null,null,null,"Kick Count:",null,null,null,null,null,"# Comp:"]

{"sheet":"Team24","index":28,"n_rows":25,"n_cols":17,"rows_kept":25,"cut":false,"hidden":false,"merged":[[7,0,7,2],[8,0,9,0],[10,0,11,0],[9,1,9,2],[16,1,16,2],[6,12,7,13],[6,11,7,11],[15,1,15,2],[11,1,11,2],[12,0,14,0],[20,1,20,2],[10,1,10,2],[19,1,19,2],[13,1,13,2],[12,1,12,2],[6,14,7,14],[8,1,8,2],[17,1,17,2],[14,1,14,2],[6,0,6,2],[15,0,16,0],[0,0,0,16],[1,0,1,16],[3,2,3,7],[3,8,3,11],[3,12,3,16],[4,2,4,7],[4,8,4,11],[4,12,4,16],[6,15,7,16],[22,3,22,4],[22,8,22,9],[23,3,23,4],[23,8,23,9],[24,3,24,4],[24,8,24,9]]}
["Minnesota State High School League Dance Team Competition"]
["Jazz Judges Recap Sheet"]
[]
[null,"School:",{"$f":"IF('Ranking Sheet'!B35=0, \"\", 'Ranking Sheet'!B35)","v":""},null,null,null,null,null,"Class:",null,null,null,{"$f":"IF(Class=0, \"\", Class)","v":""}]
[null,"Meet Site:",{"$f":"IF(Site=0, \"\", Site)","v":""},null,null,null,null,null,"Meet Date:",null,null,null,{"$f":"IF(DATE=0, \"\", DATE)","v":""}]
[]
["Judge's Initials → ",null,null,{"$f":"IF('Ranking Sheet'!D10=0, \"\", 'Ranking Sheet'!D10)","v":""},{"$f":"IF('Ranking Sheet'!F10=0, \"\", 'Ranking Sheet'!F10)","v":""},{"$f":"IF('Ranking Sheet'!H10=0, \"\", 'Ranking Sheet'!H10)","v":""},{"$f":"IF('Ranking Sheet'!J10=0, \"\", 'Ranking Sheet'!J10)","v":""},{"$f":"IF('Ranking Sheet'!L10=0, \"\", 'Ranking Sheet'!L10)","v":""},{"$f":"IF('Ranking Sheet'!N10=0, \"\", 'Ranking Sheet'!N10)","v":""},{"$f":"IF('Ranking Sheet'!P10=0, \"\", 'Ranking Sheet'!P10)","v":""},{"$f":"IF('Ranking Sheet'!R10=0, \"\", 'Ranking Sheet'!R10)","v":""},"Category Total Points","Total Points Possible",null,"Subtotal Points","Subtotal Points Possible"]
["Category",null,null,1,2,3,4,5,6,7,8]
["SKILLS","Technique of Turns",null,null,null,null,null,null,null,null,null,{"$f":"IF(D9=0, \"\", SUM(D9:K9))","v":""},"/",{"$f":"IF(D9=\"\", \"\", IF(K9=0, 70, 80))","v":""}]
[null,"Technique of Leaps & Jumps",null,null,null,null,null,null,null,null,null,{"$f":"IF(D10=0, \"\", SUM(D10:K10))","v":""},"/",{"$f":"IF(D10=\"\", \"\", IF(K10=0, 70, 80))","v":""},{"$f":"IF(D9=0, \"\", SUM(D9:K10))","v":""},"/",{"$f":"IF(D9=\"\", \"\", IF(K9=0, 140, 160))","v":""}]
["CHOREOGRAPHY","Creativity",null,null,null,null,null,null,null,null,null,{"$f":"IF(D11=0, \"\", SUM(D11:K11))","v":""},"/",""]
[null,"Visual Effectiveness",null,null,null,null,null,null,null,null,null,"","/","",{"$f":"IF(D11=0, \"\", SUM(D11:K12))","v":""},"/",{"$f":"IF(D11=\"\", \"\", IF(K11=0, 140, 160))","v":""}]
["DIFFICULTY","Diffuculty of Routine Choreography",null,null,null,null,null,null,null,null,null,"","/",""]
[null,"Difficulty of Formations and Transitions",null,null,null,null,null,null,null,null,null,"","/",""]
[null,"Difficulty of Skills",null,null,null,null,null,null,null,null,null,"","/","",{"$f":"IF(D13=0, \"\", SUM(D13:K15))","v":""},"/",{"$f":"IF(D13=\"\", \"\", IF(K13=0, 210, 240))","v":""}]
["EXECUTION","Placement & Control",null,null,null,null,null,null,null,null,null,"","/",""]
[null,"Degree of Accuracy",null,null,null,null,null,null,null,null,null,"","/","",{"$f":"IF(D16=0, \"\", SUM(D16:K17))","v":""},"/",{"$f":"IF(D16=\"\", \"\", IF(K16=0, 140, 160))","v":""}]
["R.E.","Routine Effectiveness",null,null,null,null,null,null,null,null,null,"","/","",{"$f":"IF(D18=0, \"\", SUM(D18:K18))","v":""},"/",{"$f":"IF(D18=\"\", \"\", IF(K18=0, 70, 80))","v":""}]
[null,"SUB TOTALS",null,{"$f":"D9+D10+D11+D12+D13+D14+D15+D16+D17+D18","v":0},{"$f":"E9+E10+E11+E12+E13+E14+E15+E16+E17+E18","v":0},0,0,0,0,0,0,{"$f":"IF(D9=0, \"\", SUM(D19:K19))","v":""},"/",{"$f":"IF(D9=\"\", \"\", SUM(N9:N18))","v":""},{"$f":"IF(D9=0, \"\", SUM(O9:O18))","v":""},"/",{"$f":"IF(D9=\"\", \"\", SUM(Q9:Q18))","v":""}]
[null,"DEDUCTIONS \nEnter as a negative number i.e. -3 or DQ",null,null,null,null,null,null,null,null,null,{"$f":"IF(D20=\"\", \"\", IF(D20=\"DQ\",\"DQ\",SUM(D20:K20)))","v":""},null,null,{"$f":"IF(D20=\"\", \"\", IF(D20=\"DQ\",\"DQ\",SUM(D20:K20)))","v":""}]
[null,"TOTALS",null,{"$f":"IF(D20=\"DQ\", \"DQ\",SUM(D19+D20))","v":0},0,0,0,0,0,{"$f":"IF(J20=\"DQ\", \"DQ\",SUM(J19+J20))","v":0},{"$f":"IF(K20=\"DQ\", \"DQ\",SUM(K19+K20))","v":0},{"$f":"IF(D9=0, \"\", IF(D20=\"DQ\",\"DQ\",SUM(D21:K21)))","v":""},"/",{"$f":"IF(D9=\"\", \"\", SUM(N9:N18))","v":""},{"$f":"IF(D9=0, \"\", IF(D20=\"DQ\",\"DQ\",SUM(O19:O20)))","v":""},"/",{"$f":"IF(D9=\"\", \"\", SUM(Q9:Q18))","v":""}]
[]
[null,"KC/T #1","Time:",null,null,null,"Kick Count:",null,null,null,null,null,"# Comp:"]
[null,"KC/T #2","Time:",null,null,null,"Kick Count:",null,null,null,null,null,"# Comp:"]
[null,"KC/T #3","Time:",null,null,null,"Kick Count:",null,null,null,null,null,"# Comp:"]

{"sheet":"Tie-Breaker Sheet","index":29,"n_rows":37,"n_cols":13,"rows_kept":37,"cut":false,"hidden":false,"merged":[[8,11,10,11],[6,0,8,2],[6,4,6,11],[6,12,7,12],[4,0,4,12],[6,3,10,3],[8,12,10,12],[9,0,9,2],[10,0,10,2],[8,8,10,8],[1,0,1,1],[1,3,1,4],[1,5,1,8],[1,11,1,12],[3,0,3,12],[7,4,7,5],[7,6,7,7],[7,8,7,9],[8,10,10,10],[15,1,15,2],[11,1,11,2],[12,1,12,2],[13,1,13,2],[8,6,10,6],[8,7,10,7],[22,1,22,2],[8,9,10,9],[28,1,28,2],[29,1,29,2],[30,1,30,2],[7,10,7,11],[8,4,10,4],[8,5,10,5],[19,1,19,2],[14,1,14,2],[23,1,23,2],[24,1,24,2],[25,1,25,2],[32,1,32,2],[33,1,33,2],[16,1,16,2],[17,1,17,2],[18,1,18,2],[20,1,20,2],[21,1,21,2],[27,1,27,2],[26,1,26,2],[34,1,34,2],[36,0,36,2],[36,7,36,8],[31,1,31,2]]}
[]
["MEET DATE",null,{"$f":"IF(DATE=0, \"\", DATE)","v":""},"MEET SITE",null,{"$f":"IF(Site=0, \"\", Site)","v":""},null,null,null,"CLASS",{"$f":"IF(Class=0, \"\", Class)","v":""},{"$f":"CATEGORY","v":"Jazz Category"}]
[]
["Minnesota State High School League Dance Team Competition"]
["State and Section Competition - Tie-Breaker Rank A Sheet"]
[]
[null,null,null,"Subtotal Final Placement Before Extra\nTie-breakers","Tie-Breakers",null,null,null,null,null,null,null,"Final\nPlace"]
[null,null,null,null,"3rd Tie Break",null,"4th Tie Break",null,"5th Tie Break",null,"6th Tie Break"]
[null,null,null,null,"Total Points minus High and Low Points","New Total Rank","Total Points","New Total Rank","Superior Judges Rank","New Total Rank","Total of All Judges Rank minus Superior Judge Rank","New Total Rank"]
[]
["School"]
[1,{"$f":"IF(Team1=0, \"\", Team1)","v":""},null,{"$f":"IF('Rank Wkst'!AQ8<>0, 'Rank Wkst'!BW8, \"\")","v":""},{"$f":"IF(AND('Rank Wkst'!BR8>1, D12<>\"DQ\"),'Rank Wkst'!CR8, \"\")","v":""},{"$f":"IF(AND('Rank Wkst'!BR8>1,'Rank Wkst'!C8<>\"DQ\"), 'Rank Wkst'!CW8, \"\")","v":""},{"$f":"IF(AND('Rank Wkst'!CU8>1, D12<>\"DQ\"), 'Rank Wkst'!CY8, \"\")","v":""},{"$f":"IF(AND('Rank Wkst'!CU8>1,'Rank Wkst'!C8<>\"DQ\"), 'Rank Wkst'!DC8, \"\")","v":""},{"$f":"IF(AND('Rank Wkst'!DA8>1, D12<>\"DQ\"), 'Rank Wkst'!DE8, \"\")","v":""},{"$f":"IF(AND('Rank Wkst'!DA8>1,'Rank Wkst'!C8<>\"DQ\"), 'Rank Wkst'!DI8, \"\")","v":""},{"$f":"IF(AND('Rank Wkst'!DG8>1, D12<>\"DQ\"), 'Rank Wkst'!DL8, \"\")","v":""},{"$f":"IF(AND('Rank Wkst'!DG8>1,'Rank Wkst'!C8<>\"DQ\"), 'Rank Wkst'!DP8, \"\")","v":""},{"$f":"IF('Rank Wkst'!AQ8<>0,'Rank Wkst'!DS8,\"\")","v":""}]
[2,{"$f":"IF(Team2=0, \"\", Team2)","v":""},null,{"$f":"IF('Rank Wkst'!AQ9<>0, 'Rank Wkst'!BW9, \"\")","v":""},{"$f":"IF(AND('Rank Wkst'!BR9>1, D13<>\"DQ\"),'Rank Wkst'!CR9, \"\")","v":""},{"$f":"IF(AND('Rank Wkst'!BR9>1,'Rank Wkst'!C9<>\"DQ\"), 'Rank Wkst'!CW9, \"\")","v":""},{"$f":"IF(AND('Rank Wkst'!CU9>1, D13<>\"DQ\"), 'Rank Wkst'!CY9, \"\")","v":""},{"$f":"IF(AND('Rank Wkst'!CU9>1,'Rank Wkst'!C9<>\"DQ\"), 'Rank Wkst'!DC9, \"\")","v":""},{"$f":"IF(AND('Rank Wkst'!DA9>1, D13<>\"DQ\"), 'Rank Wkst'!DE9, \"\")","v":""},{"$f":"IF(AND('Rank Wkst'!DA9>1,'Rank Wkst'!C9<>\"DQ\"), 'Rank Wkst'!DI9, \"\")","v":""},{"$f":"IF(AND('Rank Wkst'!DG9>1, D13<>\"DQ\"), 'Rank Wkst'!DL9, \"\")","v":""},{"$f":"IF(AND('Rank Wkst'!DG9>1,'Rank Wkst'!C9<>\"DQ\"), 'Rank Wkst'!DP9, \"\")","v":""},{"$f":"IF('Rank Wkst'!AQ9<>0,'Rank Wkst'!DS9,\"\")","v":""}]
[3,{"$f":"IF(Team3=0, \"\", Team3)","v":""},null,{"$f":"IF('Rank Wkst'!AQ10<>0, 'Rank Wkst'!BW10, \"\")","v":""},{"$f":"IF(AND('Rank Wkst'!BR10>1, D14<>\"DQ\"),'Rank Wkst'!CR10, \"\")","v":""},{"$f":"IF(AND('Rank Wkst'!BR10>1,'Rank Wkst'!C10<>\"DQ\"), 'Rank Wkst'!CW10, \"\")","v":""},{"$f":"IF(AND('Rank Wkst'!CU10>1, D14<>\"DQ\"), 'Rank Wkst'!CY10, \"\")","v":""},{"$f":"IF(AND('Rank Wkst'!CU10>1,'Rank Wkst'!C10<>\"DQ\"), 'Rank Wkst'!DC10, \"\")","v":""},{"$f":"IF(AND('Rank Wkst'!DA10>1, D14<>\"DQ\"), 'Rank Wkst'!DE10, \"\")","v":""},{"$f":"IF(AND('Rank Wkst'!DA10>1,'Rank Wkst'!C10<>\"DQ\"), 'Rank Wkst'!DI10, \"\")","v":""},{"$f":"IF(AND('Rank Wkst'!DG10>1, D14<>\"DQ\"), 'Rank Wkst'!DL10, \"\")","v":""},{"$f":"IF(AND('Rank Wkst'!DG10>1,'Rank Wkst'!C10<>\"DQ\"), 'Rank Wkst'!DP10, \"\")","v":""},{"$f":"IF('Rank Wkst'!AQ10<>0,'Rank Wkst'!DS10,\"\")","v":""}]
[4,{"$f":"IF(Team4=0, \"\", Team4)","v":""},null,{"$f":"IF('Rank Wkst'!AQ11<>0, 'Rank Wkst'!BW11, \"\")","v":""},{"$f":"IF(AND('Rank Wkst'!BR11>1, D15<>\"DQ\"),'Rank Wkst'!CR11, \"\")","v":""},{"$f":"IF(AND('Rank Wkst'!BR11>1,'Rank Wkst'!C11<>\"DQ\"), 'Rank Wkst'!CW11, \"\")","v":""},{"$f":"IF(AND('Rank Wkst'!CU11>1, D15<>\"DQ\"), 'Rank Wkst'!CY11, \"\")","v":""},{"$f":"IF(AND('Rank Wkst'!CU11>1,'Rank Wkst'!C11<>\"DQ\"), 'Rank Wkst'!DC11, \"\")","v":""},{"$f":"IF(AND('Rank Wkst'!DA11>1, D15<>\"DQ\"), 'Rank Wkst'!DE11, \"\")","v":""},{"$f":"IF(AND('Rank Wkst'!DA11>1,'Rank Wkst'!C11<>\"DQ\"), 'Rank Wkst'!DI11, \"\")","v":""},{"$f":"IF(AND('Rank Wkst'!DG11>1, D15<>\"DQ\"), 'Rank Wkst'!DL11, \"\")","v":""},{"$f":"IF(AND('Rank Wkst'!DG11>1,'Rank Wkst'!C11<>\"DQ\"), 'Rank Wkst'!DP11, \"\")","v":""},{"$f":"IF('Rank Wkst'!AQ11<>0,'Rank Wkst'!DS11,\"\")","v":""}]
[5,{"$f":"IF(Team5=0, \"\", Team5)","v":""},null,{"$f":"IF('Rank Wkst'!AQ12<>0, 'Rank Wkst'!BW12, \"\")","v":""},{"$f":"IF(AND('Rank Wkst'!BR12>1, D16<>\"DQ\"),'Rank Wkst'!CR12, \"\")","v":""},{"$f":"IF(AND('Rank Wkst'!BR12>1,'Rank Wkst'!C12<>\"DQ\"), 'Rank Wkst'!CW12, \"\")","v":""},{"$f":"IF(AND('Rank Wkst'!CU12>1, D16<>\"DQ\"), 'Rank Wkst'!CY12, \"\")","v":""},{"$f":"IF(AND('Rank Wkst'!CU12>1,'Rank Wkst'!C12<>\"DQ\"), 'Rank Wkst'!DC12, \"\")","v":""},{"$f":"IF(AND('Rank Wkst'!DA12>1, D16<>\"DQ\"), 'Rank Wkst'!DE12, \"\")","v":""},{"$f":"IF(AND('Rank Wkst'!DA12>1,'Rank Wkst'!C12<>\"DQ\"), 'Rank Wkst'!DI12, \"\")","v":""},{"$f":"IF(AND('Rank Wkst'!DG12>1, D16<>\"DQ\"), 'Rank Wkst'!DL12, \"\")","v":""},{"$f":"IF(AND('Rank Wkst'!DG12>1,'Rank Wkst'!C12<>\"DQ\"), 'Rank Wkst'!DP12, \"\")","v":""},{"$f":"IF('Rank Wkst'!AQ12<>0,'Rank Wkst'!DS12,\"\")","v":""}]
[6,{"$f":"IF(Team6=0, \"\", Team6)","v":""},null,{"$f":"IF('Rank Wkst'!AQ13<>0, 'Rank Wkst'!BW13, \"\")","v":""},{"$f":"IF(AND('Rank Wkst'!BR13>1, D17<>\"DQ\"),'Rank Wkst'!CR13, \"\")","v":""},{"$f":"IF(AND('Rank Wkst'!BR13>1,'Rank Wkst'!C13<>\"DQ\"), 'Rank Wkst'!CW13, \"\")","v":""},{"$f":"IF(AND('Rank Wkst'!CU13>1, D17<>\"DQ\"), 'Rank Wkst'!CY13, \"\")","v":""},{"$f":"IF(AND('Rank Wkst'!CU13>1,'Rank Wkst'!C13<>\"DQ\"), 'Rank Wkst'!DC13, \"\")","v":""},{"$f":"IF(AND('Rank Wkst'!DA13>1, D17<>\"DQ\"), 'Rank Wkst'!DE13, \"\")","v":""},{"$f":"IF(AND('Rank Wkst'!DA13>1,'Rank Wkst'!C13<>\"DQ\"), 'Rank Wkst'!DI13, \"\")","v":""},{"$f":"IF(AND('Rank Wkst'!DG13>1, D17<>\"DQ\"), 'Rank Wkst'!DL13, \"\")","v":""},{"$f":"IF(AND('Rank Wkst'!DG13>1,'Rank Wkst'!C13<>\"DQ\"), 'Rank Wkst'!DP13, \"\")","v":""},{"$f":"IF('Rank Wkst'!AQ13<>0,'Rank Wkst'!DS13,\"\")","v":""}]
[7,{"$f":"IF(Team7=0, \"\", Team7)","v":""},null,{"$f":"IF('Rank Wkst'!AQ14<>0, 'Rank Wkst'!BW14, \"\")","v":""},{"$f":"IF(AND('Rank Wkst'!BR14>1, D18<>\"DQ\"),'Rank Wkst'!CR14, \"\")","v":""},{"$f":"IF(AND('Rank Wkst'!BR14>1,'Rank Wkst'!C14<>\"DQ\"), 'Rank Wkst'!CW14, \"\")","v":""},{"$f":"IF(AND('Rank Wkst'!CU14>1, D18<>\"DQ\"), 'Rank Wkst'!CY14, \"\")","v":""},{"$f":"IF(AND('Rank Wkst'!CU14>1,'Rank Wkst'!C14<>\"DQ\"), 'Rank Wkst'!DC14, \"\")","v":""},{"$f":"IF(AND('Rank Wkst'!DA14>1, D18<>\"DQ\"), 'Rank Wkst'!DE14, \"\")","v":""},{"$f":"IF(AND('Rank Wkst'!DA14>1,'Rank Wkst'!C14<>\"DQ\"), 'Rank Wkst'!DI14, \"\")","v":""},{"$f":"IF(AND('Rank Wkst'!DG14>1, D18<>\"DQ\"), 'Rank Wkst'!DL14, \"\")","v":""},{"$f":"IF(AND('Rank Wkst'!DG14>1,'Rank Wkst'!C14<>\"DQ\"), 'Rank Wkst'!DP14, \"\")","v":""},{"$f":"IF('Rank Wkst'!AQ14<>0,'Rank Wkst'!DS14,\"\")","v":""}]
[8,{"$f":"IF(Team8=0, \"\", Team8)","v":""},null,{"$f":"IF('Rank Wkst'!AQ15<>0, 'Rank Wkst'!BW15, \"\")","v":""},{"$f":"IF(AND('Rank Wkst'!BR15>1, D19<>\"DQ\"),'Rank Wkst'!CR15, \"\")","v":""},{"$f":"IF(AND('Rank Wkst'!BR15>1,'Rank Wkst'!C15<>\"DQ\"), 'Rank Wkst'!CW15, \"\")","v":""},{"$f":"IF(AND('Rank Wkst'!CU15>1, D19<>\"DQ\"), 'Rank Wkst'!CY15, \"\")","v":""},{"$f":"IF(AND('Rank Wkst'!CU15>1,'Rank Wkst'!C15<>\"DQ\"), 'Rank Wkst'!DC15, \"\")","v":""},{"$f":"IF(AND('Rank Wkst'!DA15>1, D19<>\"DQ\"), 'Rank Wkst'!DE15, \"\")","v":""},{"$f":"IF(AND('Rank Wkst'!DA15>1,'Rank Wkst'!C15<>\"DQ\"), 'Rank Wkst'!DI15, \"\")","v":""},{"$f":"IF(AND('Rank Wkst'!DG15>1, D19<>\"DQ\"), 'Rank Wkst'!DL15, \"\")","v":""},{"$f":"IF(AND('Rank Wkst'!DG15>1,'Rank Wkst'!C15<>\"DQ\"), 'Rank Wkst'!DP15, \"\")","v":""},{"$f":"IF('Rank Wkst'!AQ15<>0,'Rank Wkst'!DS15,\"\")","v":""}]
[9,{"$f":"IF(Team9=0, \"\", Team9)","v":""},null,{"$f":"IF('Rank Wkst'!AQ16<>0, 'Rank Wkst'!BW16, \"\")","v":""},{"$f":"IF(AND('Rank Wkst'!BR16>1, D20<>\"DQ\"),'Rank Wkst'!CR16, \"\")","v":""},{"$f":"IF(AND('Rank Wkst'!BR16>1,'Rank Wkst'!C16<>\"DQ\"), 'Rank Wkst'!CW16, \"\")","v":""},{"$f":"IF(AND('Rank Wkst'!CU16>1, D20<>\"DQ\"), 'Rank Wkst'!CY16, \"\")","v":""},{"$f":"IF(AND('Rank Wkst'!CU16>1,'Rank Wkst'!C16<>\"DQ\"), 'Rank Wkst'!DC16, \"\")","v":""},{"$f":"IF(AND('Rank Wkst'!DA16>1, D20<>\"DQ\"), 'Rank Wkst'!DE16, \"\")","v":""},{"$f":"IF(AND('Rank Wkst'!DA16>1,'Rank Wkst'!C16<>\"DQ\"), 'Rank Wkst'!DI16, \"\")","v":""},{"$f":"IF(AND('Rank Wkst'!DG16>1, D20<>\"DQ\"), 'Rank Wkst'!DL16, \"\")","v":""},{"$f":"IF(AND('Rank Wkst'!DG16>1,'Rank Wkst'!C16<>\"DQ\"), 'Rank Wkst'!DP16, \"\")","v":""},{"$f":"IF('Rank Wkst'!AQ16<>0,'Rank Wkst'!DS16,\"\")","v":""}]
[10,{"$f":"IF(Team10=0, \"\", Team10)","v":""},null,{"$f":"IF('Rank Wkst'!AQ17<>0, 'Rank Wkst'!BW17, \"\")","v":""},{"$f":"IF(AND('Rank Wkst'!BR17>1, D21<>\"DQ\"),'Rank Wkst'!CR17, \"\")","v":""},{"$f":"IF(AND('Rank Wkst'!BR17>1,'Rank Wkst'!C17<>\"DQ\"), 'Rank Wkst'!CW17, \"\")","v":""},{"$f":"IF(AND('Rank Wkst'!CU17>1, D21<>\"DQ\"), 'Rank Wkst'!CY17, \"\")","v":""},{"$f":"IF(AND('Rank Wkst'!CU17>1,'Rank Wkst'!C17<>\"DQ\"), 'Rank Wkst'!DC17, \"\")","v":""},{"$f":"IF(AND('Rank Wkst'!DA17>1, D21<>\"DQ\"), 'Rank Wkst'!DE17, \"\")","v":""},{"$f":"IF(AND('Rank Wkst'!DA17>1,'Rank Wkst'!C17<>\"DQ\"), 'Rank Wkst'!DI17, \"\")","v":""},{"$f":"IF(AND('Rank Wkst'!DG17>1, D21<>\"DQ\"), 'Rank Wkst'!DL17, \"\")","v":""},{"$f":"IF(AND('Rank Wkst'!DG17>1,'Rank Wkst'!C17<>\"DQ\"), 'Rank Wkst'!DP17, \"\")","v":""},{"$f":"IF('Rank Wkst'!AQ17<>0,'Rank Wkst'!DS17,\"\")","v":""}]
[11,{"$f":"IF(Team11=0, \"\", Team11)","v":""},null,{"$f":"IF('Rank Wkst'!AQ18<>0, 'Rank Wkst'!BW18, \"\")","v":""},{"$f":"IF(AND('Rank Wkst'!BR18>1, D22<>\"DQ\"),'Rank Wkst'!CR18, \"\")","v":""},{"$f":"IF(AND('Rank Wkst'!BR18>1,'Rank Wkst'!C18<>\"DQ\"), 'Rank Wkst'!CW18, \"\")","v":""},{"$f":"IF(AND('Rank Wkst'!CU18>1, D22<>\"DQ\"), 'Rank Wkst'!CY18, \"\")","v":""},{"$f":"IF(AND('Rank Wkst'!CU18>1,'Rank Wkst'!C18<>\"DQ\"), 'Rank Wkst'!DC18, \"\")","v":""},{"$f":"IF(AND('Rank Wkst'!DA18>1, D22<>\"DQ\"), 'Rank Wkst'!DE18, \"\")","v":""},{"$f":"IF(AND('Rank Wkst'!DA18>1,'Rank Wkst'!C18<>\"DQ\"), 'Rank Wkst'!DI18, \"\")","v":""},{"$f":"IF(AND('Rank Wkst'!DG18>1, D22<>\"DQ\"), 'Rank Wkst'!DL18, \"\")","v":""},{"$f":"IF(AND('Rank Wkst'!DG18>1,'Rank Wkst'!C18<>\"DQ\"), 'Rank Wkst'!DP18, \"\")","v":""},{"$f":"IF('Rank Wkst'!AQ18<>0,'Rank Wkst'!DS18,\"\")","v":""}]
[12,{"$f":"IF(Team12=0, \"\", Team12)","v":""},null,{"$f":"IF('Rank Wkst'!AQ19<>0, 'Rank Wkst'!BW19, \"\")","v":""},{"$f":"IF(AND('Rank Wkst'!BR19>1, D23<>\"DQ\"),'Rank Wkst'!CR19, \"\")","v":""},{"$f":"IF(AND('Rank Wkst'!BR19>1,'Rank Wkst'!C19<>\"DQ\"), 'Rank Wkst'!CW19, \"\")","v":""},{"$f":"IF(AND('Rank Wkst'!CU19>1, D23<>\"DQ\"), 'Rank Wkst'!CY19, \"\")","v":""},{"$f":"IF(AND('Rank Wkst'!CU19>1,'Rank Wkst'!C19<>\"DQ\"), 'Rank Wkst'!DC19, \"\")","v":""},{"$f":"IF(AND('Rank Wkst'!DA19>1, D23<>\"DQ\"), 'Rank Wkst'!DE19, \"\")","v":""},{"$f":"IF(AND('Rank Wkst'!DA19>1,'Rank Wkst'!C19<>\"DQ\"), 'Rank Wkst'!DI19, \"\")","v":""},{"$f":"IF(AND('Rank Wkst'!DG19>1, D23<>\"DQ\"), 'Rank Wkst'!DL19, \"\")","v":""},{"$f":"IF(AND('Rank Wkst'!DG19>1,'Rank Wkst'!C19<>\"DQ\"), 'Rank Wkst'!DP19, \"\")","v":""},{"$f":"IF('Rank Wkst'!AQ19<>0,'Rank Wkst'!DS19,\"\")","v":""}]
[13,{"$f":"IF(Team13=0, \"\", Team13)","v":""},null,{"$f":"IF('Rank Wkst'!AQ20<>0, 'Rank Wkst'!BW20, \"\")","v":""},{"$f":"IF(AND('Rank Wkst'!BR20>1, D24<>\"DQ\"),'Rank Wkst'!CR20, \"\")","v":""},{"$f":"IF(AND('Rank Wkst'!BR20>1,'Rank Wkst'!C20<>\"DQ\"), 'Rank Wkst'!CW20, \"\")","v":""},{"$f":"IF(AND('Rank Wkst'!CU20>1, D24<>\"DQ\"), 'Rank Wkst'!CY20, \"\")","v":""},{"$f":"IF(AND('Rank Wkst'!CU20>1,'Rank Wkst'!C20<>\"DQ\"), 'Rank Wkst'!DC20, \"\")","v":""},{"$f":"IF(AND('Rank Wkst'!DA20>1, D24<>\"DQ\"), 'Rank Wkst'!DE20, \"\")","v":""},{"$f":"IF(AND('Rank Wkst'!DA20>1,'Rank Wkst'!C20<>\"DQ\"), 'Rank Wkst'!DI20, \"\")","v":""},{"$f":"IF(AND('Rank Wkst'!DG20>1, D24<>\"DQ\"), 'Rank Wkst'!DL20, \"\")","v":""},{"$f":"IF(AND('Rank Wkst'!DG20>1,'Rank Wkst'!C20<>\"DQ\"), 'Rank Wkst'!DP20, \"\")","v":""},{"$f":"IF('Rank Wkst'!AQ20<>0,'Rank Wkst'!DS20,\"\")","v":""}]
[14,{"$f":"IF(Team14=0, \"\", Team14)","v":""},null,{"$f":"IF('Rank Wkst'!AQ21<>0, 'Rank Wkst'!BW21, \"\")","v":""},{"$f":"IF(AND('Rank Wkst'!BR21>1, D25<>\"DQ\"),'Rank Wkst'!CR21, \"\")","v":""},{"$f":"IF(AND('Rank Wkst'!BR21>1,'Rank Wkst'!C21<>\"DQ\"), 'Rank Wkst'!CW21, \"\")","v":""},{"$f":"IF(AND('Rank Wkst'!CU21>1, D25<>\"DQ\"), 'Rank Wkst'!CY21, \"\")","v":""},{"$f":"IF(AND('Rank Wkst'!CU21>1,'Rank Wkst'!C21<>\"DQ\"), 'Rank Wkst'!DC21, \"\")","v":""},{"$f":"IF(AND('Rank Wkst'!DA21>1, D25<>\"DQ\"), 'Rank Wkst'!DE21, \"\")","v":""},{"$f":"IF(AND('Rank Wkst'!DA21>1,'Rank Wkst'!C21<>\"DQ\"), 'Rank Wkst'!DI21, \"\")","v":""},{"$f":"IF(AND('Rank Wkst'!DG21>1, D25<>\"DQ\"), 'Rank Wkst'!DL21, \"\")","v":""},{"$f":"IF(AND('Rank Wkst'!DG21>1,'Rank Wkst'!C21<>\"DQ\"), 'Rank Wkst'!DP21, \"\")","v":""},{"$f":"IF('Rank Wkst'!AQ21<>0,'Rank Wkst'!DS21,\"\")","v":""}]
[15,{"$f":"IF(Team15=0, \"\", Team15)","v":""},null,{"$f":"IF('Rank Wkst'!AQ22<>0, 'Rank Wkst'!BW22, \"\")","v":""},{"$f":"IF(AND('Rank Wkst'!BR22>1, D26<>\"DQ\"),'Rank Wkst'!CR22, \"\")","v":""},{"$f":"IF(AND('Rank Wkst'!BR22>1,'Rank Wkst'!C22<>\"DQ\"), 'Rank Wkst'!CW22, \"\")","v":""},{"$f":"IF(AND('Rank Wkst'!CU22>1, D26<>\"DQ\"), 'Rank Wkst'!CY22, \"\")","v":""},{"$f":"IF(AND('Rank Wkst'!CU22>1,'Rank Wkst'!C22<>\"DQ\"), 'Rank Wkst'!DC22, \"\")","v":""},{"$f":"IF(AND('Rank Wkst'!DA22>1, D26<>\"DQ\"), 'Rank Wkst'!DE22, \"\")","v":""},{"$f":"IF(AND('Rank Wkst'!DA22>1,'Rank Wkst'!C22<>\"DQ\"), 'Rank Wkst'!DI22, \"\")","v":""},{"$f":"IF(AND('Rank Wkst'!DG22>1, D26<>\"DQ\"), 'Rank Wkst'!DL22, \"\")","v":""},{"$f":"IF(AND('Rank Wkst'!DG22>1,'Rank Wkst'!C22<>\"DQ\"), 'Rank Wkst'!DP22, \"\")","v":""},{"$f":"IF('Rank Wkst'!AQ22<>0,'Rank Wkst'!DS22,\"\")","v":""}]
[16,{"$f":"IF(Team16=0, \"\", Team16)","v":""},null,{"$f":"IF('Rank Wkst'!AQ23<>0, 'Rank Wkst'!BW23, \"\")","v":""},{"$f":"IF(AND('Rank Wkst'!BR23>1, D27<>\"DQ\"),'Rank Wkst'!CR23, \"\")","v":""},{"$f":"IF(AND('Rank Wkst'!BR23>1,'Rank Wkst'!C23<>\"DQ\"), 'Rank Wkst'!CW23, \"\")","v":""},{"$f":"IF(AND('Rank Wkst'!CU23>1, D27<>\"DQ\"), 'Rank Wkst'!CY23, \"\")","v":""},{"$f":"IF(AND('Rank Wkst'!CU23>1,'Rank Wkst'!C23<>\"DQ\"), 'Rank Wkst'!DC23, \"\")","v":""},{"$f":"IF(AND('Rank Wkst'!DA23>1, D27<>\"DQ\"), 'Rank Wkst'!DE23, \"\")","v":""},{"$f":"IF(AND('Rank Wkst'!DA23>1,'Rank Wkst'!C23<>\"DQ\"), 'Rank Wkst'!DI23, \"\")","v":""},{"$f":"IF(AND('Rank Wkst'!DG23>1, D27<>\"DQ\"), 'Rank Wkst'!DL23, \"\")","v":""},{"$f":"IF(AND('Rank Wkst'!DG23>1,'Rank Wkst'!C23<>\"DQ\"), 'Rank Wkst'!DP23, \"\")","v":""},{"$f":"IF('Rank Wkst'!AQ23<>0,'Rank Wkst'!DS23,\"\")","v":""}]
[17,{"$f":"IF(Team17=0, \"\", Team17)","v":""},null,{"$f":"IF('Rank Wkst'!AQ24<>0, 'Rank Wkst'!BW24, \"\")","v":""},{"$f":"IF(AND('Rank Wkst'!BR24>1, D28<>\"DQ\"),'Rank Wkst'!CR24, \"\")","v":""},{"$f":"IF(AND('Rank Wkst'!BR24>1,'Rank Wkst'!C24<>\"DQ\"), 'Rank Wkst'!CW24, \"\")","v":""},{"$f":"IF(AND('Rank Wkst'!CU24>1, D28<>\"DQ\"), 'Rank Wkst'!CY24, \"\")","v":""},{"$f":"IF(AND('Rank Wkst'!CU24>1,'Rank Wkst'!C24<>\"DQ\"), 'Rank Wkst'!DC24, \"\")","v":""},{"$f":"IF(AND('Rank Wkst'!DA24>1, D28<>\"DQ\"), 'Rank Wkst'!DE24, \"\")","v":""},{"$f":"IF(AND('Rank Wkst'!DA24>1,'Rank Wkst'!C24<>\"DQ\"), 'Rank Wkst'!DI24, \"\")","v":""},{"$f":"IF(AND('Rank Wkst'!DG24>1, D28<>\"DQ\"), 'Rank Wkst'!DL24, \"\")","v":""},{"$f":"IF(AND('Rank Wkst'!DG24>1,'Rank Wkst'!C24<>\"DQ\"), 'Rank Wkst'!DP24, \"\")","v":""},{"$f":"IF('Rank Wkst'!AQ24<>0,'Rank Wkst'!DS24,\"\")","v":""}]
[18,{"$f":"IF(Team18=0, \"\", Team18)","v":""},null,{"$f":"IF('Rank Wkst'!AQ25<>0, 'Rank Wkst'!BW25, \"\")","v":""},{"$f":"IF(AND('Rank Wkst'!BR25>1, D29<>\"DQ\"),'Rank Wkst'!CR25, \"\")","v":""},{"$f":"IF(AND('Rank Wkst'!BR25>1,'Rank Wkst'!C25<>\"DQ\"), 'Rank Wkst'!CW25, \"\")","v":""},{"$f":"IF(AND('Rank Wkst'!CU25>1, D29<>\"DQ\"), 'Rank Wkst'!CY25, \"\")","v":""},{"$f":"IF(AND('Rank Wkst'!CU25>1,'Rank Wkst'!C25<>\"DQ\"), 'Rank Wkst'!DC25, \"\")","v":""},{"$f":"IF(AND('Rank Wkst'!DA25>1, D29<>\"DQ\"), 'Rank Wkst'!DE25, \"\")","v":""},{"$f":"IF(AND('Rank Wkst'!DA25>1,'Rank Wkst'!C25<>\"DQ\"), 'Rank Wkst'!DI25, \"\")","v":""},{"$f":"IF(AND('Rank Wkst'!DG25>1, D29<>\"DQ\"), 'Rank Wkst'!DL25, \"\")","v":""},{"$f":"IF(AND('Rank Wkst'!DG25>1,'Rank Wkst'!C25<>\"DQ\"), 'Rank Wkst'!DP25, \"\")","v":""},{"$f":"IF('Rank Wkst'!AQ25<>0,'Rank Wkst'!DS25,\"\")","v":""}]
[19,{"$f":"IF(Team19=0, \"\", Team19)","v":""},null,{"$f":"IF('Rank Wkst'!AQ26<>0, 'Rank Wkst'!BW26, \"\")","v":""},{"$f":"IF(AND('Rank Wkst'!BR26>1, D30<>\"DQ\"),'Rank Wkst'!CR26, \"\")","v":""},{"$f":"IF(AND('Rank Wkst'!BR26>1,'Rank Wkst'!C26<>\"DQ\"), 'Rank Wkst'!CW26, \"\")","v":""},{"$f":"IF(AND('Rank Wkst'!CU26>1, D30<>\"DQ\"), 'Rank Wkst'!CY26, \"\")","v":""},{"$f":"IF(AND('Rank Wkst'!CU26>1,'Rank Wkst'!C26<>\"DQ\"), 'Rank Wkst'!DC26, \"\")","v":""},{"$f":"IF(AND('Rank Wkst'!DA26>1, D30<>\"DQ\"), 'Rank Wkst'!DE26, \"\")","v":""},{"$f":"IF(AND('Rank Wkst'!DA26>1,'Rank Wkst'!C26<>\"DQ\"), 'Rank Wkst'!DI26, \"\")","v":""},{"$f":"IF(AND('Rank Wkst'!DG26>1, D30<>\"DQ\"), 'Rank Wkst'!DL26, \"\")","v":""},{"$f":"IF(AND('Rank Wkst'!DG26>1,'Rank Wkst'!C26<>\"DQ\"), 'Rank Wkst'!DP26, \"\")","v":""},{"$f":"IF('Rank Wkst'!AQ26<>0,'Rank Wkst'!DS26,\"\")","v":""}]
[20,{"$f":"IF(Team20=0, \"\", Team20)","v":""},null,{"$f":"IF('Rank Wkst'!AQ27<>0, 'Rank Wkst'!BW27, \"\")","v":""},{"$f":"IF(AND('Rank Wkst'!BR27>1, D31<>\"DQ\"),'Rank Wkst'!CR27, \"\")","v":""},{"$f":"IF(AND('Rank Wkst'!BR27>1,'Rank Wkst'!C27<>\"DQ\"), 'Rank Wkst'!CW27, \"\")","v":""},{"$f":"IF(AND('Rank Wkst'!CU27>1, D31<>\"DQ\"), 'Rank Wkst'!CY27, \"\")","v":""},{"$f":"IF(AND('Rank Wkst'!CU27>1,'Rank Wkst'!C27<>\"DQ\"), 'Rank Wkst'!DC27, \"\")","v":""},{"$f":"IF(AND('Rank Wkst'!DA27>1, D31<>\"DQ\"), 'Rank Wkst'!DE27, \"\")","v":""},{"$f":"IF(AND('Rank Wkst'!DA27>1,'Rank Wkst'!C27<>\"DQ\"), 'Rank Wkst'!DI27, \"\")","v":""},{"$f":"IF(AND('Rank Wkst'!DG27>1, D31<>\"DQ\"), 'Rank Wkst'!DL27, \"\")","v":""},{"$f":"IF(AND('Rank Wkst'!DG27>1,'Rank Wkst'!C27<>\"DQ\"), 'Rank Wkst'!DP27, \"\")","v":""},{"$f":"IF('Rank Wkst'!AQ27<>0,'Rank Wkst'!DS27,\"\")","v":""}]
[21,{"$f":"IF(Team21=0, \"\", Team21)","v":""},null,{"$f":"IF('Rank Wkst'!AQ28<>0, 'Rank Wkst'!BW28, \"\")","v":""},{"$f":"IF(AND('Rank Wkst'!BR28>1, D32<>\"DQ\"),'Rank Wkst'!CR28, \"\")","v":""},{"$f":"IF(AND('Rank Wkst'!BR28>1,'Rank Wkst'!C28<>\"DQ\"), 'Rank Wkst'!CW28, \"\")","v":""},{"$f":"IF(AND('Rank Wkst'!CU28>1, D32<>\"DQ\"), 'Rank Wkst'!CY28, \"\")","v":""},{"$f":"IF(AND('Rank Wkst'!CU28>1,'Rank Wkst'!C28<>\"DQ\"), 'Rank Wkst'!DC28, \"\")","v":""},{"$f":"IF(AND('Rank Wkst'!DA28>1, D32<>\"DQ\"), 'Rank Wkst'!DE28, \"\")","v":""},{"$f":"IF(AND('Rank Wkst'!DA28>1,'Rank Wkst'!C28<>\"DQ\"), 'Rank Wkst'!DI28, \"\")","v":""},{"$f":"IF(AND('Rank Wkst'!DG28>1, D32<>\"DQ\"), 'Rank Wkst'!DL28, \"\")","v":""},{"$f":"IF(AND('Rank Wkst'!DG28>1,'Rank Wkst'!C28<>\"DQ\"), 'Rank Wkst'!DP28, \"\")","v":""},{"$f":"IF('Rank Wkst'!AQ28<>0,'Rank Wkst'!DS28,\"\")","v":""}]
[22,{"$f":"IF(Team22=0, \"\", Team22)","v":""},null,{"$f":"IF('Rank Wkst'!AQ29<>0, 'Rank Wkst'!BW29, \"\")","v":""},{"$f":"IF(AND('Rank Wkst'!BR29>1, D33<>\"DQ\"),'Rank Wkst'!CR29, \"\")","v":""},{"$f":"IF(AND('Rank Wkst'!BR29>1,'Rank Wkst'!C29<>\"DQ\"), 'Rank Wkst'!CW29, \"\")","v":""},{"$f":"IF(AND('Rank Wkst'!CU29>1, D33<>\"DQ\"), 'Rank Wkst'!CY29, \"\")","v":""},{"$f":"IF(AND('Rank Wkst'!CU29>1,'Rank Wkst'!C29<>\"DQ\"), 'Rank Wkst'!DC29, \"\")","v":""},{"$f":"IF(AND('Rank Wkst'!DA29>1, D33<>\"DQ\"), 'Rank Wkst'!DE29, \"\")","v":""},{"$f":"IF(AND('Rank Wkst'!DA29>1,'Rank Wkst'!C29<>\"DQ\"), 'Rank Wkst'!DI29, \"\")","v":""},{"$f":"IF(AND('Rank Wkst'!DG29>1, D33<>\"DQ\"), 'Rank Wkst'!DL29, \"\")","v":""},{"$f":"IF(AND('Rank Wkst'!DG29>1,'Rank Wkst'!C29<>\"DQ\"), 'Rank Wkst'!DP29, \"\")","v":""},{"$f":"IF('Rank Wkst'!AQ29<>0,'Rank Wkst'!DS29,\"\")","v":""}]
[23,{"$f":"IF(Team23=0, \"\", Team23)","v":""},null,{"$f":"IF('Rank Wkst'!AQ30<>0, 'Rank Wkst'!BW30, \"\")","v":""},{"$f":"IF(AND('Rank Wkst'!BR30>1, D34<>\"DQ\"),'Rank Wkst'!CR30, \"\")","v":""},{"$f":"IF(AND('Rank Wkst'!BR30>1,'Rank Wkst'!C30<>\"DQ\"), 'Rank Wkst'!CW30, \"\")","v":""},{"$f":"IF(AND('Rank Wkst'!CU30>1, D34<>\"DQ\"), 'Rank Wkst'!CY30, \"\")","v":""},{"$f":"IF(AND('Rank Wkst'!CU30>1,'Rank Wkst'!C30<>\"DQ\"), 'Rank Wkst'!DC30, \"\")","v":""},{"$f":"IF(AND('Rank Wkst'!DA30>1, D34<>\"DQ\"), 'Rank Wkst'!DE30, \"\")","v":""},{"$f":"IF(AND('Rank Wkst'!DA30>1,'Rank Wkst'!C30<>\"DQ\"), 'Rank Wkst'!DI30, \"\")","v":""},{"$f":"IF(AND('Rank Wkst'!DG30>1, D34<>\"DQ\"), 'Rank Wkst'!DL30, \"\")","v":""},{"$f":"IF(AND('Rank Wkst'!DG30>1,'Rank Wkst'!C30<>\"DQ\"), 'Rank Wkst'!DP30, \"\")","v":""},{"$f":"IF('Rank Wkst'!AQ30<>0,'Rank Wkst'!DS30,\"\")","v":""}]
[24,{"$f":"IF(Team24=0, \"\", Team24)","v":""},null,{"$f":"IF('Rank Wkst'!AQ31<>0, 'Rank Wkst'!BW31, \"\")","v":""},{"$f":"IF(AND('Rank Wkst'!BR31>1, D35<>\"DQ\"),'Rank Wkst'!CR31, \"\")","v":""},{"$f":"IF(AND('Rank Wkst'!BR31>1,'Rank Wkst'!C31<>\"DQ\"), 'Rank Wkst'!CW31, \"\")","v":""},{"$f":"IF(AND('Rank Wkst'!CU31>1, D35<>\"DQ\"), 'Rank Wkst'!CY31, \"\")","v":""},{"$f":"IF(AND('Rank Wkst'!CU31>1,'Rank Wkst'!C31<>\"DQ\"), 'Rank Wkst'!DC31, \"\")","v":""},{"$f":"IF(AND('Rank Wkst'!DA31>1, D35<>\"DQ\"), 'Rank Wkst'!DE31, \"\")","v":""},{"$f":"IF(AND('Rank Wkst'!DA31>1,'Rank Wkst'!C31<>\"DQ\"), 'Rank Wkst'!DI31, \"\")","v":""},{"$f":"IF(AND('Rank Wkst'!DG31>1, D35<>\"DQ\"), 'Rank Wkst'!DL31, \"\")","v":""},{"$f":"IF(AND('Rank Wkst'!DG31>1,'Rank Wkst'!C31<>\"DQ\"), 'Rank Wkst'!DP31, \"\")","v":""},{"$f":"IF('Rank Wkst'!AQ31<>0,'Rank Wkst'!DS31,\"\")","v":""}]
[]
["Superior Judge Signature:",null,null,null,null,null,null,"Tabulation Signature:"]

{"sheet":"Teams in Rank Order","index":30,"n_rows":37,"n_cols":37,"rows_kept":37,"cut":false,"hidden":false,"merged":[[27,3,27,4],[16,3,16,4],[17,3,17,4],[18,3,18,4],[19,3,19,4],[20,3,20,4],[21,3,21,4],[10,2,10,4],[11,3,11,4],[12,3,12,4],[13,3,13,4],[14,3,14,4],[15,3,15,4],[4,0,9,0],[34,3,34,4],[36,2,36,4],[36,5,36,13],[36,14,36,18],[22,3,22,4],[23,3,23,4],[24,3,24,4],[25,3,25,4],[26,3,26,4],[36,19,36,26],[28,3,28,4],[29,3,29,4],[30,3,30,4],[31,3,31,4],[32,3,32,4],[33,3,33,4],[7,17,8,18],[7,19,8,20],[7,22,7,23],[7,24,7,25],[8,22,10,22],[8,23,10,23],[6,21,10,21],[6,22,6,25],[8,26,10,26],[9,2,9,4],[9,5,9,6],[9,7,9,8],[9,9,9,10],[9,11,9,12],[9,13,9,14],[9,15,9,16],[9,17,9,18],[9,19,9,20],[6,26,7,26],[7,5,8,6],[7,7,8,8],[7,9,8,10],[7,11,8,12],[7,13,8,14],[7,15,8,16],[8,24,10,24],[8,25,10,25],[6,19,6,20],[3,2,3,26],[4,2,4,26],[6,2,8,4],[6,5,6,6],[6,7,6,8],[6,9,6,10],[6,11,6,12],[6,13,6,14],[6,15,6,16],[6,17,6,18],[1,24,1,26],[1,2,1,3],[1,5,1,7],[1,8,1,18],[1,19,1,20],[1,21,1,23]]}
[]
[null,null,"MEET DATE",null,{"$f":"IF(DATE=0, \"\", DATE)","v":""},"MEET SITE",null,null,{"$f":"IF(Site=0, \"\", Site)","v":""},null,null,null,null,null,null,null,null,null,null,"CLASS",null,{"$f":"IF(Class=0, \"\", Class)","v":""},null,null,{"$f":"CATEGORY","v":"Jazz Category"}]
[]
[null,null,"Minnesota State High School League Dance Team Competition"]
["Un-check Box \"x\" to remove from sheet:",null,"Judges Ranking Sheet - \"A\" RANK SYSTEM (7 or 8 judges)"]
[]
[null,null,"Judges →",null,null,"Judge 1",null,"Judge 2",null,"Judge 3",null,"Judge 4",null,"Judge 5",null,"Judge 6",null,"Judge 7",null,"Judge 8",null,"Add Together the Ranks MINUS\n2 Worst Ranks & 1 Best Rank","TIE BREAKERS",null,null,null,"Final\nPlace"]
[null,null,null,null,null,{"$f":"IF(Judge_1=0, \"\", Judge_1)","v":""},null,{"$f":"IF(Judge_2=0, \"\", Judge_2)","v":""},null,{"$f":"IF(Judge_3=0, \"\", Judge_3)","v":""},null,{"$f":"IF(Judge_4=0, \"\", Judge_4)","v":""},null,{"$f":"IF(Judge_5=0, \"\",Judge_5)","v":""},null,{"$f":"IF(Judge_6=0, \"\", Judge_6)","v":""},null,{"$f":"IF(Judge_7=0, \"\", Judge_7)","v":""},null,{"$f":"IF(Judge_8=0, \"\", Judge_8)","v":""},null,null,"1st Tie Break",null,"2nd Tie Break"]
[null,null,null,null,null,null,null,null,null,null,null,null,null,null,null,null,null,null,null,null,null,null,"Add in 2nd Worst Rank","New Total Rank","Add in Worst & Best Ranks","New Total Rank"]
[null,null,"Judges Initials →",null,null,{"$f":"IF(Judge_I_1=0, \"\", Judge_I_1)","v":""},null,{"$f":"IF(Judge_I_2=0, \"\", Judge_I_2)","v":""},null,{"$f":"IF(Judge_I_3=0, \"\", Judge_I_3)","v":""},null,{"$f":"IF(Judge_I_4=0, \"\", Judge_I_4)","v":""},null,{"$f":"IF(Judge_I_5=0, \"\", Judge_I_5)","v":""},null,{"$f":"IF(Judge_I_6=0, \"\", Judge_I_6)","v":""},null,{"$f":"IF(Judge_I_7=0, \"\", Judge_I_7)","v":""},null,{"$f":"IF(Judge_I_8=0, \"\", Judge_I_8)","v":""}]
[null,null,"School",null,null,"Points","Rank","Points","Rank","Points","Rank","Points","Rank","Points","Rank","Points","Rank","Points","Rank","Points","Rank",null,null,null,null,null,null,null,"Best Rank","2nd Worst Rank","Worst Rank",null,null,null,"Best Rank","2nd Worst Rank","Worst Rank"]
["x",null,1,{"$f":"IF($A12=\"x\", 'Rank Wkst'!EH8,\"\")","v":""},null,{"$f":"IF($A12=\"x\", 'Rank Wkst'!EJ8,\"\")","v":""},{"$f":"IF($A12=\"x\", 'Rank Wkst'!EL8,\"\")","v":""},{"$f":"IF($A12=\"x\", 'Rank Wkst'!EN8,\"\")","v":""},{"$f":"IF($A12=\"x\", 'Rank Wkst'!EP8,\"\")","v":""},{"$f":"IF($A12=\"x\", 'Rank Wkst'!ER8,\"\")","v":""},{"$f":"IF($A12=\"x\", 'Rank Wkst'!ET8,\"\")","v":""},{"$f":"IF($A12=\"x\", 'Rank Wkst'!EV8,\"\")","v":""},{"$f":"IF($A12=\"x\", 'Rank Wkst'!EX8,\"\")","v":""},{"$f":"IF($A12=\"x\", 'Rank Wkst'!EZ8,\"\")","v":""},{"$f":"IF($A12=\"x\", 'Rank Wkst'!FB8,\"\")","v":""},{"$f":"IF($A12=\"x\", 'Rank Wkst'!FD8,\"\")","v":""},{"$f":"IF($A12=\"x\", 'Rank Wkst'!FF8,\"\")","v":""},{"$f":"IF($A12=\"x\", 'Rank Wkst'!FH8,\"\")","v":""},{"$f":"IF($A12=\"x\", 'Rank Wkst'!FJ8,\"\")","v":""},{"$f":"IF($A12=\"x\", 'Rank Wkst'!FL8,\"\")","v":""},{"$f":"IF($A12=\"x\", 'Rank Wkst'!FN8,\"\")","v":""},{"$f":"IF($A12=\"x\", 'Rank Wkst'!FP8,\"\")","v":""},{"$f":"IF(A12=\"x\", IF(AND('Rank Wkst'!FR8>1, F12<>\"DQ\"), 'Rank Wkst'!FU8, \"\"), \"\")","v":""},{"$f":"IF(A12=\"x\", IF(AND('Rank Wkst'!FR8>1, F12<>\"DQ\"),'Rank Wkst'!FW8, \"\"), \"\")","v":""},{"$f":"IF(A12=\"x\", IF(AND('Rank Wkst'!FY8>1, F12<>\"DQ\"), 'Rank Wkst'!GB8, \"\"),  \"\")","v":""},{"$f":"IF(A12=\"x\", IF(AND('Rank Wkst'!FY8>1,F12<>\"DQ\"), 'Rank Wkst'!GD8, \"\"), \"\")","v":""},{"$f":"IF(A12=\"x\", 'Rank Wkst'!EG8, \"\")","v":""},null,{"$f":"IF(A12=\"x\", 'Rank Wkst'!GH8, \"\")","v":0},{"$f":"IF(A12=\"x\", 'Rank Wkst'!GK8, \"\")","v":0},{"$f":"IF(A12=\"x\", 'Rank Wkst'!GN8,\"\")","v":0},null,null,null,{"$f":"'Rank Wkst'!GH8","v":0},{"$f":"'Rank Wkst'!GK8","v":0},{"$f":"'Rank Wkst'!GN8","v":0}]
["x",null,2,{"$f":"IF(A13=\"x\", 'Rank Wkst'!EH9,\"\")","v":""},null,{"$f":"IF($A13=\"x\", 'Rank Wkst'!EJ9,\"\")","v":""},{"$f":"IF($A13=\"x\", 'Rank Wkst'!EL9,\"\")","v":""},{"$f":"IF($A13=\"x\", 'Rank Wkst'!EN9,\"\")","v":""},{"$f":"IF($A13=\"x\", 'Rank Wkst'!EP9,\"\")","v":""},{"$f":"IF($A13=\"x\", 'Rank Wkst'!ER9,\"\")","v":""},{"$f":"IF($A13=\"x\", 'Rank Wkst'!ET9,\"\")","v":""},{"$f":"IF($A13=\"x\", 'Rank Wkst'!EV9,\"\")","v":""},{"$f":"IF($A13=\"x\", 'Rank Wkst'!EX9,\"\")","v":""},{"$f":"IF($A13=\"x\", 'Rank Wkst'!EZ9,\"\")","v":""},{"$f":"IF($A13=\"x\", 'Rank Wkst'!FB9,\"\")","v":""},{"$f":"IF($A13=\"x\", 'Rank Wkst'!FD9,\"\")","v":""},{"$f":"IF($A13=\"x\", 'Rank Wkst'!FF9,\"\")","v":""},{"$f":"IF($A13=\"x\", 'Rank Wkst'!FH9,\"\")","v":""},{"$f":"IF($A13=\"x\", 'Rank Wkst'!FJ9,\"\")","v":""},{"$f":"IF($A13=\"x\", 'Rank Wkst'!FL9,\"\")","v":""},{"$f":"IF($A13=\"x\", 'Rank Wkst'!FN9,\"\")","v":""},{"$f":"IF($A13=\"x\", 'Rank Wkst'!FP9,\"\")","v":""},{"$f":"IF(A13=\"x\", IF(AND('Rank Wkst'!FR9>1, F13<>\"DQ\"), 'Rank Wkst'!FU9, \"\"), \"\")","v":""},{"$f":"IF(A13=\"x\", IF(AND('Rank Wkst'!FR9>1, F13<>\"DQ\"),'Rank Wkst'!FW9, \"\"), \"\")","v":""},{"$f":"IF(A13=\"x\", IF(AND('Rank Wkst'!FY9>1, F13<>\"DQ\"), 'Rank Wkst'!GB9, \"\"),  \"\")","v":""},{"$f":"IF(A13=\"x\", IF(AND('Rank Wkst'!FY9>1,F13<>\"DQ\"), 'Rank Wkst'!GD9, \"\"), \"\")","v":""},{"$f":"IF(A13=\"x\", 'Rank Wkst'!EG9, \"\")","v":""},null,{"$f":"IF(A13=\"x\", 'Rank Wkst'!GH9, \"\")","v":0},{"$f":"IF(A13=\"x\", 'Rank Wkst'!GK9, \"\")","v":0},{"$f":"IF(A13=\"x\", 'Rank Wkst'!GN9,\"\")","v":0},null,null,null,{"$f":"'Rank Wkst'!GH9","v":0},{"$f":"'Rank Wkst'!GK9","v":0},{"$f":"'Rank Wkst'!GN9","v":0}]
["x",null,3,{"$f":"IF(A14=\"x\", 'Rank Wkst'!EH10,\"\")","v":""},null,{"$f":"IF($A14=\"x\", 'Rank Wkst'!EJ10,\"\")","v":""},{"$f":"IF($A14=\"x\", 'Rank Wkst'!EL10,\"\")","v":""},{"$f":"IF($A14=\"x\", 'Rank Wkst'!EN10,\"\")","v":""},{"$f":"IF($A14=\"x\", 'Rank Wkst'!EP10,\"\")","v":""},{"$f":"IF($A14=\"x\", 'Rank Wkst'!ER10,\"\")","v":""},{"$f":"IF($A14=\"x\", 'Rank Wkst'!ET10,\"\")","v":""},{"$f":"IF($A14=\"x\", 'Rank Wkst'!EV10,\"\")","v":""},{"$f":"IF($A14=\"x\", 'Rank Wkst'!EX10,\"\")","v":""},{"$f":"IF($A14=\"x\", 'Rank Wkst'!EZ10,\"\")","v":""},{"$f":"IF($A14=\"x\", 'Rank Wkst'!FB10,\"\")","v":""},{"$f":"IF($A14=\"x\", 'Rank Wkst'!FD10,\"\")","v":""},{"$f":"IF($A14=\"x\", 'Rank Wkst'!FF10,\"\")","v":""},{"$f":"IF($A14=\"x\", 'Rank Wkst'!FH10,\"\")","v":""},{"$f":"IF($A14=\"x\", 'Rank Wkst'!FJ10,\"\")","v":""},{"$f":"IF($A14=\"x\", 'Rank Wkst'!FL10,\"\")","v":""},{"$f":"IF($A14=\"x\", 'Rank Wkst'!FN10,\"\")","v":""},{"$f":"IF($A14=\"x\", 'Rank Wkst'!FP10,\"\")","v":""},{"$f":"IF(A14=\"x\", IF(AND('Rank Wkst'!FR10>1, F14<>\"DQ\"), 'Rank Wkst'!FU10, \"\"), \"\")","v":""},{"$f":"IF(A14=\"x\", IF(AND('Rank Wkst'!FR10>1, F14<>\"DQ\"),'Rank Wkst'!FW10, \"\"), \"\")","v":""},{"$f":"IF(A14=\"x\", IF(AND('Rank Wkst'!FY10>1, F14<>\"DQ\"), 'Rank Wkst'!GB10, \"\"),  \"\")","v":""},{"$f":"IF(A14=\"x\", IF(AND('Rank Wkst'!FY10>1,F14<>\"DQ\"), 'Rank Wkst'!GD10, \"\"), \"\")","v":""},{"$f":"IF(A14=\"x\", 'Rank Wkst'!EG10, \"\")","v":""},null,{"$f":"IF(A14=\"x\", 'Rank Wkst'!GH10, \"\")","v":0},{"$f":"IF(A14=\"x\", 'Rank Wkst'!GK10, \"\")","v":0},{"$f":"IF(A14=\"x\", 'Rank Wkst'!GN10,\"\")","v":0},null,null,null,{"$f":"'Rank Wkst'!GH10","v":0},{"$f":"'Rank Wkst'!GK10","v":0},{"$f":"'Rank Wkst'!GN10","v":0}]
["x",null,4,{"$f":"IF(A15=\"x\", 'Rank Wkst'!EH11,\"\")","v":""},null,{"$f":"IF($A15=\"x\", 'Rank Wkst'!EJ11,\"\")","v":""},{"$f":"IF($A15=\"x\", 'Rank Wkst'!EL11,\"\")","v":""},{"$f":"IF($A15=\"x\", 'Rank Wkst'!EN11,\"\")","v":""},{"$f":"IF($A15=\"x\", 'Rank Wkst'!EP11,\"\")","v":""},{"$f":"IF($A15=\"x\", 'Rank Wkst'!ER11,\"\")","v":""},{"$f":"IF($A15=\"x\", 'Rank Wkst'!ET11,\"\")","v":""},{"$f":"IF($A15=\"x\", 'Rank Wkst'!EV11,\"\")","v":""},{"$f":"IF($A15=\"x\", 'Rank Wkst'!EX11,\"\")","v":""},{"$f":"IF($A15=\"x\", 'Rank Wkst'!EZ11,\"\")","v":""},{"$f":"IF($A15=\"x\", 'Rank Wkst'!FB11,\"\")","v":""},{"$f":"IF($A15=\"x\", 'Rank Wkst'!FD11,\"\")","v":""},{"$f":"IF($A15=\"x\", 'Rank Wkst'!FF11,\"\")","v":""},{"$f":"IF($A15=\"x\", 'Rank Wkst'!FH11,\"\")","v":""},{"$f":"IF($A15=\"x\", 'Rank Wkst'!FJ11,\"\")","v":""},{"$f":"IF($A15=\"x\", 'Rank Wkst'!FL11,\"\")","v":""},{"$f":"IF($A15=\"x\", 'Rank Wkst'!FN11,\"\")","v":""},{"$f":"IF($A15=\"x\", 'Rank Wkst'!FP11,\"\")","v":""},{"$f":"IF(A15=\"x\", IF(AND('Rank Wkst'!FR11>1, F15<>\"DQ\"), 'Rank Wkst'!FU11, \"\"), \"\")","v":""},{"$f":"IF(A15=\"x\", IF(AND('Rank Wkst'!FR11>1, F15<>\"DQ\"),'Rank Wkst'!FW11, \"\"), \"\")","v":""},{"$f":"IF(A15=\"x\", IF(AND('Rank Wkst'!FY11>1, F15<>\"DQ\"), 'Rank Wkst'!GB11, \"\"),  \"\")","v":""},{"$f":"IF(A15=\"x\", IF(AND('Rank Wkst'!FY11>1,F15<>\"DQ\"), 'Rank Wkst'!GD11, \"\"), \"\")","v":""},{"$f":"IF(A15=\"x\", 'Rank Wkst'!EG11, \"\")","v":""},null,{"$f":"IF(A15=\"x\", 'Rank Wkst'!GH11, \"\")","v":0},{"$f":"IF(A15=\"x\", 'Rank Wkst'!GK11, \"\")","v":0},{"$f":"IF(A15=\"x\", 'Rank Wkst'!GN11,\"\")","v":0},null,null,null,{"$f":"'Rank Wkst'!GH11","v":0},{"$f":"'Rank Wkst'!GK11","v":0},{"$f":"'Rank Wkst'!GN11","v":0}]
["x",null,5,{"$f":"IF(A16=\"x\", 'Rank Wkst'!EH12,\"\")","v":""},null,{"$f":"IF($A16=\"x\", 'Rank Wkst'!EJ12,\"\")","v":""},{"$f":"IF($A16=\"x\", 'Rank Wkst'!EL12,\"\")","v":""},{"$f":"IF($A16=\"x\", 'Rank Wkst'!EN12,\"\")","v":""},{"$f":"IF($A16=\"x\", 'Rank Wkst'!EP12,\"\")","v":""},{"$f":"IF($A16=\"x\", 'Rank Wkst'!ER12,\"\")","v":""},{"$f":"IF($A16=\"x\", 'Rank Wkst'!ET12,\"\")","v":""},{"$f":"IF($A16=\"x\", 'Rank Wkst'!EV12,\"\")","v":""},{"$f":"IF($A16=\"x\", 'Rank Wkst'!EX12,\"\")","v":""},{"$f":"IF($A16=\"x\", 'Rank Wkst'!EZ12,\"\")","v":""},{"$f":"IF($A16=\"x\", 'Rank Wkst'!FB12,\"\")","v":""},{"$f":"IF($A16=\"x\", 'Rank Wkst'!FD12,\"\")","v":""},{"$f":"IF($A16=\"x\", 'Rank Wkst'!FF12,\"\")","v":""},{"$f":"IF($A16=\"x\", 'Rank Wkst'!FH12,\"\")","v":""},{"$f":"IF($A16=\"x\", 'Rank Wkst'!FJ12,\"\")","v":""},{"$f":"IF($A16=\"x\", 'Rank Wkst'!FL12,\"\")","v":""},{"$f":"IF($A16=\"x\", 'Rank Wkst'!FN12,\"\")","v":""},{"$f":"IF($A16=\"x\", 'Rank Wkst'!FP12,\"\")","v":""},{"$f":"IF(A16=\"x\", IF(AND('Rank Wkst'!FR12>1, F16<>\"DQ\"), 'Rank Wkst'!FU12, \"\"), \"\")","v":""},{"$f":"IF(A16=\"x\", IF(AND('Rank Wkst'!FR12>1, F16<>\"DQ\"),'Rank Wkst'!FW12, \"\"), \"\")","v":""},{"$f":"IF(A16=\"x\", IF(AND('Rank Wkst'!FY12>1, F16<>\"DQ\"), 'Rank Wkst'!GB12, \"\"),  \"\")","v":""},{"$f":"IF(A16=\"x\", IF(AND('Rank Wkst'!FY12>1,F16<>\"DQ\"), 'Rank Wkst'!GD12, \"\"), \"\")","v":""},{"$f":"IF(A16=\"x\", 'Rank Wkst'!EG12, \"\")","v":""},null,{"$f":"IF(A16=\"x\", 'Rank Wkst'!GH12, \"\")","v":0},{"$f":"IF(A16=\"x\", 'Rank Wkst'!GK12, \"\")","v":0},{"$f":"IF(A16=\"x\", 'Rank Wkst'!GN12,\"\")","v":0},null,null,null,{"$f":"'Rank Wkst'!GH12","v":0},{"$f":"'Rank Wkst'!GK12","v":0},{"$f":"'Rank Wkst'!GN12","v":0}]
["x",null,6,{"$f":"IF(A17=\"x\", 'Rank Wkst'!EH13,\"\")","v":""},null,{"$f":"IF($A17=\"x\", 'Rank Wkst'!EJ13,\"\")","v":""},{"$f":"IF($A17=\"x\", 'Rank Wkst'!EL13,\"\")","v":""},{"$f":"IF($A17=\"x\", 'Rank Wkst'!EN13,\"\")","v":""},{"$f":"IF($A17=\"x\", 'Rank Wkst'!EP13,\"\")","v":""},{"$f":"IF($A17=\"x\", 'Rank Wkst'!ER13,\"\")","v":""},{"$f":"IF($A17=\"x\", 'Rank Wkst'!ET13,\"\")","v":""},{"$f":"IF($A17=\"x\", 'Rank Wkst'!EV13,\"\")","v":""},{"$f":"IF($A17=\"x\", 'Rank Wkst'!EX13,\"\")","v":""},{"$f":"IF($A17=\"x\", 'Rank Wkst'!EZ13,\"\")","v":""},{"$f":"IF($A17=\"x\", 'Rank Wkst'!FB13,\"\")","v":""},{"$f":"IF($A17=\"x\", 'Rank Wkst'!FD13,\"\")","v":""},{"$f":"IF($A17=\"x\", 'Rank Wkst'!FF13,\"\")","v":""},{"$f":"IF($A17=\"x\", 'Rank Wkst'!FH13,\"\")","v":""},{"$f":"IF($A17=\"x\", 'Rank Wkst'!FJ13,\"\")","v":""},{"$f":"IF($A17=\"x\", 'Rank Wkst'!FL13,\"\")","v":""},{"$f":"IF($A17=\"x\", 'Rank Wkst'!FN13,\"\")","v":""},{"$f":"IF($A17=\"x\", 'Rank Wkst'!FP13,\"\")","v":""},{"$f":"IF(A17=\"x\", IF(AND('Rank Wkst'!FR13>1, F17<>\"DQ\"), 'Rank Wkst'!FU13, \"\"), \"\")","v":""},{"$f":"IF(A17=\"x\", IF(AND('Rank Wkst'!FR13>1, F17<>\"DQ\"),'Rank Wkst'!FW13, \"\"), \"\")","v":""},{"$f":"IF(A17=\"x\", IF(AND('Rank Wkst'!FY13>1, F17<>\"DQ\"), 'Rank Wkst'!GB13, \"\"),  \"\")","v":""},{"$f":"IF(A17=\"x\", IF(AND('Rank Wkst'!FY13>1,F17<>\"DQ\"), 'Rank Wkst'!GD13, \"\"), \"\")","v":""},{"$f":"IF(A17=\"x\", 'Rank Wkst'!EG13, \"\")","v":""},null,{"$f":"IF(A17=\"x\", 'Rank Wkst'!GH13, \"\")","v":0},{"$f":"IF(A17=\"x\", 'Rank Wkst'!GK13, \"\")","v":0},{"$f":"IF(A17=\"x\", 'Rank Wkst'!GN13,\"\")","v":0},null,null,null,{"$f":"'Rank Wkst'!GH13","v":0},{"$f":"'Rank Wkst'!GK13","v":0},{"$f":"'Rank Wkst'!GN13","v":0}]
["x",null,7,{"$f":"IF(A18=\"x\", 'Rank Wkst'!EH14,\"\")","v":""},null,{"$f":"IF($A18=\"x\", 'Rank Wkst'!EJ14,\"\")","v":""},{"$f":"IF($A18=\"x\", 'Rank Wkst'!EL14,\"\")","v":""},{"$f":"IF($A18=\"x\", 'Rank Wkst'!EN14,\"\")","v":""},{"$f":"IF($A18=\"x\", 'Rank Wkst'!EP14,\"\")","v":""},{"$f":"IF($A18=\"x\", 'Rank Wkst'!ER14,\"\")","v":""},{"$f":"IF($A18=\"x\", 'Rank Wkst'!ET14,\"\")","v":""},{"$f":"IF($A18=\"x\", 'Rank Wkst'!EV14,\"\")","v":""},{"$f":"IF($A18=\"x\", 'Rank Wkst'!EX14,\"\")","v":""},{"$f":"IF($A18=\"x\", 'Rank Wkst'!EZ14,\"\")","v":""},{"$f":"IF($A18=\"x\", 'Rank Wkst'!FB14,\"\")","v":""},{"$f":"IF($A18=\"x\", 'Rank Wkst'!FD14,\"\")","v":""},{"$f":"IF($A18=\"x\", 'Rank Wkst'!FF14,\"\")","v":""},{"$f":"IF($A18=\"x\", 'Rank Wkst'!FH14,\"\")","v":""},{"$f":"IF($A18=\"x\", 'Rank Wkst'!FJ14,\"\")","v":""},{"$f":"IF($A18=\"x\", 'Rank Wkst'!FL14,\"\")","v":""},{"$f":"IF($A18=\"x\", 'Rank Wkst'!FN14,\"\")","v":""},{"$f":"IF($A18=\"x\", 'Rank Wkst'!FP14,\"\")","v":""},{"$f":"IF(A18=\"x\", IF(AND('Rank Wkst'!FR14>1, F18<>\"DQ\"), 'Rank Wkst'!FU14, \"\"), \"\")","v":""},{"$f":"IF(A18=\"x\", IF(AND('Rank Wkst'!FR14>1, F18<>\"DQ\"),'Rank Wkst'!FW14, \"\"), \"\")","v":""},{"$f":"IF(A18=\"x\", IF(AND('Rank Wkst'!FY14>1, F18<>\"DQ\"), 'Rank Wkst'!GB14, \"\"),  \"\")","v":""},{"$f":"IF(A18=\"x\", IF(AND('Rank Wkst'!FY14>1,F18<>\"DQ\"), 'Rank Wkst'!GD14, \"\"), \"\")","v":""},{"$f":"IF(A18=\"x\", 'Rank Wkst'!EG14, \"\")","v":""},null,{"$f":"IF(A18=\"x\", 'Rank Wkst'!GH14, \"\")","v":0},{"$f":"IF(A18=\"x\", 'Rank Wkst'!GK14, \"\")","v":0},{"$f":"IF(A18=\"x\", 'Rank Wkst'!GN14,\"\")","v":0},null,null,null,{"$f":"'Rank Wkst'!GH14","v":0},{"$f":"'Rank Wkst'!GK14","v":0},{"$f":"'Rank Wkst'!GN14","v":0}]
["x",null,8,{"$f":"IF(A19=\"x\", 'Rank Wkst'!EH15,\"\")","v":""},null,{"$f":"IF($A19=\"x\", 'Rank Wkst'!EJ15,\"\")","v":""},{"$f":"IF($A19=\"x\", 'Rank Wkst'!EL15,\"\")","v":""},{"$f":"IF($A19=\"x\", 'Rank Wkst'!EN15,\"\")","v":""},{"$f":"IF($A19=\"x\", 'Rank Wkst'!EP15,\"\")","v":""},{"$f":"IF($A19=\"x\", 'Rank Wkst'!ER15,\"\")","v":""},{"$f":"IF($A19=\"x\", 'Rank Wkst'!ET15,\"\")","v":""},{"$f":"IF($A19=\"x\", 'Rank Wkst'!EV15,\"\")","v":""},{"$f":"IF($A19=\"x\", 'Rank Wkst'!EX15,\"\")","v":""},{"$f":"IF($A19=\"x\", 'Rank Wkst'!EZ15,\"\")","v":""},{"$f":"IF($A19=\"x\", 'Rank Wkst'!FB15,\"\")","v":""},{"$f":"IF($A19=\"x\", 'Rank Wkst'!FD15,\"\")","v":""},{"$f":"IF($A19=\"x\", 'Rank Wkst'!FF15,\"\")","v":""},{"$f":"IF($A19=\"x\", 'Rank Wkst'!FH15,\"\")","v":""},{"$f":"IF($A19=\"x\", 'Rank Wkst'!FJ15,\"\")","v":""},{"$f":"IF($A19=\"x\", 'Rank Wkst'!FL15,\"\")","v":""},{"$f":"IF($A19=\"x\", 'Rank Wkst'!FN15,\"\")","v":""},{"$f":"IF($A19=\"x\", 'Rank Wkst'!FP15,\"\")","v":""},{"$f":"IF(A19=\"x\", IF(AND('Rank Wkst'!FR15>1, F19<>\"DQ\"), 'Rank Wkst'!FU15, \"\"), \"\")","v":""},{"$f":"IF(A19=\"x\", IF(AND('Rank Wkst'!FR15>1, F19<>\"DQ\"),'Rank Wkst'!FW15, \"\"), \"\")","v":""},{"$f":"IF(A19=\"x\", IF(AND('Rank Wkst'!FY15>1, F19<>\"DQ\"), 'Rank Wkst'!GB15, \"\"),  \"\")","v":""},{"$f":"IF(A19=\"x\", IF(AND('Rank Wkst'!FY15>1,F19<>\"DQ\"), 'Rank Wkst'!GD15, \"\"), \"\")","v":""},{"$f":"IF(A19=\"x\", 'Rank Wkst'!EG15, \"\")","v":""},null,{"$f":"IF(A19=\"x\", 'Rank Wkst'!GH15, \"\")","v":0},{"$f":"IF(A19=\"x\", 'Rank Wkst'!GK15, \"\")","v":0},{"$f":"IF(A19=\"x\", 'Rank Wkst'!GN15,\"\")","v":0},null,null,null,{"$f":"'Rank Wkst'!GH15","v":0},{"$f":"'Rank Wkst'!GK15","v":0},{"$f":"'Rank Wkst'!GN15","v":0}]
["x",null,9,{"$f":"IF(A20=\"x\", 'Rank Wkst'!EH16,\"\")","v":""},null,{"$f":"IF($A20=\"x\", 'Rank Wkst'!EJ16,\"\")","v":""},{"$f":"IF($A20=\"x\", 'Rank Wkst'!EL16,\"\")","v":""},{"$f":"IF($A20=\"x\", 'Rank Wkst'!EN16,\"\")","v":""},{"$f":"IF($A20=\"x\", 'Rank Wkst'!EP16,\"\")","v":""},{"$f":"IF($A20=\"x\", 'Rank Wkst'!ER16,\"\")","v":""},{"$f":"IF($A20=\"x\", 'Rank Wkst'!ET16,\"\")","v":""},{"$f":"IF($A20=\"x\", 'Rank Wkst'!EV16,\"\")","v":""},{"$f":"IF($A20=\"x\", 'Rank Wkst'!EX16,\"\")","v":""},{"$f":"IF($A20=\"x\", 'Rank Wkst'!EZ16,\"\")","v":""},{"$f":"IF($A20=\"x\", 'Rank Wkst'!FB16,\"\")","v":""},{"$f":"IF($A20=\"x\", 'Rank Wkst'!FD16,\"\")","v":""},{"$f":"IF($A20=\"x\", 'Rank Wkst'!FF16,\"\")","v":""},{"$f":"IF($A20=\"x\", 'Rank Wkst'!FH16,\"\")","v":""},{"$f":"IF($A20=\"x\", 'Rank Wkst'!FJ16,\"\")","v":""},{"$f":"IF($A20=\"x\", 'Rank Wkst'!FL16,\"\")","v":""},{"$f":"IF($A20=\"x\", 'Rank Wkst'!FN16,\"\")","v":""},{"$f":"IF($A20=\"x\", 'Rank Wkst'!FP16,\"\")","v":""},{"$f":"IF(A20=\"x\", IF(AND('Rank Wkst'!FR16>1, F20<>\"DQ\"), 'Rank Wkst'!FU16, \"\"), \"\")","v":""},{"$f":"IF(A20=\"x\", IF(AND('Rank Wkst'!FR16>1, F20<>\"DQ\"),'Rank Wkst'!FW16, \"\"), \"\")","v":""},{"$f":"IF(A20=\"x\", IF(AND('Rank Wkst'!FY16>1, F20<>\"DQ\"), 'Rank Wkst'!GB16, \"\"),  \"\")","v":""},{"$f":"IF(A20=\"x\", IF(AND('Rank Wkst'!FY16>1,F20<>\"DQ\"), 'Rank Wkst'!GD16, \"\"), \"\")","v":""},{"$f":"IF(A20=\"x\", 'Rank Wkst'!EG16, \"\")","v":""},null,{"$f":"IF(A20=\"x\", 'Rank Wkst'!GH16, \"\")","v":0},{"$f":"IF(A20=\"x\", 'Rank Wkst'!GK16, \"\")","v":0},{"$f":"IF(A20=\"x\", 'Rank Wkst'!GN16,\"\")","v":0},null,null,null,{"$f":"'Rank Wkst'!GH16","v":0},{"$f":"'Rank Wkst'!GK16","v":0},{"$f":"'Rank Wkst'!GN16","v":0}]
["x",null,10,{"$f":"IF(A21=\"x\", 'Rank Wkst'!EH17,\"\")","v":""},null,{"$f":"IF($A21=\"x\", 'Rank Wkst'!EJ17,\"\")","v":""},{"$f":"IF($A21=\"x\", 'Rank Wkst'!EL17,\"\")","v":""},{"$f":"IF($A21=\"x\", 'Rank Wkst'!EN17,\"\")","v":""},{"$f":"IF($A21=\"x\", 'Rank Wkst'!EP17,\"\")","v":""},{"$f":"IF($A21=\"x\", 'Rank Wkst'!ER17,\"\")","v":""},{"$f":"IF($A21=\"x\", 'Rank Wkst'!ET17,\"\")","v":""},{"$f":"IF($A21=\"x\", 'Rank Wkst'!EV17,\"\")","v":""},{"$f":"IF($A21=\"x\", 'Rank Wkst'!EX17,\"\")","v":""},{"$f":"IF($A21=\"x\", 'Rank Wkst'!EZ17,\"\")","v":""},{"$f":"IF($A21=\"x\", 'Rank Wkst'!FB17,\"\")","v":""},{"$f":"IF($A21=\"x\", 'Rank Wkst'!FD17,\"\")","v":""},{"$f":"IF($A21=\"x\", 'Rank Wkst'!FF17,\"\")","v":""},{"$f":"IF($A21=\"x\", 'Rank Wkst'!FH17,\"\")","v":""},{"$f":"IF($A21=\"x\", 'Rank Wkst'!FJ17,\"\")","v":""},{"$f":"IF($A21=\"x\", 'Rank Wkst'!FL17,\"\")","v":""},{"$f":"IF($A21=\"x\", 'Rank Wkst'!FN17,\"\")","v":""},{"$f":"IF($A21=\"x\", 'Rank Wkst'!FP17,\"\")","v":""},{"$f":"IF(A21=\"x\", IF(AND('Rank Wkst'!FR17>1, F21<>\"DQ\"), 'Rank Wkst'!FU17, \"\"), \"\")","v":""},{"$f":"IF(A21=\"x\", IF(AND('Rank Wkst'!FR17>1, F21<>\"DQ\"),'Rank Wkst'!FW17, \"\"), \"\")","v":""},{"$f":"IF(A21=\"x\", IF(AND('Rank Wkst'!FY17>1, F21<>\"DQ\"), 'Rank Wkst'!GB17, \"\"),  \"\")","v":""},{"$f":"IF(A21=\"x\", IF(AND('Rank Wkst'!FY17>1,F21<>\"DQ\"), 'Rank Wkst'!GD17, \"\"), \"\")","v":""},{"$f":"IF(A21=\"x\", 'Rank Wkst'!EG17, \"\")","v":""},null,{"$f":"IF(A21=\"x\", 'Rank Wkst'!GH17, \"\")","v":0},{"$f":"IF(A21=\"x\", 'Rank Wkst'!GK17, \"\")","v":0},{"$f":"IF(A21=\"x\", 'Rank Wkst'!GN17,\"\")","v":0},null,null,null,{"$f":"'Rank Wkst'!GH17","v":0},{"$f":"'Rank Wkst'!GK17","v":0},{"$f":"'Rank Wkst'!GN17","v":0}]
["x",null,11,{"$f":"IF(A22=\"x\", 'Rank Wkst'!EH18,\"\")","v":""},null,{"$f":"IF($A22=\"x\", 'Rank Wkst'!EJ18,\"\")","v":""},{"$f":"IF($A22=\"x\", 'Rank Wkst'!EL18,\"\")","v":""},{"$f":"IF($A22=\"x\", 'Rank Wkst'!EN18,\"\")","v":""},{"$f":"IF($A22=\"x\", 'Rank Wkst'!EP18,\"\")","v":""},{"$f":"IF($A22=\"x\", 'Rank Wkst'!ER18,\"\")","v":""},{"$f":"IF($A22=\"x\", 'Rank Wkst'!ET18,\"\")","v":""},{"$f":"IF($A22=\"x\", 'Rank Wkst'!EV18,\"\")","v":""},{"$f":"IF($A22=\"x\", 'Rank Wkst'!EX18,\"\")","v":""},{"$f":"IF($A22=\"x\", 'Rank Wkst'!EZ18,\"\")","v":""},{"$f":"IF($A22=\"x\", 'Rank Wkst'!FB18,\"\")","v":""},{"$f":"IF($A22=\"x\", 'Rank Wkst'!FD18,\"\")","v":""},{"$f":"IF($A22=\"x\", 'Rank Wkst'!FF18,\"\")","v":""},{"$f":"IF($A22=\"x\", 'Rank Wkst'!FH18,\"\")","v":""},{"$f":"IF($A22=\"x\", 'Rank Wkst'!FJ18,\"\")","v":""},{"$f":"IF($A22=\"x\", 'Rank Wkst'!FL18,\"\")","v":""},{"$f":"IF($A22=\"x\", 'Rank Wkst'!FN18,\"\")","v":""},{"$f":"IF($A22=\"x\", 'Rank Wkst'!FP18,\"\")","v":""},{"$f":"IF(A22=\"x\", IF(AND('Rank Wkst'!FR18>1, F22<>\"DQ\"), 'Rank Wkst'!FU18, \"\"), \"\")","v":""},{"$f":"IF(A22=\"x\", IF(AND('Rank Wkst'!FR18>1, F22<>\"DQ\"),'Rank Wkst'!FW18, \"\"), \"\")","v":""},{"$f":"IF(A22=\"x\", IF(AND('Rank Wkst'!FY18>1, F22<>\"DQ\"), 'Rank Wkst'!GB18, \"\"),  \"\")","v":""},{"$f":"IF(A22=\"x\", IF(AND('Rank Wkst'!FY18>1,F22<>\"DQ\"), 'Rank Wkst'!GD18, \"\"), \"\")","v":""},{"$f":"IF(A22=\"x\", 'Rank Wkst'!EG18, \"\")","v":""},null,{"$f":"IF(A22=\"x\", 'Rank Wkst'!GH18, \"\")","v":0},{"$f":"IF(A22=\"x\", 'Rank Wkst'!GK18, \"\")","v":0},{"$f":"IF(A22=\"x\", 'Rank Wkst'!GN18,\"\")","v":0},null,null,null,{"$f":"'Rank Wkst'!GH18","v":0},{"$f":"'Rank Wkst'!GK18","v":0},{"$f":"'Rank Wkst'!GN18","v":0}]
["x",null,12,{"$f":"IF(A23=\"x\", 'Rank Wkst'!EH19,\"\")","v":""},null,{"$f":"IF($A23=\"x\", 'Rank Wkst'!EJ19,\"\")","v":""},{"$f":"IF($A23=\"x\", 'Rank Wkst'!EL19,\"\")","v":""},{"$f":"IF($A23=\"x\", 'Rank Wkst'!EN19,\"\")","v":""},{"$f":"IF($A23=\"x\", 'Rank Wkst'!EP19,\"\")","v":""},{"$f":"IF($A23=\"x\", 'Rank Wkst'!ER19,\"\")","v":""},{"$f":"IF($A23=\"x\", 'Rank Wkst'!ET19,\"\")","v":""},{"$f":"IF($A23=\"x\", 'Rank Wkst'!EV19,\"\")","v":""},{"$f":"IF($A23=\"x\", 'Rank Wkst'!EX19,\"\")","v":""},{"$f":"IF($A23=\"x\", 'Rank Wkst'!EZ19,\"\")","v":""},{"$f":"IF($A23=\"x\", 'Rank Wkst'!FB19,\"\")","v":""},{"$f":"IF($A23=\"x\", 'Rank Wkst'!FD19,\"\")","v":""},{"$f":"IF($A23=\"x\", 'Rank Wkst'!FF19,\"\")","v":""},{"$f":"IF($A23=\"x\", 'Rank Wkst'!FH19,\"\")","v":""},{"$f":"IF($A23=\"x\", 'Rank Wkst'!FJ19,\"\")","v":""},{"$f":"IF($A23=\"x\", 'Rank Wkst'!FL19,\"\")","v":""},{"$f":"IF($A23=\"x\", 'Rank Wkst'!FN19,\"\")","v":""},{"$f":"IF($A23=\"x\", 'Rank Wkst'!FP19,\"\")","v":""},{"$f":"IF(A23=\"x\", IF(AND('Rank Wkst'!FR19>1, F23<>\"DQ\"), 'Rank Wkst'!FU19, \"\"), \"\")","v":""},{"$f":"IF(A23=\"x\", IF(AND('Rank Wkst'!FR19>1, F23<>\"DQ\"),'Rank Wkst'!FW19, \"\"), \"\")","v":""},{"$f":"IF(A23=\"x\", IF(AND('Rank Wkst'!FY19>1, F23<>\"DQ\"), 'Rank Wkst'!GB19, \"\"),  \"\")","v":""},{"$f":"IF(A23=\"x\", IF(AND('Rank Wkst'!FY19>1,F23<>\"DQ\"), 'Rank Wkst'!GD19, \"\"), \"\")","v":""},{"$f":"IF(A23=\"x\", 'Rank Wkst'!EG19, \"\")","v":""},null,{"$f":"IF(A23=\"x\", 'Rank Wkst'!GH19, \"\")","v":0},{"$f":"IF(A23=\"x\", 'Rank Wkst'!GK19, \"\")","v":0},{"$f":"IF(A23=\"x\", 'Rank Wkst'!GN19,\"\")","v":0},null,null,null,{"$f":"'Rank Wkst'!GH19","v":0},{"$f":"'Rank Wkst'!GK19","v":0},{"$f":"'Rank Wkst'!GN19","v":0}]
["x",null,13,{"$f":"IF(A24=\"x\", 'Rank Wkst'!EH20,\"\")","v":""},null,{"$f":"IF($A24=\"x\", 'Rank Wkst'!EJ20,\"\")","v":""},{"$f":"IF($A24=\"x\", 'Rank Wkst'!EL20,\"\")","v":""},{"$f":"IF($A24=\"x\", 'Rank Wkst'!EN20,\"\")","v":""},{"$f":"IF($A24=\"x\", 'Rank Wkst'!EP20,\"\")","v":""},{"$f":"IF($A24=\"x\", 'Rank Wkst'!ER20,\"\")","v":""},{"$f":"IF($A24=\"x\", 'Rank Wkst'!ET20,\"\")","v":""},{"$f":"IF($A24=\"x\", 'Rank Wkst'!EV20,\"\")","v":""},{"$f":"IF($A24=\"x\", 'Rank Wkst'!EX20,\"\")","v":""},{"$f":"IF($A24=\"x\", 'Rank Wkst'!EZ20,\"\")","v":""},{"$f":"IF($A24=\"x\", 'Rank Wkst'!FB20,\"\")","v":""},{"$f":"IF($A24=\"x\", 'Rank Wkst'!FD20,\"\")","v":""},{"$f":"IF($A24=\"x\", 'Rank Wkst'!FF20,\"\")","v":""},{"$f":"IF($A24=\"x\", 'Rank Wkst'!FH20,\"\")","v":""},{"$f":"IF($A24=\"x\", 'Rank Wkst'!FJ20,\"\")","v":""},{"$f":"IF($A24=\"x\", 'Rank Wkst'!FL20,\"\")","v":""},{"$f":"IF($A24=\"x\", 'Rank Wkst'!FN20,\"\")","v":""},{"$f":"IF($A24=\"x\", 'Rank Wkst'!FP20,\"\")","v":""},{"$f":"IF(A24=\"x\", IF(AND('Rank Wkst'!FR20>1, F24<>\"DQ\"), 'Rank Wkst'!FU20, \"\"), \"\")","v":""},{"$f":"IF(A24=\"x\", IF(AND('Rank Wkst'!FR20>1, F24<>\"DQ\"),'Rank Wkst'!FW20, \"\"), \"\")","v":""},{"$f":"IF(A24=\"x\", IF(AND('Rank Wkst'!FY20>1, F24<>\"DQ\"), 'Rank Wkst'!GB20, \"\"),  \"\")","v":""},{"$f":"IF(A24=\"x\", IF(AND('Rank Wkst'!FY20>1,F24<>\"DQ\"), 'Rank Wkst'!GD20, \"\"), \"\")","v":""},{"$f":"IF(A24=\"x\", 'Rank Wkst'!EG20, \"\")","v":""},null,{"$f":"IF(A24=\"x\", 'Rank Wkst'!GH20, \"\")","v":0},{"$f":"IF(A24=\"x\", 'Rank Wkst'!GK20, \"\")","v":0},{"$f":"IF(A24=\"x\", 'Rank Wkst'!GN20,\"\")","v":0},null,null,null,{"$f":"'Rank Wkst'!GH20","v":0},{"$f":"'Rank Wkst'!GK20","v":0},{"$f":"'Rank Wkst'!GN20","v":0}]
["x",null,14,{"$f":"IF(A25=\"x\", 'Rank Wkst'!EH21,\"\")","v":""},null,{"$f":"IF($A25=\"x\", 'Rank Wkst'!EJ21,\"\")","v":""},{"$f":"IF($A25=\"x\", 'Rank Wkst'!EL21,\"\")","v":""},{"$f":"IF($A25=\"x\", 'Rank Wkst'!EN21,\"\")","v":""},{"$f":"IF($A25=\"x\", 'Rank Wkst'!EP21,\"\")","v":""},{"$f":"IF($A25=\"x\", 'Rank Wkst'!ER21,\"\")","v":""},{"$f":"IF($A25=\"x\", 'Rank Wkst'!ET21,\"\")","v":""},{"$f":"IF($A25=\"x\", 'Rank Wkst'!EV21,\"\")","v":""},{"$f":"IF($A25=\"x\", 'Rank Wkst'!EX21,\"\")","v":""},{"$f":"IF($A25=\"x\", 'Rank Wkst'!EZ21,\"\")","v":""},{"$f":"IF($A25=\"x\", 'Rank Wkst'!FB21,\"\")","v":""},{"$f":"IF($A25=\"x\", 'Rank Wkst'!FD21,\"\")","v":""},{"$f":"IF($A25=\"x\", 'Rank Wkst'!FF21,\"\")","v":""},{"$f":"IF($A25=\"x\", 'Rank Wkst'!FH21,\"\")","v":""},{"$f":"IF($A25=\"x\", 'Rank Wkst'!FJ21,\"\")","v":""},{"$f":"IF($A25=\"x\", 'Rank Wkst'!FL21,\"\")","v":""},{"$f":"IF($A25=\"x\", 'Rank Wkst'!FN21,\"\")","v":""},{"$f":"IF($A25=\"x\", 'Rank Wkst'!FP21,\"\")","v":""},{"$f":"IF(A25=\"x\", IF(AND('Rank Wkst'!FR21>1, F25<>\"DQ\"), 'Rank Wkst'!FU21, \"\"), \"\")","v":""},{"$f":"IF(A25=\"x\", IF(AND('Rank Wkst'!FR21>1, F25<>\"DQ\"),'Rank Wkst'!FW21, \"\"), \"\")","v":""},{"$f":"IF(A25=\"x\", IF(AND('Rank Wkst'!FY21>1, F25<>\"DQ\"), 'Rank Wkst'!GB21, \"\"),  \"\")","v":""},{"$f":"IF(A25=\"x\", IF(AND('Rank Wkst'!FY21>1,F25<>\"DQ\"), 'Rank Wkst'!GD21, \"\"), \"\")","v":""},{"$f":"IF(A25=\"x\", 'Rank Wkst'!EG21, \"\")","v":""},null,{"$f":"IF(A25=\"x\", 'Rank Wkst'!GH21, \"\")","v":0},{"$f":"IF(A25=\"x\", 'Rank Wkst'!GK21, \"\")","v":0},{"$f":"IF(A25=\"x\", 'Rank Wkst'!GN21,\"\")","v":0},null,null,null,{"$f":"'Rank Wkst'!GH21","v":0},{"$f":"'Rank Wkst'!GK21","v":0},{"$f":"'Rank Wkst'!GN21","v":0}]
["x",null,15,{"$f":"IF(A26=\"x\", 'Rank Wkst'!EH22,\"\")","v":""},null,{"$f":"IF($A26=\"x\", 'Rank Wkst'!EJ22,\"\")","v":""},{"$f":"IF($A26=\"x\", 'Rank Wkst'!EL22,\"\")","v":""},{"$f":"IF($A26=\"x\", 'Rank Wkst'!EN22,\"\")","v":""},{"$f":"IF($A26=\"x\", 'Rank Wkst'!EP22,\"\")","v":""},{"$f":"IF($A26=\"x\", 'Rank Wkst'!ER22,\"\")","v":""},{"$f":"IF($A26=\"x\", 'Rank Wkst'!ET22,\"\")","v":""},{"$f":"IF($A26=\"x\", 'Rank Wkst'!EV22,\"\")","v":""},{"$f":"IF($A26=\"x\", 'Rank Wkst'!EX22,\"\")","v":""},{"$f":"IF($A26=\"x\", 'Rank Wkst'!EZ22,\"\")","v":""},{"$f":"IF($A26=\"x\", 'Rank Wkst'!FB22,\"\")","v":""},{"$f":"IF($A26=\"x\", 'Rank Wkst'!FD22,\"\")","v":""},{"$f":"IF($A26=\"x\", 'Rank Wkst'!FF22,\"\")","v":""},{"$f":"IF($A26=\"x\", 'Rank Wkst'!FH22,\"\")","v":""},{"$f":"IF($A26=\"x\", 'Rank Wkst'!FJ22,\"\")","v":""},{"$f":"IF($A26=\"x\", 'Rank Wkst'!FL22,\"\")","v":""},{"$f":"IF($A26=\"x\", 'Rank Wkst'!FN22,\"\")","v":""},{"$f":"IF($A26=\"x\", 'Rank Wkst'!FP22,\"\")","v":""},{"$f":"IF(A26=\"x\", IF(AND('Rank Wkst'!FR22>1, F26<>\"DQ\"), 'Rank Wkst'!FU22, \"\"), \"\")","v":""},{"$f":"IF(A26=\"x\", IF(AND('Rank Wkst'!FR22>1, F26<>\"DQ\"),'Rank Wkst'!FW22, \"\"), \"\")","v":""},{"$f":"IF(A26=\"x\", IF(AND('Rank Wkst'!FY22>1, F26<>\"DQ\"), 'Rank Wkst'!GB22, \"\"),  \"\")","v":""},{"$f":"IF(A26=\"x\", IF(AND('Rank Wkst'!FY22>1,F26<>\"DQ\"), 'Rank Wkst'!GD22, \"\"), \"\")","v":""},{"$f":"IF(A26=\"x\", 'Rank Wkst'!EG22, \"\")","v":""},null,{"$f":"IF(A26=\"x\", 'Rank Wkst'!GH22, \"\")","v":0},{"$f":"IF(A26=\"x\", 'Rank Wkst'!GK22, \"\")","v":0},{"$f":"IF(A26=\"x\", 'Rank Wkst'!GN22,\"\")","v":0},null,null,null,{"$f":"'Rank Wkst'!GH22","v":0},{"$f":"'Rank Wkst'!GK22","v":0},{"$f":"'Rank Wkst'!GN22","v":0}]
["x",null,16,{"$f":"IF(A27=\"x\", 'Rank Wkst'!EH23,\"\")","v":""},null,{"$f":"IF($A27=\"x\", 'Rank Wkst'!EJ23,\"\")","v":""},{"$f":"IF($A27=\"x\", 'Rank Wkst'!EL23,\"\")","v":""},{"$f":"IF($A27=\"x\", 'Rank Wkst'!EN23,\"\")","v":""},{"$f":"IF($A27=\"x\", 'Rank Wkst'!EP23,\"\")","v":""},{"$f":"IF($A27=\"x\", 'Rank Wkst'!ER23,\"\")","v":""},{"$f":"IF($A27=\"x\", 'Rank Wkst'!ET23,\"\")","v":""},{"$f":"IF($A27=\"x\", 'Rank Wkst'!EV23,\"\")","v":""},{"$f":"IF($A27=\"x\", 'Rank Wkst'!EX23,\"\")","v":""},{"$f":"IF($A27=\"x\", 'Rank Wkst'!EZ23,\"\")","v":""},{"$f":"IF($A27=\"x\", 'Rank Wkst'!FB23,\"\")","v":""},{"$f":"IF($A27=\"x\", 'Rank Wkst'!FD23,\"\")","v":""},{"$f":"IF($A27=\"x\", 'Rank Wkst'!FF23,\"\")","v":""},{"$f":"IF($A27=\"x\", 'Rank Wkst'!FH23,\"\")","v":""},{"$f":"IF($A27=\"x\", 'Rank Wkst'!FJ23,\"\")","v":""},{"$f":"IF($A27=\"x\", 'Rank Wkst'!FL23,\"\")","v":""},{"$f":"IF($A27=\"x\", 'Rank Wkst'!FN23,\"\")","v":""},{"$f":"IF($A27=\"x\", 'Rank Wkst'!FP23,\"\")","v":""},{"$f":"IF(A27=\"x\", IF(AND('Rank Wkst'!FR23>1, F27<>\"DQ\"), 'Rank Wkst'!FU23, \"\"), \"\")","v":""},{"$f":"IF(A27=\"x\", IF(AND('Rank Wkst'!FR23>1, F27<>\"DQ\"),'Rank Wkst'!FW23, \"\"), \"\")","v":""},{"$f":"IF(A27=\"x\", IF(AND('Rank Wkst'!FY23>1, F27<>\"DQ\"), 'Rank Wkst'!GB23, \"\"),  \"\")","v":""},{"$f":"IF(A27=\"x\", IF(AND('Rank Wkst'!FY23>1,F27<>\"DQ\"), 'Rank Wkst'!GD23, \"\"), \"\")","v":""},{"$f":"IF(A27=\"x\", 'Rank Wkst'!EG23, \"\")","v":""},null,{"$f":"IF(A27=\"x\", 'Rank Wkst'!GH23, \"\")","v":0},{"$f":"IF(A27=\"x\", 'Rank Wkst'!GK23, \"\")","v":0},{"$f":"IF(A27=\"x\", 'Rank Wkst'!GN23,\"\")","v":0},null,null,null,{"$f":"'Rank Wkst'!GH23","v":0},{"$f":"'Rank Wkst'!GK23","v":0},{"$f":"'Rank Wkst'!GN23","v":0}]
["x",null,17,{"$f":"IF(A28=\"x\", 'Rank Wkst'!EH24,\"\")","v":""},null,{"$f":"IF($A28=\"x\", 'Rank Wkst'!EJ24,\"\")","v":""},{"$f":"IF($A28=\"x\", 'Rank Wkst'!EL24,\"\")","v":""},{"$f":"IF($A28=\"x\", 'Rank Wkst'!EN24,\"\")","v":""},{"$f":"IF($A28=\"x\", 'Rank Wkst'!EP24,\"\")","v":""},{"$f":"IF($A28=\"x\", 'Rank Wkst'!ER24,\"\")","v":""},{"$f":"IF($A28=\"x\", 'Rank Wkst'!ET24,\"\")","v":""},{"$f":"IF($A28=\"x\", 'Rank Wkst'!EV24,\"\")","v":""},{"$f":"IF($A28=\"x\", 'Rank Wkst'!EX24,\"\")","v":""},{"$f":"IF($A28=\"x\", 'Rank Wkst'!EZ24,\"\")","v":""},{"$f":"IF($A28=\"x\", 'Rank Wkst'!FB24,\"\")","v":""},{"$f":"IF($A28=\"x\", 'Rank Wkst'!FD24,\"\")","v":""},{"$f":"IF($A28=\"x\", 'Rank Wkst'!FF24,\"\")","v":""},{"$f":"IF($A28=\"x\", 'Rank Wkst'!FH24,\"\")","v":""},{"$f":"IF($A28=\"x\", 'Rank Wkst'!FJ24,\"\")","v":""},{"$f":"IF($A28=\"x\", 'Rank Wkst'!FL24,\"\")","v":""},{"$f":"IF($A28=\"x\", 'Rank Wkst'!FN24,\"\")","v":""},{"$f":"IF($A28=\"x\", 'Rank Wkst'!FP24,\"\")","v":""},{"$f":"IF(A28=\"x\", IF(AND('Rank Wkst'!FR24>1, F28<>\"DQ\"), 'Rank Wkst'!FU24, \"\"), \"\")","v":""},{"$f":"IF(A28=\"x\", IF(AND('Rank Wkst'!FR24>1, F28<>\"DQ\"),'Rank Wkst'!FW24, \"\"), \"\")","v":""},{"$f":"IF(A28=\"x\", IF(AND('Rank Wkst'!FY24>1, F28<>\"DQ\"), 'Rank Wkst'!GB24, \"\"),  \"\")","v":""},{"$f":"IF(A28=\"x\", IF(AND('Rank Wkst'!FY24>1,F28<>\"DQ\"), 'Rank Wkst'!GD24, \"\"), \"\")","v":""},{"$f":"IF(A28=\"x\", 'Rank Wkst'!EG24, \"\")","v":""},null,{"$f":"IF(A28=\"x\", 'Rank Wkst'!GH24, \"\")","v":0},{"$f":"IF(A28=\"x\", 'Rank Wkst'!GK24, \"\")","v":0},{"$f":"IF(A28=\"x\", 'Rank Wkst'!GN24,\"\")","v":0},null,null,null,{"$f":"'Rank Wkst'!GH24","v":0},{"$f":"'Rank Wkst'!GK24","v":0},{"$f":"'Rank Wkst'!GN24","v":0}]
["x",null,18,{"$f":"IF(A29=\"x\", 'Rank Wkst'!EH25,\"\")","v":""},null,{"$f":"IF($A29=\"x\", 'Rank Wkst'!EJ25,\"\")","v":""},{"$f":"IF($A29=\"x\", 'Rank Wkst'!EL25,\"\")","v":""},{"$f":"IF($A29=\"x\", 'Rank Wkst'!EN25,\"\")","v":""},{"$f":"IF($A29=\"x\", 'Rank Wkst'!EP25,\"\")","v":""},{"$f":"IF($A29=\"x\", 'Rank Wkst'!ER25,\"\")","v":""},{"$f":"IF($A29=\"x\", 'Rank Wkst'!ET25,\"\")","v":""},{"$f":"IF($A29=\"x\", 'Rank Wkst'!EV25,\"\")","v":""},{"$f":"IF($A29=\"x\", 'Rank Wkst'!EX25,\"\")","v":""},{"$f":"IF($A29=\"x\", 'Rank Wkst'!EZ25,\"\")","v":""},{"$f":"IF($A29=\"x\", 'Rank Wkst'!FB25,\"\")","v":""},{"$f":"IF($A29=\"x\", 'Rank Wkst'!FD25,\"\")","v":""},{"$f":"IF($A29=\"x\", 'Rank Wkst'!FF25,\"\")","v":""},{"$f":"IF($A29=\"x\", 'Rank Wkst'!FH25,\"\")","v":""},{"$f":"IF($A29=\"x\", 'Rank Wkst'!FJ25,\"\")","v":""},{"$f":"IF($A29=\"x\", 'Rank Wkst'!FL25,\"\")","v":""},{"$f":"IF($A29=\"x\", 'Rank Wkst'!FN25,\"\")","v":""},{"$f":"IF($A29=\"x\", 'Rank Wkst'!FP25,\"\")","v":""},{"$f":"IF(A29=\"x\", IF(AND('Rank Wkst'!FR25>1, F29<>\"DQ\"), 'Rank Wkst'!FU25, \"\"), \"\")","v":""},{"$f":"IF(A29=\"x\", IF(AND('Rank Wkst'!FR25>1, F29<>\"DQ\"),'Rank Wkst'!FW25, \"\"), \"\")","v":""},{"$f":"IF(A29=\"x\", IF(AND('Rank Wkst'!FY25>1, F29<>\"DQ\"), 'Rank Wkst'!GB25, \"\"),  \"\")","v":""},{"$f":"IF(A29=\"x\", IF(AND('Rank Wkst'!FY25>1,F29<>\"DQ\"), 'Rank Wkst'!GD25, \"\"), \"\")","v":""},{"$f":"IF(A29=\"x\", 'Rank Wkst'!EG25, \"\")","v":""},null,{"$f":"IF(A29=\"x\", 'Rank Wkst'!GH25, \"\")","v":0},{"$f":"IF(A29=\"x\", 'Rank Wkst'!GK25, \"\")","v":0},{"$f":"IF(A29=\"x\", 'Rank Wkst'!GN25,\"\")","v":0},null,null,null,{"$f":"'Rank Wkst'!GH25","v":0},{"$f":"'Rank Wkst'!GK25","v":0},{"$f":"'Rank Wkst'!GN25","v":0}]
["x",null,19,{"$f":"IF(A30=\"x\", 'Rank Wkst'!EH26,\"\")","v":""},null,{"$f":"IF($A30=\"x\", 'Rank Wkst'!EJ26,\"\")","v":""},{"$f":"IF($A30=\"x\", 'Rank Wkst'!EL26,\"\")","v":""},{"$f":"IF($A30=\"x\", 'Rank Wkst'!EN26,\"\")","v":""},{"$f":"IF($A30=\"x\", 'Rank Wkst'!EP26,\"\")","v":""},{"$f":"IF($A30=\"x\", 'Rank Wkst'!ER26,\"\")","v":""},{"$f":"IF($A30=\"x\", 'Rank Wkst'!ET26,\"\")","v":""},{"$f":"IF($A30=\"x\", 'Rank Wkst'!EV26,\"\")","v":""},{"$f":"IF($A30=\"x\", 'Rank Wkst'!EX26,\"\")","v":""},{"$f":"IF($A30=\"x\", 'Rank Wkst'!EZ26,\"\")","v":""},{"$f":"IF($A30=\"x\", 'Rank Wkst'!FB26,\"\")","v":""},{"$f":"IF($A30=\"x\", 'Rank Wkst'!FD26,\"\")","v":""},{"$f":"IF($A30=\"x\", 'Rank Wkst'!FF26,\"\")","v":""},{"$f":"IF($A30=\"x\", 'Rank Wkst'!FH26,\"\")","v":""},{"$f":"IF($A30=\"x\", 'Rank Wkst'!FJ26,\"\")","v":""},{"$f":"IF($A30=\"x\", 'Rank Wkst'!FL26,\"\")","v":""},{"$f":"IF($A30=\"x\", 'Rank Wkst'!FN26,\"\")","v":""},{"$f":"IF($A30=\"x\", 'Rank Wkst'!FP26,\"\")","v":""},{"$f":"IF(A30=\"x\", IF(AND('Rank Wkst'!FR26>1, F30<>\"DQ\"), 'Rank Wkst'!FU26, \"\"), \"\")","v":""},{"$f":"IF(A30=\"x\", IF(AND('Rank Wkst'!FR26>1, F30<>\"DQ\"),'Rank Wkst'!FW26, \"\"), \"\")","v":""},{"$f":"IF(A30=\"x\", IF(AND('Rank Wkst'!FY26>1, F30<>\"DQ\"), 'Rank Wkst'!GB26, \"\"),  \"\")","v":""},{"$f":"IF(A30=\"x\", IF(AND('Rank Wkst'!FY26>1,F30<>\"DQ\"), 'Rank Wkst'!GD26, \"\"), \"\")","v":""},{"$f":"IF(A30=\"x\", 'Rank Wkst'!EG26, \"\")","v":""},null,{"$f":"IF(A30=\"x\", 'Rank Wkst'!GH26, \"\")","v":0},{"$f":"IF(A30=\"x\", 'Rank Wkst'!GK26, \"\")","v":0},{"$f":"IF(A30=\"x\", 'Rank Wkst'!GN26,\"\")","v":0},null,null,null,{"$f":"'Rank Wkst'!GH26","v":0},{"$f":"'Rank Wkst'!GK26","v":0},{"$f":"'Rank Wkst'!GN26","v":0}]
["x",null,20,{"$f":"IF(A31=\"x\", 'Rank Wkst'!EH27,\"\")","v":""},null,{"$f":"IF($A31=\"x\", 'Rank Wkst'!EJ27,\"\")","v":""},{"$f":"IF($A31=\"x\", 'Rank Wkst'!EL27,\"\")","v":""},{"$f":"IF($A31=\"x\", 'Rank Wkst'!EN27,\"\")","v":""},{"$f":"IF($A31=\"x\", 'Rank Wkst'!EP27,\"\")","v":""},{"$f":"IF($A31=\"x\", 'Rank Wkst'!ER27,\"\")","v":""},{"$f":"IF($A31=\"x\", 'Rank Wkst'!ET27,\"\")","v":""},{"$f":"IF($A31=\"x\", 'Rank Wkst'!EV27,\"\")","v":""},{"$f":"IF($A31=\"x\", 'Rank Wkst'!EX27,\"\")","v":""},{"$f":"IF($A31=\"x\", 'Rank Wkst'!EZ27,\"\")","v":""},{"$f":"IF($A31=\"x\", 'Rank Wkst'!FB27,\"\")","v":""},{"$f":"IF($A31=\"x\", 'Rank Wkst'!FD27,\"\")","v":""},{"$f":"IF($A31=\"x\", 'Rank Wkst'!FF27,\"\")","v":""},{"$f":"IF($A31=\"x\", 'Rank Wkst'!FH27,\"\")","v":""},{"$f":"IF($A31=\"x\", 'Rank Wkst'!FJ27,\"\")","v":""},{"$f":"IF($A31=\"x\", 'Rank Wkst'!FL27,\"\")","v":""},{"$f":"IF($A31=\"x\", 'Rank Wkst'!FN27,\"\")","v":""},{"$f":"IF($A31=\"x\", 'Rank Wkst'!FP27,\"\")","v":""},{"$f":"IF(A31=\"x\", IF(AND('Rank Wkst'!FR27>1, F31<>\"DQ\"), 'Rank Wkst'!FU27, \"\"), \"\")","v":""},{"$f":"IF(A31=\"x\", IF(AND('Rank Wkst'!FR27>1, F31<>\"DQ\"),'Rank Wkst'!FW27, \"\"), \"\")","v":""},{"$f":"IF(A31=\"x\", IF(AND('Rank Wkst'!FY27>1, F31<>\"DQ\"), 'Rank Wkst'!GB27, \"\"),  \"\")","v":""},{"$f":"IF(A31=\"x\", IF(AND('Rank Wkst'!FY27>1,F31<>\"DQ\"), 'Rank Wkst'!GD27, \"\"), \"\")","v":""},{"$f":"IF(A31=\"x\", 'Rank Wkst'!EG27, \"\")","v":""},null,{"$f":"IF(A31=\"x\", 'Rank Wkst'!GH27, \"\")","v":0},{"$f":"IF(A31=\"x\", 'Rank Wkst'!GK27, \"\")","v":0},{"$f":"IF(A31=\"x\", 'Rank Wkst'!GN27,\"\")","v":0},null,null,null,{"$f":"'Rank Wkst'!GH27","v":0},{"$f":"'Rank Wkst'!GK27","v":0},{"$f":"'Rank Wkst'!GN27","v":0}]
["x",null,21,{"$f":"IF(A32=\"x\", 'Rank Wkst'!EH28,\"\")","v":""},null,{"$f":"IF($A32=\"x\", 'Rank Wkst'!EJ28,\"\")","v":""},{"$f":"IF($A32=\"x\", 'Rank Wkst'!EL28,\"\")","v":""},{"$f":"IF($A32=\"x\", 'Rank Wkst'!EN28,\"\")","v":""},{"$f":"IF($A32=\"x\", 'Rank Wkst'!EP28,\"\")","v":""},{"$f":"IF($A32=\"x\", 'Rank Wkst'!ER28,\"\")","v":""},{"$f":"IF($A32=\"x\", 'Rank Wkst'!ET28,\"\")","v":""},{"$f":"IF($A32=\"x\", 'Rank Wkst'!EV28,\"\")","v":""},{"$f":"IF($A32=\"x\", 'Rank Wkst'!EX28,\"\")","v":""},{"$f":"IF($A32=\"x\", 'Rank Wkst'!EZ28,\"\")","v":""},{"$f":"IF($A32=\"x\", 'Rank Wkst'!FB28,\"\")","v":""},{"$f":"IF($A32=\"x\", 'Rank Wkst'!FD28,\"\")","v":""},{"$f":"IF($A32=\"x\", 'Rank Wkst'!FF28,\"\")","v":""},{"$f":"IF($A32=\"x\", 'Rank Wkst'!FH28,\"\")","v":""},{"$f":"IF($A32=\"x\", 'Rank Wkst'!FJ28,\"\")","v":""},{"$f":"IF($A32=\"x\", 'Rank Wkst'!FL28,\"\")","v":""},{"$f":"IF($A32=\"x\", 'Rank Wkst'!FN28,\"\")","v":""},{"$f":"IF($A32=\"x\", 'Rank Wkst'!FP28,\"\")","v":""},{"$f":"IF(A32=\"x\", IF(AND('Rank Wkst'!FR28>1, F32<>\"DQ\"), 'Rank Wkst'!FU28, \"\"), \"\")","v":""},{"$f":"IF(A32=\"x\", IF(AND('Rank Wkst'!FR28>1, F32<>\"DQ\"),'Rank Wkst'!FW28, \"\"), \"\")","v":""},{"$f":"IF(A32=\"x\", IF(AND('Rank Wkst'!FY28>1, F32<>\"DQ\"), 'Rank Wkst'!GB28, \"\"),  \"\")","v":""},{"$f":"IF(A32=\"x\", IF(AND('Rank Wkst'!FY28>1,F32<>\"DQ\"), 'Rank Wkst'!GD28, \"\"), \"\")","v":""},{"$f":"IF(A32=\"x\", 'Rank Wkst'!EG28, \"\")","v":""},null,{"$f":"IF(A32=\"x\", 'Rank Wkst'!GH28, \"\")","v":0},{"$f":"IF(A32=\"x\", 'Rank Wkst'!GK28, \"\")","v":0},{"$f":"IF(A32=\"x\", 'Rank Wkst'!GN28,\"\")","v":0},null,null,null,{"$f":"'Rank Wkst'!GH28","v":0},{"$f":"'Rank Wkst'!GK28","v":0},{"$f":"'Rank Wkst'!GN28","v":0}]
["x",null,22,{"$f":"IF(A33=\"x\", 'Rank Wkst'!EH29,\"\")","v":""},null,{"$f":"IF($A33=\"x\", 'Rank Wkst'!EJ29,\"\")","v":""},{"$f":"IF($A33=\"x\", 'Rank Wkst'!EL29,\"\")","v":""},{"$f":"IF($A33=\"x\", 'Rank Wkst'!EN29,\"\")","v":""},{"$f":"IF($A33=\"x\", 'Rank Wkst'!EP29,\"\")","v":""},{"$f":"IF($A33=\"x\", 'Rank Wkst'!ER29,\"\")","v":""},{"$f":"IF($A33=\"x\", 'Rank Wkst'!ET29,\"\")","v":""},{"$f":"IF($A33=\"x\", 'Rank Wkst'!EV29,\"\")","v":""},{"$f":"IF($A33=\"x\", 'Rank Wkst'!EX29,\"\")","v":""},{"$f":"IF($A33=\"x\", 'Rank Wkst'!EZ29,\"\")","v":""},{"$f":"IF($A33=\"x\", 'Rank Wkst'!FB29,\"\")","v":""},{"$f":"IF($A33=\"x\", 'Rank Wkst'!FD29,\"\")","v":""},{"$f":"IF($A33=\"x\", 'Rank Wkst'!FF29,\"\")","v":""},{"$f":"IF($A33=\"x\", 'Rank Wkst'!FH29,\"\")","v":""},{"$f":"IF($A33=\"x\", 'Rank Wkst'!FJ29,\"\")","v":""},{"$f":"IF($A33=\"x\", 'Rank Wkst'!FL29,\"\")","v":""},{"$f":"IF($A33=\"x\", 'Rank Wkst'!FN29,\"\")","v":""},{"$f":"IF($A33=\"x\", 'Rank Wkst'!FP29,\"\")","v":""},{"$f":"IF(A33=\"x\", IF(AND('Rank Wkst'!FR29>1, F33<>\"DQ\"), 'Rank Wkst'!FU29, \"\"), \"\")","v":""},{"$f":"IF(A33=\"x\", IF(AND('Rank Wkst'!FR29>1, F33<>\"DQ\"),'Rank Wkst'!FW29, \"\"), \"\")","v":""},{"$f":"IF(A33=\"x\", IF(AND('Rank Wkst'!FY29>1, F33<>\"DQ\"), 'Rank Wkst'!GB29, \"\"),  \"\")","v":""},{"$f":"IF(A33=\"x\", IF(AND('Rank Wkst'!FY29>1,F33<>\"DQ\"), 'Rank Wkst'!GD29, \"\"), \"\")","v":""},{"$f":"IF(A33=\"x\", 'Rank Wkst'!EG29, \"\")","v":""},null,{"$f":"IF(A33=\"x\", 'Rank Wkst'!GH29, \"\")","v":0},{"$f":"IF(A33=\"x\", 'Rank Wkst'!GK29, \"\")","v":0},{"$f":"IF(A33=\"x\", 'Rank Wkst'!GN29,\"\")","v":0},null,null,null,{"$f":"'Rank Wkst'!GH29","v":0},{"$f":"'Rank Wkst'!GK29","v":0},{"$f":"'Rank Wkst'!GN29","v":0}]
["x",null,23,{"$f":"IF(A34=\"x\", 'Rank Wkst'!EH30,\"\")","v":""},null,{"$f":"IF($A34=\"x\", 'Rank Wkst'!EJ30,\"\")","v":""},{"$f":"IF($A34=\"x\", 'Rank Wkst'!EL30,\"\")","v":""},{"$f":"IF($A34=\"x\", 'Rank Wkst'!EN30,\"\")","v":""},{"$f":"IF($A34=\"x\", 'Rank Wkst'!EP30,\"\")","v":""},{"$f":"IF($A34=\"x\", 'Rank Wkst'!ER30,\"\")","v":""},{"$f":"IF($A34=\"x\", 'Rank Wkst'!ET30,\"\")","v":""},{"$f":"IF($A34=\"x\", 'Rank Wkst'!EV30,\"\")","v":""},{"$f":"IF($A34=\"x\", 'Rank Wkst'!EX30,\"\")","v":""},{"$f":"IF($A34=\"x\", 'Rank Wkst'!EZ30,\"\")","v":""},{"$f":"IF($A34=\"x\", 'Rank Wkst'!FB30,\"\")","v":""},{"$f":"IF($A34=\"x\", 'Rank Wkst'!FD30,\"\")","v":""},{"$f":"IF($A34=\"x\", 'Rank Wkst'!FF30,\"\")","v":""},{"$f":"IF($A34=\"x\", 'Rank Wkst'!FH30,\"\")","v":""},{"$f":"IF($A34=\"x\", 'Rank Wkst'!FJ30,\"\")","v":""},{"$f":"IF($A34=\"x\", 'Rank Wkst'!FL30,\"\")","v":""},{"$f":"IF($A34=\"x\", 'Rank Wkst'!FN30,\"\")","v":""},{"$f":"IF($A34=\"x\", 'Rank Wkst'!FP30,\"\")","v":""},{"$f":"IF(A34=\"x\", IF(AND('Rank Wkst'!FR30>1, F34<>\"DQ\"), 'Rank Wkst'!FU30, \"\"), \"\")","v":""},{"$f":"IF(A34=\"x\", IF(AND('Rank Wkst'!FR30>1, F34<>\"DQ\"),'Rank Wkst'!FW30, \"\"), \"\")","v":""},{"$f":"IF(A34=\"x\", IF(AND('Rank Wkst'!FY30>1, F34<>\"DQ\"), 'Rank Wkst'!GB30, \"\"),  \"\")","v":""},{"$f":"IF(A34=\"x\", IF(AND('Rank Wkst'!FY30>1,F34<>\"DQ\"), 'Rank Wkst'!GD30, \"\"), \"\")","v":""},{"$f":"IF(A34=\"x\", 'Rank Wkst'!EG30, \"\")","v":""},null,{"$f":"IF(A34=\"x\", 'Rank Wkst'!GH30, \"\")","v":0},{"$f":"IF(A34=\"x\", 'Rank Wkst'!GK30, \"\")","v":0},{"$f":"IF(A34=\"x\", 'Rank Wkst'!GN30,\"\")","v":0},null,null,null,{"$f":"'Rank Wkst'!GH30","v":0},{"$f":"'Rank Wkst'!GK30","v":0},{"$f":"'Rank Wkst'!GN30","v":0}]
["x",null,24,{"$f":"IF(A35=\"x\", 'Rank Wkst'!EH31,\"\")","v":""},null,{"$f":"IF($A35=\"x\", 'Rank Wkst'!EJ31,\"\")","v":""},{"$f":"IF($A35=\"x\", 'Rank Wkst'!EL31,\"\")","v":""},{"$f":"IF($A35=\"x\", 'Rank Wkst'!EN31,\"\")","v":""},{"$f":"IF($A35=\"x\", 'Rank Wkst'!EP31,\"\")","v":""},{"$f":"IF($A35=\"x\", 'Rank Wkst'!ER31,\"\")","v":""},{"$f":"IF($A35=\"x\", 'Rank Wkst'!ET31,\"\")","v":""},{"$f":"IF($A35=\"x\", 'Rank Wkst'!EV31,\"\")","v":""},{"$f":"IF($A35=\"x\", 'Rank Wkst'!EX31,\"\")","v":""},{"$f":"IF($A35=\"x\", 'Rank Wkst'!EZ31,\"\")","v":""},{"$f":"IF($A35=\"x\", 'Rank Wkst'!FB31,\"\")","v":""},{"$f":"IF($A35=\"x\", 'Rank Wkst'!FD31,\"\")","v":""},{"$f":"IF($A35=\"x\", 'Rank Wkst'!FF31,\"\")","v":""},{"$f":"IF($A35=\"x\", 'Rank Wkst'!FH31,\"\")","v":""},{"$f":"IF($A35=\"x\", 'Rank Wkst'!FJ31,\"\")","v":""},{"$f":"IF($A35=\"x\", 'Rank Wkst'!FL31,\"\")","v":""},{"$f":"IF($A35=\"x\", 'Rank Wkst'!FN31,\"\")","v":""},{"$f":"IF($A35=\"x\", 'Rank Wkst'!FP31,\"\")","v":""},{"$f":"IF(A35=\"x\", IF(AND('Rank Wkst'!FR31>1, F35<>\"DQ\"), 'Rank Wkst'!FU31, \"\"), \"\")","v":""},{"$f":"IF(A35=\"x\", IF(AND('Rank Wkst'!FR31>1, F35<>\"DQ\"),'Rank Wkst'!FW31, \"\"), \"\")","v":""},{"$f":"IF(A35=\"x\", IF(AND('Rank Wkst'!FY31>1, F35<>\"DQ\"), 'Rank Wkst'!GB31, \"\"),  \"\")","v":""},{"$f":"IF(A35=\"x\", IF(AND('Rank Wkst'!FY31>1,F35<>\"DQ\"), 'Rank Wkst'!GD31, \"\"), \"\")","v":""},{"$f":"IF(A35=\"x\", 'Rank Wkst'!EG31, \"\")","v":""},null,{"$f":"IF(A35=\"x\", 'Rank Wkst'!GH31, \"\")","v":0},{"$f":"IF(A35=\"x\", 'Rank Wkst'!GK31, \"\")","v":0},{"$f":"IF(A35=\"x\", 'Rank Wkst'!GN31,\"\")","v":0},null,null,null,{"$f":"'Rank Wkst'!GH31","v":0},{"$f":"'Rank Wkst'!GK31","v":0},{"$f":"'Rank Wkst'!GN31","v":0}]
[]
[null,null,"Superior Judge Signature:",null,null,null,null,null,null,null,null,null,null,null,"Tabulation Signature:"]

{"sheet":"State Prelims Announce","index":31,"n_rows":34,"n_cols":12,"rows_kept":34,"cut":false,"hidden":false,"merged":[[32,4,32,10],[30,3,30,10],[33,1,34,12],[31,3,31,10],[24,8,24,10],[27,3,27,10],[28,3,28,10],[29,3,29,10],[25,1,25,10],[12,3,12,6],[12,10,12,12],[17,1,17,12],[13,3,13,6],[13,10,13,12],[14,3,14,6],[14,10,14,12],[15,3,15,6],[15,10,15,12],[18,1,18,12],[26,3,26,10],[22,1,22,12],[20,1,20,12],[1,1,1,12],[2,1,2,12],[10,3,10,6],[10,10,10,12],[11,3,11,6],[11,10,11,12]]}
[]
[null,"Minnesota State High School League Dance Team Competition"]
[null,"Announcers Sheet - After State Preliminary Comp"]
[]
[null,"AFTER THE PRELIMINARY COMPETITION:"]
[]
[null,"“At this time, I would like to present the Class    ",null,null,null,null,null,null,null,null,{"$f":"IF(Class=0, \"\", Class)","v":""}]
[null,"teams in the Jazz Category in the order in which they performed.  "]
[null,"Please welcome each team as they are introduced:”"]
[]
[null,1,null,{"$f":"IF(Team1=0, \"\", Team1)","v":""},null,null,null,null,7,null,{"$f":"IF(Team7=0, \"\", Team7)","v":""}]
[null,2,null,{"$f":"IF(Team2=0, \"\", Team2)","v":""},null,null,null,null,8,null,{"$f":"IF(Team8=0, \"\", Team8)","v":""}]
[null,3,null,{"$f":"IF(Team3=0, \"\", Team3)","v":""},null,null,null,null,9,null,{"$f":"IF(Team9=0, \"\", Team9)","v":""}]
[null,4,null,{"$f":"IF(Team4=0, \"\", Team4)","v":""},null,null,null,null,10,null,{"$f":"IF(Team10=0, \"\", Team10)","v":""}]
[null,5,null,{"$f":"IF(Team5=0, \"\", Team5)","v":""},null,null,null,null,11,null,{"$f":"IF(Team11=0, \"\", Team11)","v":""}]
[null,6,null,{"$f":"IF(Team6=0, \"\", Team6)","v":""},null,null,null,null,12,null,{"$f":"IF(Team12=0, \"\", Team12)","v":""}]
[]
[null,"“Coaches:  A reminder that the results for Prelims are available in"]
[null,"the Registration Area."]
[]
[null,"“The teams that did not finish in the top six will not be announced.  The teams will be announced in Performance order & not in the order in which they placed in the Preliminary Competition. "]
[]
[null,"“When your school is announced, we would ask that the entire team please step forward.”"]
[]
[null,"\"The Teams moving on to Finals in Class",null,null,null,null,null,null,{"$f":"IF(Class=0, \"\", Class)","v":""},null,null,"are:"]
[]
[null,1]
[null,2]
[null,3]
[null,4]
[null,5]
[null,6]
[]
[null,"“Congratulations to all of the teams advancing to Finals and also congratulations to all of the teams not advancing on completing a successful season!\""]

{"sheet":"State Finals Announce","index":32,"n_rows":46,"n_cols":11,"rows_kept":46,"cut":false,"hidden":false,"merged":[[20,3,20,12],[43,1,43,12],[45,1,45,12],[38,1,38,12],[42,1,42,10],[21,3,21,12],[22,3,22,12],[40,4,40,8],[12,10,12,12],[15,1,15,12],[17,1,17,12],[10,3,10,6],[11,3,11,6],[12,3,12,6],[28,1,28,12],[18,3,18,12],[19,3,19,12],[1,1,1,12],[2,1,2,12],[33,1,33,12],[32,1,32,10],[37,1,37,10],[24,1,24,12],[14,1,14,12],[26,1,26,12],[10,10,10,12],[11,10,11,12]]}
[]
[null,"Minnesota State High School League Dance Team Competition"]
[null,"Announcers Sheet - After State Finals"]
[]
[null,"AFTER THE FINAL COMPETITION:"]
[]
[null,"“At this time, I would like to present the Class    ",null,null,null,null,null,null,null,null,{"$f":"IF(Class=0, \"\", Class)","v":""}]
[null,"finalists in the Jazz Category in the order in which they performed.  "]
[null,"Please welcome each team as they are introduced:”"]
[]
[null,1,null,{"$f":"IF(Team1=0, \"\", Team1)","v":""},null,null,null,null,4,null,{"$f":"IF(Team4=0, \"\", Team4)","v":""}]
[null,2,null,{"$f":"IF(Team2=0, \"\", Team2)","v":""},null,null,null,null,5,null,{"$f":"IF(Team5=0, \"\", Team5)","v":""}]
[null,3,null,{"$f":"IF(Team3=0, \"\", Team3)","v":""},null,null,null,null,6,null,{"$f":"IF(Team6=0, \"\",Team6)","v":""}]
[]
[null,"“Coaches:  A reminder that the results for Finals are available in"]
[null,"the Registration Area."]
[]
[null,"“Assisting with the presentation of the awards this evening are members of the Minnesota State High School League Board of Directors:”"]
[null,1]
[null,2]
[null,3]
[null,4]
[null,5]
[]
[null,"“The teams that did not finish in the top three will not be announced. A trophy and individual medals will be awarded to the third, second and championship teams.”"]
[]
[null,"“When your school is announced, we would ask that the entire team and coaches line up on the center court line to receive your awards.\""]
[]
[null,"\"We will be announcing the rank score for each team - the lowest rank score wins.\""]
[]
[null,"In THIRD PLACE in JAZZ  "]
[null,"with a rank score of ",null,null,null,null,{"$f":"'Rank Wkst'!CI10","v":""},null,"is the team from:"]
[null,{"$f":"'Rank Wkst'!EA10","v":""}]
[null,"Read the name of each girl and coaches while medals are awarded.  Ask the captains to come forward and receive their trophy."]
[]
[null,"In SECOND PLACE in JAZZ "]
[null,"with a rank score of ",null,null,null,null,{"$f":"'Rank Wkst'!CI9","v":""},null,"is the team from:"]
[null,{"$f":"'Rank Wkst'!EA9","v":""}]
[null,"Read the name of each girl and coaches while medals are awarded.  Ask the captains to come forward and receive their trophy."]
[]
[null,"The ",null,{"$f":"IF(DATE=0, \"\", DATE)","v":""},"JAZZ  STATE CHAMPIONS in Class",null,null,null,null,null,{"$f":"IF(Class=0, \"\", Class)","v":""}]
[null,"with a rank score of ",null,null,null,null,{"$f":"'Rank Wkst'!CI8","v":""},null,"is the team from:"]
[null,{"$f":"'Rank Wkst'!EA8","v":""}]
[null,"Read the name of each girl and coaches while medals are awarded.  Ask the captains to come forward and receive their trophy."]
[]
[null,"“Congratulations to all of the teams on their great performances today and on having a very successful season!\""]

{"sheet":"First and Last State Finals","index":33,"n_rows":11,"n_cols":6,"rows_kept":11,"cut":false,"hidden":false,"merged":[[10,1,10,3],[1,1,1,12],[2,1,2,12],[6,1,6,12],[8,5,8,10],[10,5,10,10],[4,1,4,12],[8,1,8,3]]}
[]
[null,"Minnesota State High School League Dance Team Competition"]
[null,"Determining First & Last - State Finals"]
[]
[null,"After Preliminary Competition, a drawing will take place for the order of performance for the Final Competition"]
[]
[null,"These teams were first or last in the Preliminary competition and cannot be first or last for Finals:"]
[]
[null,"Team 1",null,null,null,{"$f":"IF(Team1=0, \"\", Team1)","v":""}]
[]
[null,"Team 12",null,null,null,{"$f":"IF(Team12=0, \"\", Team12)","v":""}]

{"sheet":"State Tie Announce","index":34,"n_rows":31,"n_cols":12,"rows_kept":31,"cut":false,"hidden":false,"merged":[[30,9,30,12],[1,1,1,12],[2,1,2,12],[10,9,10,12],[17,9,17,12],[19,9,19,12],[27,9,27,12]]}
[]
[null,"Minnesota State High School League Dance Team Competition"]
[null,"Announcers Sheet for Ties"]
[]
[null,"After the Final Competition, if a TIE is present:"]
[]
[null,"Tie for Third:"]
[]
[null,"\"There was a tie for 3rd place with both schools having a rank score of ",null,null,null,null,null,null,null,null,{"$f":"'Rank Wkst'!AJ59","v":""},"."]
[]
[null,"Based on the tie breaking procedure, the third place team is",null,null,null,null,null,null,null,{"$f":"'Rank Wkst'!AH59","v":""}]
[]
[]
[null,"Tie for Second:"]
[]
[null,"\"There was a tie for 2nd place with both schools having a rank score of ",null,null,null,null,null,null,null,null,{"$f":"'Rank Wkst'!AJ58","v":""},"."]
[]
[null,"Based on the tie breaking procedures, the third place team is:",null,null,null,null,null,null,null,{"$f":"'Rank Wkst'!AG58","v":""}]
[]
[null,"In Second Place, the ",null,null,{"$f":"IF(DATE=0, \"\", DATE)","v":""},"Runner-up, the team from:",null,null,null,{"$f":"'Rank Wkst'!AF58","v":""}]
[]
[]
[null,"Tie for First:"]
[]
[null,"\"There was a tie for 1st place with both schools having a rank score of ",null,null,null,null,null,null,null,null,{"$f":"'Rank Wkst'!AJ57","v":""},"."]
[]
[null,"Based on the tie breaking procedures, the",null,null,null,null,null,{"$f":"IF(DATE=0, \"\", DATE)","v":""},"Runner-up is the team from:"]
[null,null,null,null,null,null,null,null,null,{"$f":"'Rank Wkst'!AE57","v":""}]
[]
[null,"Finishing in 1st place . . . ",null,null," Congratulations to the",null,null,{"$f":"IF(DATE=0, \"\", DATE)","v":""},"State Champion . . . "]
[null,null,null,null,null,null,null,null,null,{"$f":"'Rank Wkst'!AD57","v":""}]

{"sheet":"Superior Judge Recap","index":35,"n_rows":35,"n_cols":18,"rows_kept":35,"cut":false,"hidden":false,"merged":[[1,0,1,17],[2,0,2,17],[10,1,10,2],[11,1,11,2],[12,1,12,2],[4,0,4,1],[4,3,4,4],[6,0,6,1],[6,3,6,4],[18,1,18,2],[19,1,19,2],[20,1,20,2],[21,1,21,2],[22,1,22,2],[13,1,13,2],[14,1,14,2],[15,1,15,2],[16,1,16,2],[17,1,17,2],[23,1,23,2],[24,1,24,2],[32,1,32,2],[33,1,33,2],[25,1,25,2],[26,1,26,2],[27,1,27,2],[28,1,28,2],[29,1,29,2],[30,1,30,2],[34,1,34,2],[4,5,4,17],[6,5,6,17],[8,3,8,9],[8,10,8,16],[9,6,9,7],[9,8,9,9],[9,13,9,14],[9,15,9,16],[31,1,31,2]]}
[]
["Minnesota State High School League Dance Team Competition"]
["Superior Judge Recap Sheet"]
[]
["MEET DATE:",null,{"$f":"IF(DATE=0, \"\", DATE)","v":""},"MEET SITE:",null,{"$f":"IF(Site=0, \"\", Site)","v":""}]
[]
["CLASS:",null,{"$f":"IF(Class=0, \"\", Class)","v":""},"CATEGORY:",null,{"$f":"CATEGORY","v":"Jazz Category"}]
[]
[null,null,null,"Judges Rank",null,null,null,null,null,null,"Judges Points"]
[null,null,null,null,null,null,"Drop Best Rank",null,"Drop Worst Rank",null,null,null,null,"Drop Lowest Points",null,"Drop Highest Points"]
[null,"School",null,"Best Rank","Worst Rank","Rank Spread","2nd Best Rank","Rank Spread with 2nd Best Rank","2nd Worst Rank","Rank Spread with 2nd Worst Rank","Low Points","High Points","Point Spread","2nd Low Points","Point Spread with 2nd Low Points","2nd High Points","Point Spread with 2nd High Points","Final Rank"]
[1,{"$f":"'Rank Wkst'!B8","v":""},null,{"$f":"'Rank Wkst'!AU57","v":""},{"$f":"'Rank Wkst'!AV57","v":""},{"$f":"'Rank Wkst'!AW57","v":""},{"$f":"'Rank Wkst'!AX57","v":""},{"$f":"'Rank Wkst'!AY57","v":""},{"$f":"'Rank Wkst'!AZ57","v":""},{"$f":"'Rank Wkst'!BA57","v":""},{"$f":"'Rank Wkst'!BJ57","v":""},{"$f":"'Rank Wkst'!BK57","v":""},{"$f":"'Rank Wkst'!BL57","v":""},{"$f":"'Rank Wkst'!BM57","v":""},{"$f":"'Rank Wkst'!BN57","v":""},{"$f":"'Rank Wkst'!BO57","v":""},{"$f":"'Rank Wkst'!BP57","v":""},{"$f":"'Ranking Sheet'!Y12","v":""}]
[2,{"$f":"'Rank Wkst'!B9","v":""},null,{"$f":"'Rank Wkst'!AU58","v":""},{"$f":"'Rank Wkst'!AV58","v":""},{"$f":"'Rank Wkst'!AW58","v":""},{"$f":"'Rank Wkst'!AX58","v":""},{"$f":"'Rank Wkst'!AY58","v":""},{"$f":"'Rank Wkst'!AZ58","v":""},{"$f":"'Rank Wkst'!BA58","v":""},{"$f":"'Rank Wkst'!BJ58","v":""},{"$f":"'Rank Wkst'!BK58","v":""},{"$f":"'Rank Wkst'!BL58","v":""},{"$f":"'Rank Wkst'!BM58","v":""},{"$f":"'Rank Wkst'!BN58","v":""},{"$f":"'Rank Wkst'!BO58","v":""},{"$f":"'Rank Wkst'!BP58","v":""},{"$f":"'Ranking Sheet'!Y13","v":""}]
[3,{"$f":"'Rank Wkst'!B10","v":""},null,{"$f":"'Rank Wkst'!AU59","v":""},{"$f":"'Rank Wkst'!AV59","v":""},{"$f":"'Rank Wkst'!AW59","v":""},{"$f":"'Rank Wkst'!AX59","v":""},{"$f":"'Rank Wkst'!AY59","v":""},{"$f":"'Rank Wkst'!AZ59","v":""},{"$f":"'Rank Wkst'!BA59","v":""},{"$f":"'Rank Wkst'!BJ59","v":""},{"$f":"'Rank Wkst'!BK59","v":""},{"$f":"'Rank Wkst'!BL59","v":""},{"$f":"'Rank Wkst'!BM59","v":""},{"$f":"'Rank Wkst'!BN59","v":""},{"$f":"'Rank Wkst'!BO59","v":""},{"$f":"'Rank Wkst'!BP59","v":""},{"$f":"'Ranking Sheet'!Y14","v":""}]
[4,{"$f":"'Rank Wkst'!B11","v":""},null,{"$f":"'Rank Wkst'!AU60","v":""},{"$f":"'Rank Wkst'!AV60","v":""},{"$f":"'Rank Wkst'!AW60","v":""},{"$f":"'Rank Wkst'!AX60","v":""},{"$f":"'Rank Wkst'!AY60","v":""},{"$f":"'Rank Wkst'!AZ60","v":""},{"$f":"'Rank Wkst'!BA60","v":""},{"$f":"'Rank Wkst'!BJ60","v":""},{"$f":"'Rank Wkst'!BK60","v":""},{"$f":"'Rank Wkst'!BL60","v":""},{"$f":"'Rank Wkst'!BM60","v":""},{"$f":"'Rank Wkst'!BN60","v":""},{"$f":"'Rank Wkst'!BO60","v":""},{"$f":"'Rank Wkst'!BP60","v":""},{"$f":"'Ranking Sheet'!Y15","v":""}]
[5,{"$f":"'Rank Wkst'!B12","v":""},null,{"$f":"'Rank Wkst'!AU61","v":""},{"$f":"'Rank Wkst'!AV61","v":""},{"$f":"'Rank Wkst'!AW61","v":""},{"$f":"'Rank Wkst'!AX61","v":""},{"$f":"'Rank Wkst'!AY61","v":""},{"$f":"'Rank Wkst'!AZ61","v":""},{"$f":"'Rank Wkst'!BA61","v":""},{"$f":"'Rank Wkst'!BJ61","v":""},{"$f":"'Rank Wkst'!BK61","v":""},{"$f":"'Rank Wkst'!BL61","v":""},{"$f":"'Rank Wkst'!BM61","v":""},{"$f":"'Rank Wkst'!BN61","v":""},{"$f":"'Rank Wkst'!BO61","v":""},{"$f":"'Rank Wkst'!BP61","v":""},{"$f":"'Ranking Sheet'!Y16","v":""}]
[6,{"$f":"'Rank Wkst'!B13","v":""},null,{"$f":"'Rank Wkst'!AU62","v":""},{"$f":"'Rank Wkst'!AV62","v":""},{"$f":"'Rank Wkst'!AW62","v":""},{"$f":"'Rank Wkst'!AX62","v":""},{"$f":"'Rank Wkst'!AY62","v":""},{"$f":"'Rank Wkst'!AZ62","v":""},{"$f":"'Rank Wkst'!BA62","v":""},{"$f":"'Rank Wkst'!BJ62","v":""},{"$f":"'Rank Wkst'!BK62","v":""},{"$f":"'Rank Wkst'!BL62","v":""},{"$f":"'Rank Wkst'!BM62","v":""},{"$f":"'Rank Wkst'!BN62","v":""},{"$f":"'Rank Wkst'!BO62","v":""},{"$f":"'Rank Wkst'!BP62","v":""},{"$f":"'Ranking Sheet'!Y17","v":""}]
[7,{"$f":"'Rank Wkst'!B14","v":""},null,{"$f":"'Rank Wkst'!AU63","v":""},{"$f":"'Rank Wkst'!AV63","v":""},{"$f":"'Rank Wkst'!AW63","v":""},{"$f":"'Rank Wkst'!AX63","v":""},{"$f":"'Rank Wkst'!AY63","v":""},{"$f":"'Rank Wkst'!AZ63","v":""},{"$f":"'Rank Wkst'!BA63","v":""},{"$f":"'Rank Wkst'!BJ63","v":""},{"$f":"'Rank Wkst'!BK63","v":""},{"$f":"'Rank Wkst'!BL63","v":""},{"$f":"'Rank Wkst'!BM63","v":""},{"$f":"'Rank Wkst'!BN63","v":""},{"$f":"'Rank Wkst'!BO63","v":""},{"$f":"'Rank Wkst'!BP63","v":""},{"$f":"'Ranking Sheet'!Y18","v":""}]
[8,{"$f":"'Rank Wkst'!B15","v":""},null,{"$f":"'Rank Wkst'!AU64","v":""},{"$f":"'Rank Wkst'!AV64","v":""},{"$f":"'Rank Wkst'!AW64","v":""},{"$f":"'Rank Wkst'!AX64","v":""},{"$f":"'Rank Wkst'!AY64","v":""},{"$f":"'Rank Wkst'!AZ64","v":""},{"$f":"'Rank Wkst'!BA64","v":""},{"$f":"'Rank Wkst'!BJ64","v":""},{"$f":"'Rank Wkst'!BK64","v":""},{"$f":"'Rank Wkst'!BL64","v":""},{"$f":"'Rank Wkst'!BM64","v":""},{"$f":"'Rank Wkst'!BN64","v":""},{"$f":"'Rank Wkst'!BO64","v":""},{"$f":"'Rank Wkst'!BP64","v":""},{"$f":"'Ranking Sheet'!Y19","v":""}]
[9,{"$f":"'Rank Wkst'!B16","v":""},null,{"$f":"'Rank Wkst'!AU65","v":""},{"$f":"'Rank Wkst'!AV65","v":""},{"$f":"'Rank Wkst'!AW65","v":""},{"$f":"'Rank Wkst'!AX65","v":""},{"$f":"'Rank Wkst'!AY65","v":""},{"$f":"'Rank Wkst'!AZ65","v":""},{"$f":"'Rank Wkst'!BA65","v":""},{"$f":"'Rank Wkst'!BJ65","v":""},{"$f":"'Rank Wkst'!BK65","v":""},{"$f":"'Rank Wkst'!BL65","v":""},{"$f":"'Rank Wkst'!BM65","v":""},{"$f":"'Rank Wkst'!BN65","v":""},{"$f":"'Rank Wkst'!BO65","v":""},{"$f":"'Rank Wkst'!BP65","v":""},{"$f":"'Ranking Sheet'!Y20","v":""}]
[10,{"$f":"'Rank Wkst'!B17","v":""},null,{"$f":"'Rank Wkst'!AU66","v":""},{"$f":"'Rank Wkst'!AV66","v":""},{"$f":"'Rank Wkst'!AW66","v":""},{"$f":"'Rank Wkst'!AX66","v":""},{"$f":"'Rank Wkst'!AY66","v":""},{"$f":"'Rank Wkst'!AZ66","v":""},{"$f":"'Rank Wkst'!BA66","v":""},{"$f":"'Rank Wkst'!BJ66","v":""},{"$f":"'Rank Wkst'!BK66","v":""},{"$f":"'Rank Wkst'!BL66","v":""},{"$f":"'Rank Wkst'!BM66","v":""},{"$f":"'Rank Wkst'!BN66","v":""},{"$f":"'Rank Wkst'!BO66","v":""},{"$f":"'Rank Wkst'!BP66","v":""},{"$f":"'Ranking Sheet'!Y21","v":""}]
[11,{"$f":"'Rank Wkst'!B18","v":""},null,{"$f":"'Rank Wkst'!AU67","v":""},{"$f":"'Rank Wkst'!AV67","v":""},{"$f":"'Rank Wkst'!AW67","v":""},{"$f":"'Rank Wkst'!AX67","v":""},{"$f":"'Rank Wkst'!AY67","v":""},{"$f":"'Rank Wkst'!AZ67","v":""},{"$f":"'Rank Wkst'!BA67","v":""},{"$f":"'Rank Wkst'!BJ67","v":""},{"$f":"'Rank Wkst'!BK67","v":""},{"$f":"'Rank Wkst'!BL67","v":""},{"$f":"'Rank Wkst'!BM67","v":""},{"$f":"'Rank Wkst'!BN67","v":""},{"$f":"'Rank Wkst'!BO67","v":""},{"$f":"'Rank Wkst'!BP67","v":""},{"$f":"'Ranking Sheet'!Y22","v":""}]
[12,{"$f":"'Rank Wkst'!B19","v":""},null,{"$f":"'Rank Wkst'!AU68","v":""},{"$f":"'Rank Wkst'!AV68","v":""},{"$f":"'Rank Wkst'!AW68","v":""},{"$f":"'Rank Wkst'!AX68","v":""},{"$f":"'Rank Wkst'!AY68","v":""},{"$f":"'Rank Wkst'!AZ68","v":""},{"$f":"'Rank Wkst'!BA68","v":""},{"$f":"'Rank Wkst'!BJ68","v":""},{"$f":"'Rank Wkst'!BK68","v":""},{"$f":"'Rank Wkst'!BL68","v":""},{"$f":"'Rank Wkst'!BM68","v":""},{"$f":"'Rank Wkst'!BN68","v":""},{"$f":"'Rank Wkst'!BO68","v":""},{"$f":"'Rank Wkst'!BP68","v":""},{"$f":"'Ranking Sheet'!Y23","v":""}]
[13,{"$f":"'Rank Wkst'!B20","v":""},null,{"$f":"'Rank Wkst'!AU69","v":""},{"$f":"'Rank Wkst'!AV69","v":""},{"$f":"'Rank Wkst'!AW69","v":""},{"$f":"'Rank Wkst'!AX69","v":""},{"$f":"'Rank Wkst'!AY69","v":""},{"$f":"'Rank Wkst'!AZ69","v":""},{"$f":"'Rank Wkst'!BA69","v":""},{"$f":"'Rank Wkst'!BJ69","v":""},{"$f":"'Rank Wkst'!BK69","v":""},{"$f":"'Rank Wkst'!BL69","v":""},{"$f":"'Rank Wkst'!BM69","v":""},{"$f":"'Rank Wkst'!BN69","v":""},{"$f":"'Rank Wkst'!BO69","v":""},{"$f":"'Rank Wkst'!BP69","v":""},{"$f":"'Ranking Sheet'!Y24","v":""}]
[14,{"$f":"'Rank Wkst'!B21","v":""},null,{"$f":"'Rank Wkst'!AU70","v":""},{"$f":"'Rank Wkst'!AV70","v":""},{"$f":"'Rank Wkst'!AW70","v":""},{"$f":"'Rank Wkst'!AX70","v":""},{"$f":"'Rank Wkst'!AY70","v":""},{"$f":"'Rank Wkst'!AZ70","v":""},{"$f":"'Rank Wkst'!BA70","v":""},{"$f":"'Rank Wkst'!BJ70","v":""},{"$f":"'Rank Wkst'!BK70","v":""},{"$f":"'Rank Wkst'!BL70","v":""},{"$f":"'Rank Wkst'!BM70","v":""},{"$f":"'Rank Wkst'!BN70","v":""},{"$f":"'Rank Wkst'!BO70","v":""},{"$f":"'Rank Wkst'!BP70","v":""},{"$f":"'Ranking Sheet'!Y25","v":""}]
[15,{"$f":"'Rank Wkst'!B22","v":""},null,{"$f":"'Rank Wkst'!AU71","v":""},{"$f":"'Rank Wkst'!AV71","v":""},{"$f":"'Rank Wkst'!AW71","v":""},{"$f":"'Rank Wkst'!AX71","v":""},{"$f":"'Rank Wkst'!AY71","v":""},{"$f":"'Rank Wkst'!AZ71","v":""},{"$f":"'Rank Wkst'!BA71","v":""},{"$f":"'Rank Wkst'!BJ71","v":""},{"$f":"'Rank Wkst'!BK71","v":""},{"$f":"'Rank Wkst'!BL71","v":""},{"$f":"'Rank Wkst'!BM71","v":""},{"$f":"'Rank Wkst'!BN71","v":""},{"$f":"'Rank Wkst'!BO71","v":""},{"$f":"'Rank Wkst'!BP71","v":""},{"$f":"'Ranking Sheet'!Y26","v":""}]
[16,{"$f":"'Rank Wkst'!B23","v":""},null,{"$f":"'Rank Wkst'!AU72","v":""},{"$f":"'Rank Wkst'!AV72","v":""},{"$f":"'Rank Wkst'!AW72","v":""},{"$f":"'Rank Wkst'!AX72","v":""},{"$f":"'Rank Wkst'!AY72","v":""},{"$f":"'Rank Wkst'!AZ72","v":""},{"$f":"'Rank Wkst'!BA72","v":""},{"$f":"'Rank Wkst'!BJ72","v":""},{"$f":"'Rank Wkst'!BK72","v":""},{"$f":"'Rank Wkst'!BL72","v":""},{"$f":"'Rank Wkst'!BM72","v":""},{"$f":"'Rank Wkst'!BN72","v":""},{"$f":"'Rank Wkst'!BO72","v":""},{"$f":"'Rank Wkst'!BP72","v":""},{"$f":"'Ranking Sheet'!Y27","v":""}]
[17,{"$f":"'Rank Wkst'!B24","v":""},null,{"$f":"'Rank Wkst'!AU73","v":""},{"$f":"'Rank Wkst'!AV73","v":""},{"$f":"'Rank Wkst'!AW73","v":""},{"$f":"'Rank Wkst'!AX73","v":""},{"$f":"'Rank Wkst'!AY73","v":""},{"$f":"'Rank Wkst'!AZ73","v":""},{"$f":"'Rank Wkst'!BA73","v":""},{"$f":"'Rank Wkst'!BJ73","v":""},{"$f":"'Rank Wkst'!BK73","v":""},{"$f":"'Rank Wkst'!BL73","v":""},{"$f":"'Rank Wkst'!BM73","v":""},{"$f":"'Rank Wkst'!BN73","v":""},{"$f":"'Rank Wkst'!BO73","v":""},{"$f":"'Rank Wkst'!BP73","v":""},{"$f":"'Ranking Sheet'!Y28","v":""}]
[18,{"$f":"'Rank Wkst'!B25","v":""},null,{"$f":"'Rank Wkst'!AU74","v":""},{"$f":"'Rank Wkst'!AV74","v":""},{"$f":"'Rank Wkst'!AW74","v":""},{"$f":"'Rank Wkst'!AX74","v":""},{"$f":"'Rank Wkst'!AY74","v":""},{"$f":"'Rank Wkst'!AZ74","v":""},{"$f":"'Rank Wkst'!BA74","v":""},{"$f":"'Rank Wkst'!BJ74","v":""},{"$f":"'Rank Wkst'!BK74","v":""},{"$f":"'Rank Wkst'!BL74","v":""},{"$f":"'Rank Wkst'!BM74","v":""},{"$f":"'Rank Wkst'!BN74","v":""},{"$f":"'Rank Wkst'!BO74","v":""},{"$f":"'Rank Wkst'!BP74","v":""},{"$f":"'Ranking Sheet'!Y29","v":""}]
[19,{"$f":"'Rank Wkst'!B26","v":""},null,{"$f":"'Rank Wkst'!AU75","v":""},{"$f":"'Rank Wkst'!AV75","v":""},{"$f":"'Rank Wkst'!AW75","v":""},{"$f":"'Rank Wkst'!AX75","v":""},{"$f":"'Rank Wkst'!AY75","v":""},{"$f":"'Rank Wkst'!AZ75","v":""},{"$f":"'Rank Wkst'!BA75","v":""},{"$f":"'Rank Wkst'!BJ75","v":""},{"$f":"'Rank Wkst'!BK75","v":""},{"$f":"'Rank Wkst'!BL75","v":""},{"$f":"'Rank Wkst'!BM75","v":""},{"$f":"'Rank Wkst'!BN75","v":""},{"$f":"'Rank Wkst'!BO75","v":""},{"$f":"'Rank Wkst'!BP75","v":""},{"$f":"'Ranking Sheet'!Y30","v":""}]
[20,{"$f":"'Rank Wkst'!B27","v":""},null,{"$f":"'Rank Wkst'!AU76","v":""},{"$f":"'Rank Wkst'!AV76","v":""},{"$f":"'Rank Wkst'!AW76","v":""},{"$f":"'Rank Wkst'!AX76","v":""},{"$f":"'Rank Wkst'!AY76","v":""},{"$f":"'Rank Wkst'!AZ76","v":""},{"$f":"'Rank Wkst'!BA76","v":""},{"$f":"'Rank Wkst'!BJ76","v":""},{"$f":"'Rank Wkst'!BK76","v":""},{"$f":"'Rank Wkst'!BL76","v":""},{"$f":"'Rank Wkst'!BM76","v":""},{"$f":"'Rank Wkst'!BN76","v":""},{"$f":"'Rank Wkst'!BO76","v":""},{"$f":"'Rank Wkst'!BP76","v":""},{"$f":"'Ranking Sheet'!Y31","v":""}]
[21,{"$f":"'Rank Wkst'!B28","v":""},null,{"$f":"'Rank Wkst'!AU77","v":""},{"$f":"'Rank Wkst'!AV77","v":""},{"$f":"'Rank Wkst'!AW77","v":""},{"$f":"'Rank Wkst'!AX77","v":""},{"$f":"'Rank Wkst'!AY77","v":""},{"$f":"'Rank Wkst'!AZ77","v":""},{"$f":"'Rank Wkst'!BA77","v":""},{"$f":"'Rank Wkst'!BJ77","v":""},{"$f":"'Rank Wkst'!BK77","v":""},{"$f":"'Rank Wkst'!BL77","v":""},{"$f":"'Rank Wkst'!BM77","v":""},{"$f":"'Rank Wkst'!BN77","v":""},{"$f":"'Rank Wkst'!BO77","v":""},{"$f":"'Rank Wkst'!BP77","v":""},{"$f":"'Ranking Sheet'!Y32","v":""}]
[22,{"$f":"'Rank Wkst'!B29","v":""},null,{"$f":"'Rank Wkst'!AU78","v":""},{"$f":"'Rank Wkst'!AV78","v":""},{"$f":"'Rank Wkst'!AW78","v":""},{"$f":"'Rank Wkst'!AX78","v":""},{"$f":"'Rank Wkst'!AY78","v":""},{"$f":"'Rank Wkst'!AZ78","v":""},{"$f":"'Rank Wkst'!BA78","v":""},{"$f":"'Rank Wkst'!BJ78","v":""},{"$f":"'Rank Wkst'!BK78","v":""},{"$f":"'Rank Wkst'!BL78","v":""},{"$f":"'Rank Wkst'!BM78","v":""},{"$f":"'Rank Wkst'!BN78","v":""},{"$f":"'Rank Wkst'!BO78","v":""},{"$f":"'Rank Wkst'!BP78","v":""},{"$f":"'Ranking Sheet'!Y33","v":""}]
[23,{"$f":"'Rank Wkst'!B30","v":""},null,{"$f":"'Rank Wkst'!AU79","v":""},{"$f":"'Rank Wkst'!AV79","v":""},{"$f":"'Rank Wkst'!AW79","v":""},{"$f":"'Rank Wkst'!AX79","v":""},{"$f":"'Rank Wkst'!AY79","v":""},{"$f":"'Rank Wkst'!AZ79","v":""},{"$f":"'Rank Wkst'!BA79","v":""},{"$f":"'Rank Wkst'!BJ79","v":""},{"$f":"'Rank Wkst'!BK79","v":""},{"$f":"'Rank Wkst'!BL79","v":""},{"$f":"'Rank Wkst'!BM79","v":""},{"$f":"'Rank Wkst'!BN79","v":""},{"$f":"'Rank Wkst'!BO79","v":""},{"$f":"'Rank Wkst'!BP79","v":""},{"$f":"'Ranking Sheet'!Y34","v":""}]
[24,{"$f":"'Rank Wkst'!B31","v":""},null,{"$f":"'Rank Wkst'!AU80","v":""},{"$f":"'Rank Wkst'!AV80","v":""},{"$f":"'Rank Wkst'!AW80","v":""},{"$f":"'Rank Wkst'!AX80","v":""},{"$f":"'Rank Wkst'!AY80","v":""},{"$f":"'Rank Wkst'!AZ80","v":""},{"$f":"'Rank Wkst'!BA80","v":""},{"$f":"'Rank Wkst'!BJ80","v":""},{"$f":"'Rank Wkst'!BK80","v":""},{"$f":"'Rank Wkst'!BL80","v":""},{"$f":"'Rank Wkst'!BM80","v":""},{"$f":"'Rank Wkst'!BN80","v":""},{"$f":"'Rank Wkst'!BO80","v":""},{"$f":"'Rank Wkst'!BP80","v":""},{"$f":"'Ranking Sheet'!Y35","v":""}]

{"sheet":"Score Summary","index":36,"n_rows":47,"n_cols":11,"rows_kept":47,"cut":false,"hidden":false,"merged":[[42,1,42,2],[35,1,35,2],[43,1,43,2],[44,1,44,2],[45,1,45,2],[46,1,46,2],[37,1,37,2],[38,1,38,2],[39,1,39,2],[40,1,40,2],[41,1,41,2],[29,1,29,2],[30,1,30,2],[31,1,31,2],[32,1,32,2],[33,1,33,2],[34,1,34,2],[21,0,21,2],[21,3,21,10],[22,1,22,2],[23,1,23,2],[24,1,24,2],[36,1,36,2],[25,1,25,2],[26,1,26,2],[27,1,27,2],[28,1,28,2],[15,0,15,10],[1,0,1,10],[2,0,2,10],[4,0,4,1],[4,5,4,8],[6,0,6,1],[6,5,6,8]]}
[]
["Minnesota State High School League Dance Team Competition"]
["Team Scoring Summary"]
[]
["MEET DATE:",null,{"$f":"IF(DATE=0, \"\", DATE)","v":""},null,"MEET SITE:",{"$f":"IF(Site=0, \"\", Site)","v":""}]
[]
["CLASS:",null,{"$f":"IF(Class=0, \"\", Class)","v":""},null,"CATEGORY:",{"$f":"CATEGORY","v":"Jazz Category"}]
[]
["Announcers - Please read the following:"]
["May I please have your attention: "]
[]
["At today/tonight’s competition we are piloting a system, which will allow us to periodically share results during this event."]
[]
["Judges scores are used to determine ranked placements and, in final tabulation, high and low ranks are dropped."]
[]
["The scores announced during the competition are the total points scored by each official and will be read from the lowest score to the highest score for each performance.  Teams have not yet been ranked and high and low ranks have not been dropped.  The final results will be based on rank, not on these point totals."]
[]
["This is informational only and our way of sharing how each team is scoring as the meet progresses."]
[]
[]
[]
[null,null,null,"Team Scores (Lowest to Highest)"]
["Team","School",null,"Score 1","Score 2","Score 3","Score 4","Score 5","Score 6","Score 7","Score 8\n(if applicable)"]
[1,{"$f":" 'Rank Wkst'!B57","v":""},null,{"$f":"'Rank Wkst'!K57","v":""},{"$f":"'Rank Wkst'!L57","v":""},{"$f":"'Rank Wkst'!M57","v":""},{"$f":"'Rank Wkst'!N57","v":""},{"$f":"'Rank Wkst'!O57","v":""},{"$f":"'Rank Wkst'!P57","v":""},{"$f":"'Rank Wkst'!Q57","v":""},{"$f":"'Rank Wkst'!R57","v":""}]
[2,{"$f":" 'Rank Wkst'!B58","v":""},null,{"$f":"'Rank Wkst'!K58","v":""},{"$f":"'Rank Wkst'!L58","v":""},{"$f":"'Rank Wkst'!M58","v":""},{"$f":"'Rank Wkst'!N58","v":""},{"$f":"'Rank Wkst'!O58","v":""},{"$f":"'Rank Wkst'!P58","v":""},{"$f":"'Rank Wkst'!Q58","v":""},{"$f":"'Rank Wkst'!R58","v":""}]
[3,{"$f":" 'Rank Wkst'!B59","v":""},null,{"$f":"'Rank Wkst'!K59","v":""},{"$f":"'Rank Wkst'!L59","v":""},{"$f":"'Rank Wkst'!M59","v":""},{"$f":"'Rank Wkst'!N59","v":""},{"$f":"'Rank Wkst'!O59","v":""},{"$f":"'Rank Wkst'!P59","v":""},{"$f":"'Rank Wkst'!Q59","v":""},{"$f":"'Rank Wkst'!R59","v":""}]
[4,{"$f":" 'Rank Wkst'!B60","v":""},null,{"$f":"'Rank Wkst'!K60","v":""},{"$f":"'Rank Wkst'!L60","v":""},{"$f":"'Rank Wkst'!M60","v":""},{"$f":"'Rank Wkst'!N60","v":""},{"$f":"'Rank Wkst'!O60","v":""},{"$f":"'Rank Wkst'!P60","v":""},{"$f":"'Rank Wkst'!Q60","v":""},{"$f":"'Rank Wkst'!R60","v":""}]
[5,{"$f":" 'Rank Wkst'!B61","v":""},null,{"$f":"'Rank Wkst'!K61","v":""},{"$f":"'Rank Wkst'!L61","v":""},{"$f":"'Rank Wkst'!M61","v":""},{"$f":"'Rank Wkst'!N61","v":""},{"$f":"'Rank Wkst'!O61","v":""},{"$f":"'Rank Wkst'!P61","v":""},{"$f":"'Rank Wkst'!Q61","v":""},{"$f":"'Rank Wkst'!R61","v":""}]
[6,{"$f":" 'Rank Wkst'!B62","v":""},null,{"$f":"'Rank Wkst'!K62","v":""},{"$f":"'Rank Wkst'!L62","v":""},{"$f":"'Rank Wkst'!M62","v":""},{"$f":"'Rank Wkst'!N62","v":""},{"$f":"'Rank Wkst'!O62","v":""},{"$f":"'Rank Wkst'!P62","v":""},{"$f":"'Rank Wkst'!Q62","v":""},{"$f":"'Rank Wkst'!R62","v":""}]
[7,{"$f":" 'Rank Wkst'!B63","v":""},null,{"$f":"'Rank Wkst'!K63","v":""},{"$f":"'Rank Wkst'!L63","v":""},{"$f":"'Rank Wkst'!M63","v":""},{"$f":"'Rank Wkst'!N63","v":""},{"$f":"'Rank Wkst'!O63","v":""},{"$f":"'Rank Wkst'!P63","v":""},{"$f":"'Rank Wkst'!Q63","v":""},{"$f":"'Rank Wkst'!R63","v":""}]
[8,{"$f":" 'Rank Wkst'!B64","v":""},null,{"$f":"'Rank Wkst'!K64","v":""},{"$f":"'Rank Wkst'!L64","v":""},{"$f":"'Rank Wkst'!M64","v":""},{"$f":"'Rank Wkst'!N64","v":""},{"$f":"'Rank Wkst'!O64","v":""},{"$f":"'Rank Wkst'!P64","v":""},{"$f":"'Rank Wkst'!Q64","v":""},{"$f":"'Rank Wkst'!R64","v":""}]
[9,{"$f":" 'Rank Wkst'!B65","v":""},null,{"$f":"'Rank Wkst'!K65","v":""},{"$f":"'Rank Wkst'!L65","v":""},{"$f":"'Rank Wkst'!M65","v":""},{"$f":"'Rank Wkst'!N65","v":""},{"$f":"'Rank Wkst'!O65","v":""},{"$f":"'Rank Wkst'!P65","v":""},{"$f":"'Rank Wkst'!Q65","v":""},{"$f":"'Rank Wkst'!R65","v":""}]
[10,{"$f":" 'Rank Wkst'!B66","v":""},null,{"$f":"'Rank Wkst'!K66","v":""},{"$f":"'Rank Wkst'!L66","v":""},{"$f":"'Rank Wkst'!M66","v":""},{"$f":"'Rank Wkst'!N66","v":""},{"$f":"'Rank Wkst'!O66","v":""},{"$f":"'Rank Wkst'!P66","v":""},{"$f":"'Rank Wkst'!Q66","v":""},{"$f":"'Rank Wkst'!R66","v":""}]
[11,{"$f":" 'Rank Wkst'!B67","v":""},null,{"$f":"'Rank Wkst'!K67","v":""},{"$f":"'Rank Wkst'!L67","v":""},{"$f":"'Rank Wkst'!M67","v":""},{"$f":"'Rank Wkst'!N67","v":""},{"$f":"'Rank Wkst'!O67","v":""},{"$f":"'Rank Wkst'!P67","v":""},{"$f":"'Rank Wkst'!Q67","v":""},{"$f":"'Rank Wkst'!R67","v":""}]
[12,{"$f":" 'Rank Wkst'!B68","v":""},null,{"$f":"'Rank Wkst'!K68","v":""},{"$f":"'Rank Wkst'!L68","v":""},{"$f":"'Rank Wkst'!M68","v":""},{"$f":"'Rank Wkst'!N68","v":""},{"$f":"'Rank Wkst'!O68","v":""},{"$f":"'Rank Wkst'!P68","v":""},{"$f":"'Rank Wkst'!Q68","v":""},{"$f":"'Rank Wkst'!R68","v":""}]
[13,{"$f":" 'Rank Wkst'!B69","v":""},null,{"$f":"'Rank Wkst'!K69","v":""},{"$f":"'Rank Wkst'!L69","v":""},{"$f":"'Rank Wkst'!M69","v":""},{"$f":"'Rank Wkst'!N69","v":""},{"$f":"'Rank Wkst'!O69","v":""},{"$f":"'Rank Wkst'!P69","v":""},{"$f":"'Rank Wkst'!Q69","v":""},{"$f":"'Rank Wkst'!R69","v":""}]
[14,{"$f":" 'Rank Wkst'!B70","v":""},null,{"$f":"'Rank Wkst'!K70","v":""},{"$f":"'Rank Wkst'!L70","v":""},{"$f":"'Rank Wkst'!M70","v":""},{"$f":"'Rank Wkst'!N70","v":""},{"$f":"'Rank Wkst'!O70","v":""},{"$f":"'Rank Wkst'!P70","v":""},{"$f":"'Rank Wkst'!Q70","v":""},{"$f":"'Rank Wkst'!R70","v":""}]
[15,{"$f":" 'Rank Wkst'!B71","v":""},null,{"$f":"'Rank Wkst'!K71","v":""},{"$f":"'Rank Wkst'!L71","v":""},{"$f":"'Rank Wkst'!M71","v":""},{"$f":"'Rank Wkst'!N71","v":""},{"$f":"'Rank Wkst'!O71","v":""},{"$f":"'Rank Wkst'!P71","v":""},{"$f":"'Rank Wkst'!Q71","v":""},{"$f":"'Rank Wkst'!R71","v":""}]
[16,{"$f":" 'Rank Wkst'!B72","v":""},null,{"$f":"'Rank Wkst'!K72","v":""},{"$f":"'Rank Wkst'!L72","v":""},{"$f":"'Rank Wkst'!M72","v":""},{"$f":"'Rank Wkst'!N72","v":""},{"$f":"'Rank Wkst'!O72","v":""},{"$f":"'Rank Wkst'!P72","v":""},{"$f":"'Rank Wkst'!Q72","v":""},{"$f":"'Rank Wkst'!R72","v":""}]
[17,{"$f":" 'Rank Wkst'!B73","v":""},null,{"$f":"'Rank Wkst'!K73","v":""},{"$f":"'Rank Wkst'!L73","v":""},{"$f":"'Rank Wkst'!M73","v":""},{"$f":"'Rank Wkst'!N73","v":""},{"$f":"'Rank Wkst'!O73","v":""},{"$f":"'Rank Wkst'!P73","v":""},{"$f":"'Rank Wkst'!Q73","v":""},{"$f":"'Rank Wkst'!R73","v":""}]
[18,{"$f":" 'Rank Wkst'!B74","v":""},null,{"$f":"'Rank Wkst'!K74","v":""},{"$f":"'Rank Wkst'!L74","v":""},{"$f":"'Rank Wkst'!M74","v":""},{"$f":"'Rank Wkst'!N74","v":""},{"$f":"'Rank Wkst'!O74","v":""},{"$f":"'Rank Wkst'!P74","v":""},{"$f":"'Rank Wkst'!Q74","v":""},{"$f":"'Rank Wkst'!R74","v":""}]
[19,{"$f":" 'Rank Wkst'!B75","v":""},null,{"$f":"'Rank Wkst'!K75","v":""},{"$f":"'Rank Wkst'!L75","v":""},{"$f":"'Rank Wkst'!M75","v":""},{"$f":"'Rank Wkst'!N75","v":""},{"$f":"'Rank Wkst'!O75","v":""},{"$f":"'Rank Wkst'!P75","v":""},{"$f":"'Rank Wkst'!Q75","v":""},{"$f":"'Rank Wkst'!R75","v":""}]
[20,{"$f":" 'Rank Wkst'!B76","v":""},null,{"$f":"'Rank Wkst'!K76","v":""},{"$f":"'Rank Wkst'!L76","v":""},{"$f":"'Rank Wkst'!M76","v":""},{"$f":"'Rank Wkst'!N76","v":""},{"$f":"'Rank Wkst'!O76","v":""},{"$f":"'Rank Wkst'!P76","v":""},{"$f":"'Rank Wkst'!Q76","v":""},{"$f":"'Rank Wkst'!R76","v":""}]
[21,{"$f":" 'Rank Wkst'!B77","v":""},null,{"$f":"'Rank Wkst'!K77","v":""},{"$f":"'Rank Wkst'!L77","v":""},{"$f":"'Rank Wkst'!M77","v":""},{"$f":"'Rank Wkst'!N77","v":""},{"$f":"'Rank Wkst'!O77","v":""},{"$f":"'Rank Wkst'!P77","v":""},{"$f":"'Rank Wkst'!Q77","v":""},{"$f":"'Rank Wkst'!R77","v":""}]
[22,{"$f":" 'Rank Wkst'!B78","v":""},null,{"$f":"'Rank Wkst'!K78","v":""},{"$f":"'Rank Wkst'!L78","v":""},{"$f":"'Rank Wkst'!M78","v":""},{"$f":"'Rank Wkst'!N78","v":""},{"$f":"'Rank Wkst'!O78","v":""},{"$f":"'Rank Wkst'!P78","v":""},{"$f":"'Rank Wkst'!Q78","v":""},{"$f":"'Rank Wkst'!R78","v":""}]
[23,{"$f":" 'Rank Wkst'!B79","v":""},null,{"$f":"'Rank Wkst'!K79","v":""},{"$f":"'Rank Wkst'!L79","v":""},{"$f":"'Rank Wkst'!M79","v":""},{"$f":"'Rank Wkst'!N79","v":""},{"$f":"'Rank Wkst'!O79","v":""},{"$f":"'Rank Wkst'!P79","v":""},{"$f":"'Rank Wkst'!Q79","v":""},{"$f":"'Rank Wkst'!R79","v":""}]
[24,{"$f":" 'Rank Wkst'!B80","v":""},null,{"$f":"'Rank Wkst'!K80","v":""},{"$f":"'Rank Wkst'!L80","v":""},{"$f":"'Rank Wkst'!M80","v":""},{"$f":"'Rank Wkst'!N80","v":""},{"$f":"'Rank Wkst'!O80","v":""},{"$f":"'Rank Wkst'!P80","v":""},{"$f":"'Rank Wkst'!Q80","v":""},{"$f":"'Rank Wkst'!R80","v":""}]

{"sheet":"Judges Names","index":37,"n_rows":16,"n_cols":4,"rows_kept":16,"cut":false,"hidden":false,"merged":[[1,1,1,3],[2,1,2,3],[5,2,5,3]]}
[]
[null,"Minnesota State High School League Dance Team Competition"]
[null,"Judges Initials and Names"]
[]
[null,"Meet Date:"]
[null,"Meet Site:"]
[]
[null,"Judge #","Judges Initials","Judge Name"]
[null,1]
[null,2]
[null,3]
[null,4]
[null,5]
[null,6]
[null,7]
[null,8]